Ticket #13372: efi-syslog.txt

File efi-syslog.txt, 216.6 KB (added by kallisti5, 2 years ago)
Line 
1KERN: options = 0
2KERN: APM version 0.0 available, flags 0.
3KERN: smp: using ACPI to detect MP configuration
4KERN: smp: local apic address is 0xfee00000
5KERN: smp: found local APIC with id 0
6KERN: smp: found io APIC with id 0 and address 0xfec00000
7KERN: VESA version = 3.0, capabilities 1
8KERN: OEM string: SeaBIOS VBE(C) 2011
9KERN:  0x100: 640 x 400 x 8 (a = 187, mem = 4, phy = fd000000, p = 1, b = 1)
10KERN:   mask: r: 0 0 g: 0 0 b: 0 0 dcmi: 0
11KERN:  0x101: 640 x 480 x 8 (a = 187, mem = 4, phy = fd000000, p = 1, b = 1)
12KERN:   mask: r: 0 0 g: 0 0 b: 0 0 dcmi: 0
13KERN:  0x102: 800 x 600 x 4 (a = 59, mem = 3, phy = 0, p = 4, b = 1)
14KERN:   mask: r: 0 0 g: 0 0 b: 0 0 dcmi: 0
15KERN:  0x103: 800 x 600 x 8 (a = 187, mem = 4, phy = fd000000, p = 1, b = 1)
16KERN:   mask: r: 0 0 g: 0 0 b: 0 0 dcmi: 0
17KERN:  0x104: 1024 x 768 x 4 (a = 59, mem = 3, phy = 0, p = 4, b = 1)
18KERN:   mask: r: 0 0 g: 0 0 b: 0 0 dcmi: 0
19KERN:  0x105: 1024 x 768 x 8 (a = 187, mem = 4, phy = fd000000, p = 1, b = 1)
20KERN:   mask: r: 0 0 g: 0 0 b: 0 0 dcmi: 0
21KERN:  0x106: 1280 x 1024 x 4 (a = 59, mem = 3, phy = 0, p = 4, b = 1)
22KERN:   mask: r: 0 0 g: 0 0 b: 0 0 dcmi: 0
23KERN:  0x107: 1280 x 1024 x 8 (a = 187, mem = 4, phy = fd000000, p = 1, b = 1)
24KERN:   mask: r: 0 0 g: 0 0 b: 0 0 dcmi: 0
25KERN:  0x10d: 320 x 200 x 15 (a = 187, mem = 6, phy = fd000000, p = 1, b = 1)
26KERN:   mask: r: 5 10 g: 5 5 b: 5 0 dcmi: 0
27KERN:  0x10e: 320 x 200 x 16 (a = 187, mem = 6, phy = fd000000, p = 1, b = 1)
28KERN:   mask: r: 5 11 g: 6 5 b: 5 0 dcmi: 0
29KERN:  0x10f: 320 x 200 x 24 (a = 187, mem = 6, phy = fd000000, p = 1, b = 1)
30KERN:   mask: r: 8 16 g: 8 8 b: 8 0 dcmi: 0
31KERN:  0x110: 640 x 480 x 15 (a = 187, mem = 6, phy = fd000000, p = 1, b = 1)
32KERN:   mask: r: 5 10 g: 5 5 b: 5 0 dcmi: 0
33KERN:  0x111: 640 x 480 x 16 (a = 187, mem = 6, phy = fd000000, p = 1, b = 1)
34KERN:   mask: r: 5 11 g: 6 5 b: 5 0 dcmi: 0
35KERN:  0x112: 640 x 480 x 24 (a = 187, mem = 6, phy = fd000000, p = 1, b = 1)
36KERN:   mask: r: 8 16 g: 8 8 b: 8 0 dcmi: 0
37KERN:  0x113: 800 x 600 x 15 (a = 187, mem = 6, phy = fd000000, p = 1, b = 1)
38KERN:   mask: r: 5 10 g: 5 5 b: 5 0 dcmi: 0
39KERN:  0x114: 800 x 600 x 16 (a = 187, mem = 6, phy = fd000000, p = 1, b = 1)
40KERN:   mask: r: 5 11 g: 6 5 b: 5 0 dcmi: 0
41KERN:  0x115: 800 x 600 x 24 (a = 187, mem = 6, phy = fd000000, p = 1, b = 1)
42KERN:   mask: r: 8 16 g: 8 8 b: 8 0 dcmi: 0
43KERN:  0x116: 1024 x 768 x 15 (a = 187, mem = 6, phy = fd000000, p = 1, b = 1)
44KERN:   mask: r: 5 10 g: 5 5 b: 5 0 dcmi: 0
45KERN:  0x117: 1024 x 768 x 16 (a = 187, mem = 6, phy = fd000000, p = 1, b = 1)
46KERN:   mask: r: 5 11 g: 6 5 b: 5 0 dcmi: 0
47KERN:  0x118: 1024 x 768 x 24 (a = 187, mem = 6, phy = fd000000, p = 1, b = 1)
48KERN:   mask: r: 8 16 g: 8 8 b: 8 0 dcmi: 0
49KERN:  0x119: 1280 x 1024 x 15 (a = 187, mem = 6, phy = fd000000, p = 1, b = 1)
50KERN:   mask: r: 5 10 g: 5 5 b: 5 0 dcmi: 0
51KERN:  0x11a: 1280 x 1024 x 16 (a = 187, mem = 6, phy = fd000000, p = 1, b = 1)
52KERN:   mask: r: 5 11 g: 6 5 b: 5 0 dcmi: 0
53KERN:  0x11b: 1280 x 1024 x 24 (a = 187, mem = 6, phy = fd000000, p = 1, b = 1)
54KERN:   mask: r: 8 16 g: 8 8 b: 8 0 dcmi: 0
55KERN:  0x11c: 1600 x 1200 x 8 (a = 187, mem = 4, phy = fd000000, p = 1, b = 1)
56KERN:   mask: r: 0 0 g: 0 0 b: 0 0 dcmi: 0
57KERN:  0x11d: 1600 x 1200 x 15 (a = 187, mem = 6, phy = fd000000, p = 1, b = 1)
58KERN:   mask: r: 5 10 g: 5 5 b: 5 0 dcmi: 0
59KERN:  0x11e: 1600 x 1200 x 16 (a = 187, mem = 6, phy = fd000000, p = 1, b = 1)
60KERN:   mask: r: 5 11 g: 6 5 b: 5 0 dcmi: 0
61KERN:  0x11f: 1600 x 1200 x 24 (a = 187, mem = 6, phy = fd000000, p = 1, b = 1)
62KERN:   mask: r: 8 16 g: 8 8 b: 8 0 dcmi: 0
63KERN:  0x140: 320 x 200 x 32 (a = 187, mem = 6, phy = fd000000, p = 1, b = 1)
64KERN:   mask: r: 8 16 g: 8 8 b: 8 0 dcmi: 2
65KERN:  0x141: 640 x 400 x 32 (a = 187, mem = 6, phy = fd000000, p = 1, b = 1)
66KERN:   mask: r: 8 16 g: 8 8 b: 8 0 dcmi: 2
67KERN:  0x142: 640 x 480 x 32 (a = 187, mem = 6, phy = fd000000, p = 1, b = 1)
68KERN:   mask: r: 8 16 g: 8 8 b: 8 0 dcmi: 2
69KERN:  0x143: 800 x 600 x 32 (a = 187, mem = 6, phy = fd000000, p = 1, b = 1)
70KERN:   mask: r: 8 16 g: 8 8 b: 8 0 dcmi: 2
71KERN:  0x144: 1024 x 768 x 32 (a = 187, mem = 6, phy = fd000000, p = 1, b = 1)
72KERN:   mask: r: 8 16 g: 8 8 b: 8 0 dcmi: 2
73KERN:  0x145: 1280 x 1024 x 32 (a = 187, mem = 6, phy = fd000000, p = 1, b = 1)
74KERN:   mask: r: 8 16 g: 8 8 b: 8 0 dcmi: 2
75KERN:  0x146: 320 x 200 x 8 (a = 187, mem = 4, phy = fd000000, p = 1, b = 1)
76KERN:   mask: r: 0 0 g: 0 0 b: 0 0 dcmi: 0
77KERN:  0x147: 1600 x 1200 x 32 (a = 187, mem = 6, phy = fd000000, p = 1, b = 1)
78KERN:   mask: r: 8 16 g: 8 8 b: 8 0 dcmi: 2
79KERN:  0x148: 1152 x 864 x 8 (a = 187, mem = 4, phy = fd000000, p = 1, b = 1)
80KERN:   mask: r: 0 0 g: 0 0 b: 0 0 dcmi: 0
81KERN:  0x149: 1152 x 864 x 15 (a = 187, mem = 6, phy = fd000000, p = 1, b = 1)
82KERN:   mask: r: 5 10 g: 5 5 b: 5 0 dcmi: 0
83KERN:  0x14a: 1152 x 864 x 16 (a = 187, mem = 6, phy = fd000000, p = 1, b = 1)
84KERN:   mask: r: 5 11 g: 6 5 b: 5 0 dcmi: 0
85KERN:  0x14b: 1152 x 864 x 24 (a = 187, mem = 6, phy = fd000000, p = 1, b = 1)
86KERN:   mask: r: 8 16 g: 8 8 b: 8 0 dcmi: 0
87KERN:  0x14c: 1152 x 864 x 32 (a = 187, mem = 6, phy = fd000000, p = 1, b = 1)
88KERN:   mask: r: 8 16 g: 8 8 b: 8 0 dcmi: 2
89KERN:  0x175: 1280 x 768 x 16 (a = 187, mem = 6, phy = fd000000, p = 1, b = 1)
90KERN:   mask: r: 5 11 g: 6 5 b: 5 0 dcmi: 0
91KERN:  0x176: 1280 x 768 x 24 (a = 187, mem = 6, phy = fd000000, p = 1, b = 1)
92KERN:   mask: r: 8 16 g: 8 8 b: 8 0 dcmi: 0
93KERN:  0x177: 1280 x 768 x 32 (a = 187, mem = 6, phy = fd000000, p = 1, b = 1)
94KERN:   mask: r: 8 16 g: 8 8 b: 8 0 dcmi: 2
95KERN:  0x178: 1280 x 800 x 16 (a = 187, mem = 6, phy = fd000000, p = 1, b = 1)
96KERN:   mask: r: 5 11 g: 6 5 b: 5 0 dcmi: 0
97KERN:  0x179: 1280 x 800 x 24 (a = 187, mem = 6, phy = fd000000, p = 1, b = 1)
98KERN:   mask: r: 8 16 g: 8 8 b: 8 0 dcmi: 0
99KERN:  0x17a: 1280 x 800 x 32 (a = 187, mem = 6, phy = fd000000, p = 1, b = 1)
100KERN:   mask: r: 8 16 g: 8 8 b: 8 0 dcmi: 2
101KERN:  0x17b: 1280 x 960 x 16 (a = 187, mem = 6, phy = fd000000, p = 1, b = 1)
102KERN:   mask: r: 5 11 g: 6 5 b: 5 0 dcmi: 0
103KERN:  0x17c: 1280 x 960 x 24 (a = 187, mem = 6, phy = fd000000, p = 1, b = 1)
104KERN:   mask: r: 8 16 g: 8 8 b: 8 0 dcmi: 0
105KERN:  0x17d: 1280 x 960 x 32 (a = 187, mem = 6, phy = fd000000, p = 1, b = 1)
106KERN:   mask: r: 8 16 g: 8 8 b: 8 0 dcmi: 2
107KERN:  0x17e: 1440 x 900 x 16 (a = 187, mem = 6, phy = fd000000, p = 1, b = 1)
108KERN:   mask: r: 5 11 g: 6 5 b: 5 0 dcmi: 0
109KERN:  0x17f: 1440 x 900 x 24 (a = 187, mem = 6, phy = fd000000, p = 1, b = 1)
110KERN:   mask: r: 8 16 g: 8 8 b: 8 0 dcmi: 0
111KERN:  0x180: 1440 x 900 x 32 (a = 187, mem = 6, phy = fd000000, p = 1, b = 1)
112KERN:   mask: r: 8 16 g: 8 8 b: 8 0 dcmi: 2
113KERN:  0x181: 1400 x 1050 x 16 (a = 187, mem = 6, phy = fd000000, p = 1, b = 1)
114KERN:   mask: r: 5 11 g: 6 5 b: 5 0 dcmi: 0
115KERN:  0x182: 1400 x 1050 x 24 (a = 187, mem = 6, phy = fd000000, p = 1, b = 1)
116KERN:   mask: r: 8 16 g: 8 8 b: 8 0 dcmi: 0
117KERN:  0x183: 1400 x 1050 x 32 (a = 187, mem = 6, phy = fd000000, p = 1, b = 1)
118KERN:   mask: r: 8 16 g: 8 8 b: 8 0 dcmi: 2
119KERN:  0x184: 1680 x 1050 x 16 (a = 187, mem = 6, phy = fd000000, p = 1, b = 1)
120KERN:   mask: r: 5 11 g: 6 5 b: 5 0 dcmi: 0
121KERN:  0x185: 1680 x 1050 x 24 (a = 187, mem = 6, phy = fd000000, p = 1, b = 1)
122KERN:   mask: r: 8 16 g: 8 8 b: 8 0 dcmi: 0
123KERN:  0x186: 1680 x 1050 x 32 (a = 187, mem = 6, phy = fd000000, p = 1, b = 1)
124KERN:   mask: r: 8 16 g: 8 8 b: 8 0 dcmi: 2
125KERN:  0x187: 1920 x 1200 x 16 (a = 187, mem = 6, phy = fd000000, p = 1, b = 1)
126KERN:   mask: r: 5 11 g: 6 5 b: 5 0 dcmi: 0
127KERN:  0x188: 1920 x 1200 x 24 (a = 187, mem = 6, phy = fd000000, p = 1, b = 1)
128KERN:   mask: r: 8 16 g: 8 8 b: 8 0 dcmi: 0
129KERN:  0x189: 1920 x 1200 x 32 (a = 187, mem = 6, phy = fd000000, p = 1, b = 1)
130KERN:   mask: r: 8 16 g: 8 8 b: 8 0 dcmi: 2
131KERN:  0x18a: 2560 x 1600 x 16 (a = 187, mem = 6, phy = fd000000, p = 1, b = 1)
132KERN:   mask: r: 5 11 g: 6 5 b: 5 0 dcmi: 0
133KERN:  0x18b: 2560 x 1600 x 24 (a = 187, mem = 6, phy = fd000000, p = 1, b = 1)
134KERN:   mask: r: 8 16 g: 8 8 b: 8 0 dcmi: 0
135KERN:  0x18c: 2560 x 1600 x 32 (a = 187, mem = 6, phy = fd000000, p = 1, b = 1)
136KERN:   mask: r: 8 16 g: 8 8 b: 8 0 dcmi: 2
137KERN:  0x18d: 1280 x 720 x 16 (a = 187, mem = 6, phy = fd000000, p = 1, b = 1)
138KERN:   mask: r: 5 11 g: 6 5 b: 5 0 dcmi: 0
139KERN:  0x18e: 1280 x 720 x 24 (a = 187, mem = 6, phy = fd000000, p = 1, b = 1)
140KERN:   mask: r: 8 16 g: 8 8 b: 8 0 dcmi: 0
141KERN:  0x18f: 1280 x 720 x 32 (a = 187, mem = 6, phy = fd000000, p = 1, b = 1)
142KERN:   mask: r: 8 16 g: 8 8 b: 8 0 dcmi: 2
143KERN:  0x190: 1920 x 1080 x 16 (a = 187, mem = 6, phy = fd000000, p = 1, b = 1)
144KERN:   mask: r: 5 11 g: 6 5 b: 5 0 dcmi: 0
145KERN:  0x191: 1920 x 1080 x 24 (a = 187, mem = 6, phy = fd000000, p = 1, b = 1)
146KERN:   mask: r: 8 16 g: 8 8 b: 8 0 dcmi: 0
147KERN:  0x192: 1920 x 1080 x 32 (a = 187, mem = 6, phy = fd000000, p = 1, b = 1)
148KERN:   mask: r: 8 16 g: 8 8 b: 8 0 dcmi: 2
149KERN:  0x000: 40 x 25 x 4 (a = 47, mem = 0, phy = 0, p = 1, b = 1)
150KERN:   mask: r: 0 0 g: 0 0 b: 0 0 dcmi: 0
151KERN:  0x001: 40 x 25 x 4 (a = 47, mem = 0, phy = 0, p = 1, b = 1)
152KERN:   mask: r: 0 0 g: 0 0 b: 0 0 dcmi: 0
153KERN:  0x002: KERN: 80 x 25 x 4 (a = 47, mem = 0, phy = 0, p = 1, b = 1)
154KERN:   mask: r: 0 0 g: 0 0 b: 0 0 dcmi: 0
155KERN:  0x003: 80 x 25 x 4 (a = 47, mem = 0, phy = 0, p = 1, b = 1)
156KERN:   mask: r: 0 0 g: 0 0 b: 0 0 dcmi: 0
157KERN:  0x004: 320 x 200 x 2 (a = 59, mem = 1, phy = 0, p = 1, b = 2)
158KERN:   mask: r: 0 0 g: 0 0 b: 0 0 dcmi: 0
159KERN:  0x005: 320 x 200 x 2 (a = 59, mem = 1, phy = 0, p = 1, b = 2)
160KERN:   mask: r: 0 0 g: 0 0 b: 0 0 dcmi: 0
161KERN:  0x006: 640 x 200 x 1 (a = 59, mem = 1, phy = 0, p = 1, b = 2)
162KERN:   mask: r: 0 0 g: 0 0 b: 0 0 dcmi: 0
163KERN:  0x007: 80 x 25 x 4 (a = 39, mem = 0, phy = 0, p = 1, b = 1)
164KERN:   mask: r: 0 0 g: 0 0 b: 0 0 dcmi: 0
165KERN:  0x00d: 320 x 200 x 4 (a = 59, mem = 3, phy = 0, p = 4, b = 1)
166KERN:   mask: r: 0 0 g: 0 0 b: 0 0 dcmi: 0
167KERN:  0x00e: 640 x 200 x 4 (a = 59, mem = 3, phy = 0, p = 4, b = 1)
168KERN:   mask: r: 0 0 g: 0 0 b: 0 0 dcmi: 0
169KERN:  0x00f: 640 x 350 x 1 (a = 59, mem = 3, phy = 0, p = 4, b = 1)
170KERN:   mask: r: 0 0 g: 0 0 b: 0 0 dcmi: 0
171KERN:  0x010: 640 x 350 x 4 (a = 59, mem = 3, phy = 0, p = 4, b = 1)
172KERN:   mask: r: 0 0 g: 0 0 b: 0 0 dcmi: 0
173KERN:  0x011: 640 x 480 x 1 (a = 59, mem = 3, phy = 0, p = 4, b = 1)
174KERN:   mask: r: 0 0 g: 0 0 b: 0 0 dcmi: 0
175KERN:  0x012: 640 x 480 x 4 (a = 59, mem = 3, phy = 0, p = 4, b = 1)
176KERN:   mask: r: 0 0 g: 0 0 b: 0 0 dcmi: 0
177KERN:  0x013: 320 x 200 x 8 (a = 187, mem = 4, phy = fd000000, p = 1, b = 1)
178KERN:   mask: r: 0 0 g: 0 0 b: 0 0 dcmi: 0
179KERN:  0x06a: 800 x 600 x 4 (a = 59, mem = 3, phy = 0, p = 4, b = 1)
180KERN:   mask: r: 0 0 g: 0 0 b: 0 0 dcmi: 0
181KERN: Using mode 0x144
182KERN: VESA compatible graphics!
183KERN: EDID1: 100
184KERN: Welcome to the Haiku boot loader!
185KERN: number of drives: 1
186KERN: add_partitions_for(0x001058f8, mountFS = no)
187KERN: add_partitions_for(fd = 0, mountFS = no)
188KERN: 0x00105b20 Partition::Partition
189KERN: 0x00105b20 Partition::Scan()
190KERN: boot partition offset: 0
191KERN: 0x00105b20 Partition::_Mount check for file_system: TAR Filesystem
192KERN: PackageVolumeInfo::SetTo()
193KERN: PackageVolumeInfo::SetTo(): failed to open packages directory: No such file or directory
194KERN: load kernel kernel_x86_64...
195KERN: video mode: 1024x768x32
196KERN: maximum boot loader heap usage: 15840, currently used: 8968
197KERN: smp: found 1 cpu
198KERN: smp: apic_phys = 0xfee00000
199KERN: smp: ioapic_phys = 0xfec00000
200KERN: smp: apic (mapped) = 0x820dc000
201KERN: APIC ticks/sec = 995860640
202KERN: GDT at 0x5b860
203KERN: phys memory ranges:
204KERN:     base 0x0000000000100000, length 0x000000007fee0000
205KERN: allocated phys memory ranges:
206KERN:     base 0x0000000000100000, length 0x000000000102b000
207KERN:     base 0x0000000003f00000, length 0x0000000000100000
208KERN: allocated virt memory ranges:
209KERN:     base 0xffffffff80000000, length 0x00000000020de000
210KERN: kernel args ranges:
211KERN:     base 0xffffffff81109000, length 0x0000000000010000
212KERN:     base 0xffffffff81919000, length 0x0000000000058000
213KERN:     base 0xffffffff81c71000, length 0x0000000000013000
214KERN:     base 0xffffffff81cda000, length 0x0000000000019000
215KERN:     base 0xffffffff81edb000, length 0x0000000000010000
216KERN:     base 0xffffffff81f3a000, length 0x0000000000010000
217KERN:     base 0xffffffff81f81000, length 0x0000000000010000
218KERN:     base 0xffffffff81fff000, length 0x0000000000010000
219KERN:     base 0xffffffff8209a000, length 0x0000000000028000
220KERN:     base 0xffffffff820cc000, length 0x0000000000010000
221KERN: kernel entry at 0xffffffff80060ef0
222KERN: Welcome to kernel debugger output!
223KERN: Haiku revision: hrev51008
224KERN: CPU 0: type 0 family 6 extended_family 0 model 6 extended_model 0 stepping 3, string 'GenuineIntel'
225KERN: CPU 0: vendor 'Intel' model name 'QEMU Virtual CPU version 2.5+'
226KERN: No CPU topology information available.
227KERN: CPU 0: apic id 0, package 0, core 0, smt 0
228KERN: CPU 0: features: fpu de pse tsc msr pae mce cx8 apic sep mtrr pge mca cmov pat pse36 clfsh mmx fxsr sse sse2 sse3 cx16 x2apic hypervisor syscall nx long
229KERN: reserve_io_interrupt_vectors: reserved 16 vectors starting from 0
230KERN: mark_page_range_in_use(0x0, 0x100): start page is before free list
231KERN: mark_page_range_in_use(0x0, 0xa0): start page is before free list
232KERN: add_memory_type_range(3, 0x0, 0xa0000, 6)
233KERN: add_memory_type_range(82, 0xfd000000, 0x300000, 0)
234KERN: <DROP>Welcome to syslog debug output!
235KERN: Haiku revision: hrev51008
236KERN: found x2apic
237KERN: mapping local apic at 0xffffffff820dc000
238KERN: add_memory_type_range(85, 0xfee00000, 0x1000, 0)
239KERN: setting up apic for CPU 0: apic id 0, version 17104916
240KERN: CPU 0: logical apic id: 0x1
241KERN: x86_init_fpu: CPU has SSE... enabling FXSR and XMM.
242KERN: reserve_io_interrupt_vectors: reserved 1 vectors starting from 219
243KERN: arch_init_timer: using APIC timer.
244KERN: allocate_commpage_entry(2, 16) -> 0x0000000000000200
245KERN: scheduler_init: found 1 logical cpu and 0 cache levels
246KERN: scheduler switches: single core: true, cpu load tracking: false, core load tracking: false
247KERN: scheduler: switching to low latency mode
248KERN: msi support enabled
249KERN: PCI: pci_module_init
250KERN: add_memory_type_range(91, 0x0, 0x1000, 0)
251KERN: remove_memory_type_range(91, 0x0, 0x1000, 0)
252KERN: add_memory_type_range(92, 0x9f000, 0x1000, 0)
253KERN: remove_memory_type_range(92, 0x9f000, 0x1000, 0)
254KERN: add_memory_type_range(93, 0xe0000, 0x20000, 0)
255KERN: add_memory_type_range(94, 0x7ffe1000, 0x1000, 0)
256KERN: remove_memory_type_range(94, 0x7ffe1000, 0x1000, 0)
257KERN: add_memory_type_range(95, 0x7ffe1000, 0x1000, 0)
258KERN: remove_memory_type_range(93, 0xe0000, 0x20000, 0)
259KERN: add_memory_type_range(96, 0x7ffe1000, 0x1000, 0)
260KERN: remove_memory_type_range(96, 0x7ffe1000, 0x1000, 0)
261KERN: add_memory_type_range(97, 0x7ffe1000, 0x1000, 0)
262KERN: remove_memory_type_range(97, 0x7ffe1000, 0x1000, 0)
263KERN: add_memory_type_range(98, 0x7ffe1000, 0x1000, 0)
264KERN: remove_memory_type_range(98, 0x7ffe1000, 0x1000, 0)
265KERN: PCI: mechanism 1 controller found
266KERN: PCI: [dom 0, bus  0] bus   0, device  0, function  0: vendor 8086, device 1237, revision 02
267KERN: PCI:   class_base 06, class_function 00, class_api 00
268KERN: PCI:   vendor 8086: Intel Corporation
269KERN: PCI:   device 1237: 440FX - 82441FX PMC [Natoma] (Qemu virtual machine)
270KERN: PCI:   info: Bridge (Host bridge)
271KERN: PCI:   line_size 00, latency 00, header_type 00, BIST 00
272KERN: PCI:   ROM base host 00000000, pci 00000000, size 00000000
273KERN: PCI:   cardbus_CIS 00000000, subsystem_id 1100, subsystem_vendor_id 1af4
274KERN: PCI:   interrupt_line 00, interrupt_pin 00, min_grant 00, max_latency 00
275KERN: PCI:   base reg 0: host 00000000, pci 00000000, size 00000000, flags 00
276KERN: PCI:   base reg 1: host 00000000, pci 00000000, size 00000000, flags 00
277KERN: PCI:   base reg 2: host 00000000, pci 00000000, size 00000000, flags 00
278KERN: PCI:   base reg 3: host 00000000, pci 00000000, size 00000000, flags 00
279KERN: PCI:   base reg 4: host 00000000, pci 00000000, size 00000000, flags 00
280KERN: PCI:   base reg 5: host 00000000, pci 00000000, size 00000000, flags 00
281KERN: PCI:   Capabilities: (not supported)
282KERN: PCI: [dom 0, bus  0] bus   0, device  1, function  0: vendor 8086, device 7000, revision 00
283KERN: PCI:   class_base 06, class_function 01, class_api 00
284KERN: PCI:   vendor 8086: Intel Corporation
285KERN: PCI:   device 7000: 82371SB PIIX3 ISA [Natoma/Triton II] (Qemu virtual machine)
286KERN: PCI:   info: Bridge (ISA bridge)
287KERN: PCI:   line_size 00, latency 00, header_type 80, BIST 00
288KERN: PCI:   ROM base host 00000000, pci 00000000, size 00000000
289KERN: PCI:   cardbus_CIS 00000000, subsystem_id 1100, subsystem_vendor_id 1af4
290KERN: PCI:   interrupt_line 00, interrupt_pin 00, min_grant 00, max_latency 00
291KERN: PCI:   base reg 0: host 00000000, pci 00000000, size 00000000, flags 00
292KERN: PCI:   base reg 1: host 00000000, pci 00000000, size 00000000, flags 00
293KERN: PCI:   base reg 2: host 00000000, pci 00000000, size 00000000, flags 00
294KERN: PCI:   base reg 3: host 00000000, pci 00000000, size 00000000, flags 00
295KERN: PCI:   base reg 4: host 00000000, pci 00000000, size 00000000, flags 00
296KERN: PCI:   base reg 5: host 00000000, pci 00000000, size 00000000, flags 00
297KERN: PCI:   Capabilities: (not supported)
298KERN: PCI: [dom 0, bus  0] bus   0, device  1, function  1: vendor 8086, device 7010, revision 00
299KERN: PCI:   class_base 01, class_function 01, class_api 80
300KERN: PCI:   vendor 8086: Intel Corporation
301KERN: PCI:   device 7010: 82371SB PIIX3 IDE [Natoma/Triton II] (Qemu virtual machine)
302KERN: PCI:   info: Mass storage controller (IDE interface)
303KERN: PCI:   line_size 00, latency 00, header_type 00, BIST 00
304KERN: PCI:   ROM base host 00000000, pci 00000000, size 00000000
305KERN: PCI:   cardbus_CIS 00000000, subsystem_id 1100, subsystem_vendor_id 1af4
306KERN: PCI:   interrupt_line 00, interrupt_pin 00, min_grant 00, max_latency 00
307KERN: PCI:   base reg 0: host 00000000, pci 00000000, size 00000000, flags 00
308KERN: PCI:   base reg 1: host 00000000, pci 00000000, size 00000000, flags 00
309KERN: PCI:   base reg 2: host 00000000, pci 00000000, size 00000000, flags 00
310KERN: PCI:   base reg 3: host 00000000, pci 00000000, size 00000000, flags 00
311KERN: PCI:   base rKERN: eg 4: host 0000c040, pci 0000c040, size 00000010, flags 01
312KERN: PCI:   base reg 5: host 00000000, pci 00000000, size 00000000, flags 00
313KERN: PCI:   Capabilities: (not supported)
314KERN: PCI: [dom 0, bus  0] bus   0, device  1, function  3: vendor 8086, device 7113, revision 03
315KERN: PCI:   class_base 06, class_function 80, class_api 00
316KERN: PCI:   vendor 8086: Intel Corporation
317KERN: PCI:   device 7113: 82371AB/EB/MB PIIX4 ACPI (Qemu virtual machine)
318KERN: PCI:   info: Bridge
319KERN: PCI:   line_size 00, latency 00, header_type 00, BIST 00
320KERN: PCI:   ROM base host 00000000, pci 00000000, size 00000000
321KERN: PCI:   cardbus_CIS 00000000, subsystem_id 1100, subsystem_vendor_id 1af4
322KERN: PCI:   interrupt_line 09, interrupt_pin 01, min_grant 00, max_latency 00
323KERN: PCI:   base reg 0: host 00000000, pci 00000000, size 00000000, flags 00
324KERN: PCI:   base reg 1: host 00000000, pci 00000000, size 00000000, flags 00
325KERN: PCI:   base reg 2: host 00000000, pci 00000000, size 00000000, flags 00
326KERN: PCI:   base reg 3: host 00000000, pci 00000000, size 00000000, flags 00
327KERN: PCI:   base reg 4: host 00000000, pci 00000000, size 00000000, flags 00
328KERN: PCI:   base reg 5: host 00000000, pci 00000000, size 00000000, flags 00
329KERN: PCI:   Capabilities: (not supported)
330KERN: PCI: [dom 0, bus  0] bus   0, device  2, function  0: vendor 1234, device 1111, revision 02
331KERN: PCI:   class_base 03, class_function 00, class_api 00
332KERN: PCI:   vendor 1234: Unknown
333KERN: PCI:   device 1111: Unknown
334KERN: PCI:   info: Display controller (VGA compatible controller, VGA controller)
335KERN: PCI:   line_size 00, latency 00, header_type 00, BIST 00
336KERN: PCI:   ROM base host febe0000, pci febe0000, size 00010000
337KERN: PCI:   cardbus_CIS 00000000, subsystem_id 1100, subsystem_vendor_id 1af4
338KERN: PCI:   interrupt_line 00, interrupt_pin 00, min_grant 00, max_latency 00
339KERN: PCI:   base reg 0: host fd000000, pci fd000000, size 01000000, flags 08
340KERN: PCI:   base reg 1: host 00000000, pci 00000000, size 00000000, flags 00
341KERN: PCI:   base reg 2: host febf0000, pci febf0000, size 00001000, flags 00
342KERN: PCI:   base reg 3: host 00000000, pci 00000000, size 00000000, flags 00
343KERN: PCI:   base reg 4: host 00000000, pci 00000000, size 00000000, flags 00
344KERN: PCI:   base reg 5: host 00000000, pci 00000000, size 00000000, flags 00
345KERN: PCI:   Capabilities: (not supported)
346KERN: PCI: [dom 0, bus  0] bus   0, device  3, function  0: vendor 8086, device 100e, revision 03
347KERN: PCI:   class_base 02, class_function 00, class_api 00
348KERN: PCI:   vendor 8086: Intel Corporation
349KERN: PCI:   device 100e: 82540EM Gigabit Ethernet Controller (QEMU Virtual Machine)
350KERN: PCI:   info: Network controller (Ethernet controller)
351KERN: PCI:   line_size 00, latency 00, header_type 00, BIST 00
352KERN: PCI:   ROM base host feb80000, pci feb80000, size 00040000
353KERN: PCI:   cardbus_CIS 00000000, subsystem_id 1100, subsystem_vendor_id 1af4
354KERN: PCI:   interrupt_line 0b, interrupt_pin 01, min_grant 00, max_latency 00
355KERN: PCI:   base reg 0: host febc0000, pci febc0000, size 00020000, flags 00
356KERN: PCI:   base reg 1: host 0000c000, pci 0000c000, size 00000040, flags 01
357KERN: PCI:   base reg 2: host 00000000, pci 00000000, size 00000000, flags 00
358KERN: PCI:   base reg 3: host 00000000, pci 00000000, size 00000000, flags 00
359KERN: PCI:   base reg 4: host 00000000, pci 00000000, size 00000000, flags 00
360KERN: PCI:   base reg 5: host 00000000, pci 00000000, size 00000000, flags 00
361KERN: PCI:   Capabilities: (not supported)
362KERN: add_memory_type_range(100, 0x0, 0x1000, 0)
363KERN: remove_memory_type_range(100, 0x0, 0x1000, 0)
364KERN: add_memory_type_range(101, 0x9f000, 0x1000, 0)
365KERN: remove_memory_type_range(101, 0x9f000, 0x1000, 0)
366KERN: add_memory_type_range(102, 0xe0000, 0x20000, 0)
367KERN: remove_memory_type_range(102, 0xe0000, 0x20000, 0)
368KERN: add_memory_type_range(103, 0xf6000, 0x1000, 0)
369KERN: ACPI: RSDP 0x00000000000F69D0 000014 (v00 BOCHS )
370KERN: remove_memory_type_range(103, 0xf6000, 0x1000, 0)
371KERN: add_memory_type_range(104, 0x7ffe1000, 0x1000, 0)
372KERN: ACPI: RSDT 0x000000007FFE18DC 000030 (v01 BOCHS  BXPCRSDT 00000001 BXPC 00000001)
373KERN: remove_memory_type_range(104, 0x7ffe1000, 0x1000, 0)
374KERN: add_memory_type_range(105, 0x7ffe1000, 0x1000, 0)
375KERN: add_memory_type_range(106, 0x7ffe1000, 0x1000, 0)
376KERN: remove_memory_type_range(106, 0x7ffe1000, 0x1000, 0)
377KERN: add_memory_type_range(107, 0x7ffe1000, 0x1000, 0)
378KERN: ACPI: FACP 0x000000007FFE17B8 000074 (v01 BOCHS  BXPCFACP 00000001 BXPC 00000001)
379KERN: remove_memory_type_range(107, 0x7ffe1000, 0x1000, 0)
380KERN: add_memory_type_range(108, 0x7ffe1000, 0x1000, 0)
381KERN: remove_memory_type_range(108, 0x7ffe1000, 0x1000, 0)
382KERN: add_memory_type_range(109, 0x7ffe0000, 0x1000, 0)
383KERN: remove_memory_type_range(109, 0x7ffe0000, 0x1000, 0)
384KERN: add_memory_type_range(110, 0x7ffe0000, 0x2000, 0)
385KERN: ACPI: DSDT 0x000000007FFE0040 001778 (v01 BOCHS  BXPCDSDT 00000001 BXPC 00000001)
386KERN: remove_memory_type_range(110, 0x7ffe0000, 0x2000, 0)
387KERN: add_memory_type_range(111, 0x7ffe0000, 0x1000, 0)
388KERN: remove_memory_type_range(111, 0x7ffe0000, 0x1000, 0)
389KERN: add_memory_type_range(112, 0x7ffe0000, 0x1000, 0)
390KERN: ACPI: FACS 0x000000007FFE0000 000040
391KERN: remove_memory_type_range(112, 0x7ffe0000, 0x1000, 0)
392KERN: add_memory_type_range(113, 0x7ffe1000, 0x1000, 0)
393KERN: remove_memory_type_range(113, 0x7ffe1000, 0x1000, 0)
394KERN: add_memory_type_range(114, 0x7ffe1000, 0x1000, 0)
395KERN: ACPI: APIC 0x000000007FFE182C 000078 (v01 BOCHS  BXPCAPIC 00000001 BXPC 00000001)
396KERN: remove_memory_type_range(114, 0x7ffe1000, 0x1000, 0)
397KERN: add_memory_type_range(115, 0x7ffe1000, 0x1000, 0)
398KERN: remove_memory_type_range(115, 0x7ffe1000, 0x1000, 0)
399KERN: add_memory_type_range(116, 0x7ffe1000, 0x1000, 0)
400KERN: ACPI: HPET 0x000000007FFE18A4 000038 (v01 BOCHS  BXPCHPET 00000001 BXPC 00000001)
401KERN: remove_memory_type_range(116, 0x7ffe1000, 0x1000, 0)
402KERN: remove_memory_type_range(105, 0x7ffe1000, 0x1000, 0)
403KERN: add_memory_type_range(117, 0x7ffe0000, 0x2000, 0)
404KERN: remove_memory_type_range(117, 0x7ffe0000, 0x2000, 0)
405KERN: ACPI: Forced DSDT copy: length 0x01778 copied locally, original unmapped
406KERN: ACPI: 1 ACPI AML tables successfully acquired and loaded
407KERN:
408KERN: add_memory_type_range(118, 0x7ffe0000, 0x1000, 0)
409KERN: ACPI: Enabled 3 GPEs in block 00 to 0F
410KERN: add_memory_type_range(119, 0x7ffe1000, 0x1000, 0)
411KERN: found io-apic with address 0xfec00000, global interrupt base 0, apic-id 0
412KERN: mapping io-apic 0 at physical address 0xfec00000
413KERN: add_memory_type_range(120, 0xfec00000, 0x1000, 0)
414KERN: io-apic 0 has range 0-23, 24 entries, version 0x00170011, apic-id 0
415KERN: setting ACPI interrupt model to APIC
416KERN: failed to put ACPI into APIC interrupt model, ignoring
417KERN: IRQ routing table with 2 entries
418KERN: address 0x1ffff; pin 0; source 0xffffffff8297dab8 0; pci 0:1 pin 1 func mask 8; bios irq: 9; gsi 9; config 0x0a
419KERN: address 0x3ffff; pin 0; source 0xffffffff8297ddb8 0; pci 0:3 pin 1 func mask 1; bios irq: 11; gsi 11; config 0x0a
420KERN: found interrupt override for bus 0, source irq 0, global irq 2, flags 0x00000000
421KERN: found interrupt override for bus 0, source irq 5, global irq 5, flags 0x0000000d
422KERN: found interrupt override for bus 0, source irq 9, global irq 9, flags 0x0000000d
423KERN: found interrupt override for bus 0, source irq 10, global irq 10, flags 0x0000000d
424KERN: found interrupt override for bus 0, source irq 11, global irq 11, flags 0x0000000d
425KERN: free_io_interrupt_vectors: freeing 16 vectors starting from 0
426KERN: reserve_io_interrupt_vectors: reserved 24 vectors starting from 0
427KERN: using io-apics for interrupt routing
428KERN: slab memory manager: created area 0xffffffff80801000 (131)
429KERN: allocate_commpage_entry(3, 76) -> 0x0000000000000210
430KERN: publish device: node 0xffffffff82a86d20, path acpi/namespace, module bus_managers/acpi/namespace/device_v1
431KERN: registering power button
432KERN: add_memory_type_range(233, 0xfed00000, 0x1000, 0)
433KERN: module: Search for busses/usb/xhci failed.
434KERN: usb uhci: no devices found
435KERN: usb ohci: no devices found
436KERN: usb ehci: no devices found
437KERN: usb error stack 0: no bus managers available
438KERN: usb_disk: getting module failed: No such device
439KERN: legacy_driver_add_preloaded: Failed to add "usb_disk": Device not accessible
440KERN: get_boot_partitions(): boot volume message:
441KERN: KMessage: buffer: 0xffffffff820cec58 (size/capacity: 315/315), flags: 0xa
442KERN:   field: "booted from image" (BOOL): true
443KERN:   field: "partition offset"  (LLNG): 0 (0x0)
444KERN:   field: "boot method"       (LONG): 1 (0x1)
445KERN:   field: "boot drive number" (LLNG): 0 (0x0)
446KERN:   field: "disk identifier"   (RAWT): data at 0xffffffff820ced44, 79 bytes
447KERN: get_boot_partitions(): boot method type: 1
448KERN: partitioning system: partitioning_systems/intel/extended/v1
449KERN: KDiskDeviceManager::_AddDiskSystem(partitioning_systems/intel/extended/v1)
450KERN: intel: ep_std_ops(0x1)
451KERN: iKERN: ntel: ep_std_ops(0x2)
452KERN: KDiskDeviceManager::_AddDiskSystem() done: No error
453KERN: partitioning system: partitioning_systems/session/v1
454KERN: KDiskDeviceManager::_AddDiskSystem(partitioning_systems/session/v1)
455KERN: KDiskDeviceManager::_AddDiskSystem() done: No error
456KERN: partitioning system: partitioning_systems/intel/map/v1
457KERN: KDiskDeviceManager::_AddDiskSystem(partitioning_systems/intel/map/v1)
458KERN: intel: pm_std_ops(0x1)
459KERN: intel: pm_std_ops(0x2)
460KERN: KDiskDeviceManager::_AddDiskSystem() done: No error
461KERN: file system: file_systems/devfs/v1
462KERN: KDiskDeviceManager::_AddDiskSystem(file_systems/devfs/v1)
463KERN: KDiskDeviceManager::_AddDiskSystem() done: No error
464KERN: file system: file_systems/attribute_overlay/v1
465KERN: KDiskDeviceManager::_AddDiskSystem(file_systems/attribute_overlay/v1)
466KERN: KDiskDeviceManager::_AddDiskSystem() done: No error
467KERN: file system: file_systems/rootfs/v1
468KERN: KDiskDeviceManager::_AddDiskSystem(file_systems/rootfs/v1)
469KERN: KDiskDeviceManager::_AddDiskSystem() done: No error
470KERN: file system: file_systems/packagefs/v1
471KERN: KDiskDeviceManager::_AddDiskSystem(file_systems/packagefs/v1)
472KERN: KDiskDeviceManager::_AddDiskSystem() done: No error
473KERN: file system: file_systems/iso9660/v1
474KERN: KDiskDeviceManager::_AddDiskSystem(file_systems/iso9660/v1)
475KERN: KDiskDeviceManager::_AddDiskSystem() done: No error
476KERN: file system: file_systems/write_overlay/v1
477KERN: KDiskDeviceManager::_AddDiskSystem(file_systems/write_overlay/v1)
478KERN: KDiskDeviceManager::_AddDiskSystem() done: No error
479KERN: file system: file_systems/bfs/v1
480KERN: KDiskDeviceManager::_AddDiskSystem(file_systems/bfs/v1)
481KERN: KDiskDeviceManager::_AddDiskSystem() done: No error
482KERN: number of disk systems: 10
483KERN: KDiskDeviceManager::_Scan(/dev/disk)
484KERN: PCI-ATA: Controller in legacy mode: cmd 0x1f0, ctrl 0x3f6, irq 14
485KERN: PCI-ATA: enabling bus mastering
486KERN: PCI-ATA: pcicmd changed from 0x0103 to 0x0107
487KERN: PCI-ATA: init channel...
488KERN: PCI-ATA: channel index 0
489KERN: PCI-ATA: bus master base 0xc040
490KERN: PCI-ATA: init channel done
491KERN: ata 0: _DevicePresent: device 0, presence 1
492KERN: ata 0: _DevicePresent: device 1, presence 1
493KERN: ata 0: deviceMask 3
494KERN: ata 0: probing device 0
495KERN: ata 0: signature of device 0: 0x0000
496KERN: ata 0-0: model number: QEMU HARDDISK                           
497KERN: ata 0-0: serial number: QM00001             
498KERN: ata 0-0: firmware rev.: 2.5+   
499KERN: ata 0-0: using DMA mode 0x15
500KERN: ata 0: identified ATA device 0
501KERN: ata 0: probing device 1
502KERN: ata 0 error: device 1 failed, error code is 0x00
503KERN: ata 0: signature of device 1: 0xffff
504KERN: ata 0 error: device ready not set
505KERN: ata 0-1 error: sending identify request failed
506KERN: ata 0 error: command failed, error bit is set. status 0x41, error 0x04
507KERN: publish device: node 0xffffffff82b7eab8, path disk/ata/0/master/raw, module drivers/disk/scsi/scsi_disk/device_v1
508KERN: ata 0-0 error: invalid target lun 1 for ATA device
509KERN: ata 0-0 error: invalid target lun 2 for ATA device
510KERN: ata 0-0 error: invalid target lun 3 for ATA device
511KERN: ata 0-0 error: invalid target lun 4 for ATA device
512KERN: ata 0-0 error: invalid target lun 5 for ATA device
513KERN: ata 0-0 error: invalid target lun 6 for ATA device
514KERN: ata 0-0 error: invalid target lun 7 for ATA device
515KERN: ata 0 error: target device not present
516KERN: ata 0 error: invalid target device
517KERN: Last message repeated 12 times.
518KERN: PCI-ATA: Controller in legacy mode: cmd 0x170, ctrl 0x376, irq 15
519KERN: PCI-ATA: init channel...
520KERN: PCI-ATA: channel index 1
521KERN: PCI-ATA: bus master base 0xc048
522KERN: PCI-ATA: init channel done
523KERN: ata 1: _DevicePresent: device 0, presence 1
524KERN: ata 1: _DevicePresent: device 1, presence 1
525KERN: ata 1: deviceMask 3
526KERN: ata 1: probing device 0
527KERN: ata 1: signature of device 0: 0xeb14
528KERN: atapi 1-0: model number: QEMU DVD-ROM                           
529KERN: atapi 1-0: serial number: QM00003             
530KERN: atapi 1-0: firmware rev.: 2.5+   
531KERN: atapi 1-0: using DMA mode 0x15
532KERN: ata 1: identified ATAPI device 0
533KERN: ata 1: probing device 1
534KERN: ata 1 error: device 1 failed, error code is 0x00
535KERN: ata 1: signature of device 1: 0xffff
536KERN: ata 1 error: device ready not set
537KERN: ata 1-1 error: sending identify request failed
538KERN: publish device: node 0xffffffff82b7e3d8, path disk/atapi/1/master/raw, module drivers/disk/scsi/scsi_cd/device_v1
539KERN: atapi 1-0 error: invalid target lun 1
540KERN: atapi 1-0 error: invalid target lun 2
541KERN: atapi 1-0 error: invalid target lun 3
542KERN: atapi 1-0 error: invalid target lun 4
543KERN: atapi 1-0 error: invalid target lun 5
544KERN: atapi 1-0 error: invalid target lun 6
545KERN: atapi 1-0 error: invalid target lun 7
546KERN: ata 1 error: target device not present
547KERN: ata 1 error: invalid target device
548KERN: Last message repeated 12 times.
549KERN: KDiskDeviceManager::_Scan(/dev/disk/ata)
550KERN: KDiskDeviceManager::_Scan(/dev/disk/ata/0)
551KERN: KDiskDeviceManager::_Scan(/dev/disk/ata/0/master)
552KERN: KDiskDeviceManager::_Scan(/dev/disk/ata/0/master/raw)
553KERN:   found device: /dev/disk/ata/0/master/raw
554KERN: DMAResource@0xffffffff82b7ea18: low/high 0/100000000, max segment count 512, align 2, boundary 65536, max transfer 33553920, max segment size 33554432
555KERN: slab memory manager: created area 0xffffffff86801000 (280)
556KERN: slab memory manager: created area 0xffffffff87001000 (315)
557KERN: KDiskDeviceManager::_Scan(/dev/disk/atapi)
558KERN: KDiskDeviceManager::_Scan(/dev/disk/atapi/1)
559KERN: KDiskDeviceManager::_Scan(/dev/disk/atapi/1/master)
560KERN: KDiskDeviceManager::_Scan(/dev/disk/atapi/1/master/raw)
561KERN:   found device: /dev/disk/atapi/1/master/raw
562KERN: DMAResource@0xffffffff82b7e338: low/high 0/100000000, max segment count 512, align 2, boundary 65536, max transfer 524288, max segment size 134217728
563KERN: slab memory manager: created area 0xffffffff87801000 (333)
564KERN: KDiskDeviceManager::_ScanPartition(/dev/disk/ata/0/master/raw)
565KERN: intel: ep_std_ops(0x1)
566KERN:   trying: partitioning_systems/intel/extended/v1
567KERN:   returned: -1
568KERN: intel: ep_std_ops(0x2)
569KERN:   trying: partitioning_systems/session/v1
570KERN:   returned: -1
571KERN: intel: pm_std_ops(0x1)
572KERN:   trying: partitioning_systems/intel/map/v1
573KERN: intel: pm_identify_partition(0, 0: 0, 128035676160, 512)
574KERN: intel: Found GPT signature, ignoring.
575KERN:   returned: -1
576KERN: intel: pm_std_ops(0x2)
577KERN:   trying: file_systems/devfs/v1
578KERN:   returned: -1
579KERN:   trying: file_systems/attribute_overlay/v1
580KERN:   returned: -1
581KERN:   trying: file_systems/rootfs/v1
582KERN:   returned: -1
583KERN:   trying: file_systems/packagefs/v1
584KERN:   returned: -1
585KERN:   trying: file_systems/iso9660/v1
586KERN: identify(0, 0xffffffff82b7be78)
587KERN:   returned: -1
588KERN:   trying: file_systems/write_overlay/v1
589KERN:   returned: -1
590KERN:   trying: file_systems/bfs/v1
591KERN:   returned: -1
592KERN: KDiskDeviceManager::_ScanPartition(/dev/disk/atapi/1/master/raw)
593KERN: intel: ep_std_ops(0x1)
594KERN:   trying: partitioning_systems/intel/extended/v1
595KERN:   returned: -1
596KERN: intel: ep_std_ops(0x2)
597KERN:   trying: partitioning_systems/session/v1
598KERN: raw_command:
599KERN:   returned: -1
600KERN: intel: pm_std_ops(0x1)
601KERN:   trying: partitioning_systems/intel/map/v1
602KERN: intel: pm_identify_partition(0, 1: 0, 633339904, 2048)
603KERN:   returned: 0.81
604KERN:   trying: file_systems/devfs/v1
605KERN:   returned: -1
606KERN:   trying: file_systems/attribute_overlay/v1
607KERN:   returned: -1
608KERN:   trying: file_systems/rootfs/v1
609KERN:   returned: -1
610KERN:   trying: file_systems/packagefs/v1
611KERN:   returned: -1
612KERN:   trying: file_systems/iso9660/v1
613KERN: identify(0, 0xffffffff82b7be78)
614KERN: found primary descriptor
615KERN:   iso9660_primary_descriptor:
616KERN:     volume descriptor type: 1 (primary)
617KERN:     standard identifier:    CD001 (valid)
618KERN:     version:                1
619KERN:     identifier:             'bootimg                         '
620KERN:     size:                   1624
621KERN:     set size:               1
622KERN:     sequence number:        1
623KERN:     logical block size:     2048
624KERN:     path table size:        10
625KERN:     set identifier:                                     
626KERN:     root directory record:
627KERN:       length:               34
628KERN:       location:             29
629KERN:       data length:          2048
630KERN:       volume space:         1
631KERN: iso9660_info::set_string(0xffffffff82b7be78 ('<NULL>'), 'bootimg                         ', 7)
632KERN:   returned: 0.6
633KERN:   trying: file_systems/write_overlay/v1
634KERN:   returned: -1
635KERN:   trying: file_systems/bfs/v1
636KERN:   returned: -1
637KERN:   scanning with: partitioning_systems/intel/map/v1
638KERN: intel: pm_scan_partition(0, 1: 0, 633339904, 2048)
639KERN: KDiskDeviceManager::_ScanPartition(/dev/disk/atapi/1/master/0)
640KERN: intel: ep_std_ops(0x1)
641KERN:   trying: partitioning_systems/intel/extended/v1
642KERN: intel: ep_identify_partition(0, 4194304, 629145600, 2048)
643KERN:   returned: -1
644KERN: intel: ep_std_ops(0x2)
645KERN:   trying: partitioning_systems/session/v1
646KERN:   returned: -1
647KERN:   trying: partitioning_systems/intel/map/v1
648KERN: intel: pm_identify_partition(0, 2: 4194304, 629145600, 2048)
649KERN:   returned: -1
650KERN:   trying: file_systems/devfs/v1
651KERN:   returned: -1
652KERN:   trying: file_systems/attribute_overlay/v1
653KERN:   returned: -1
654KERN:   trKERN: ying: file_systems/rootfs/v1
655KERN:   returned: -1
656KERN:   trying: file_systems/packagefs/v1
657KERN:   returned: -1
658KERN:   trying: file_systems/iso9660/v1
659KERN: identify(0, 0xffffffff82b7be60)
660KERN:   returned: -1
661KERN:   trying: file_systems/write_overlay/v1
662KERN:   returned: -1
663KERN:   trying: file_systems/bfs/v1
664KERN:   returned: 0.8
665KERN:   scanning with: file_systems/bfs/v1
666KERN: device 0: /dev/disk/ata/0/master/raw
667KERN:   media status:      No error
668KERN:   device flags:      2
669KERN:   offset:            0
670KERN:   size:              128035676160 (122104.335 MB)
671KERN:   content size:      0
672KERN:   block size:        512
673KERN:   child count:       0
674KERN:   index:             -1
675KERN:   status:            2
676KERN:   flags:             1
677KERN:   volume:            -1
678KERN:   disk system:       <NULL>
679KERN:   name:              QEMU HARDDISK
680KERN:   content name:      <NULL>
681KERN:   type:              <NULL>
682KERN:   content type:      <NULL>
683KERN:   params:            <NULL>
684KERN:   content params:    <NULL>
685KERN: device 1: /dev/disk/atapi/1/master/raw
686KERN:   media status:      No error
687KERN:   device flags:      7
688KERN:   offset:            0
689KERN:   size:              633339904 (604 MB)
690KERN:   content size:      633339904
691KERN:   block size:        2048
692KERN:   child count:       1
693KERN:   index:             -1
694KERN:   status:            0
695KERN:   flags:             5
696KERN:   volume:            -1
697KERN:   disk system:       partitioning_systems/intel/map/v1
698KERN:   name:              QEMU DVD-ROM
699KERN:   content name:      <NULL>
700KERN:   type:              <NULL>
701KERN:   content type:      Intel Partition Map
702KERN:   params:            <NULL>
703KERN:   content params:    <NULL>
704KERN:   partition 2: /dev/disk/atapi/1/master/0
705KERN:     offset:            4194304
706KERN:     size:              629145600 (600 MB)
707KERN:     content size:      629145600
708KERN:     block size:        2048
709KERN:     child count:       0
710KERN:     index:             0
711KERN:     status:            0
712KERN:     flags:             a
713KERN:     volume:            -1
714KERN:     disk system:       file_systems/bfs/v1
715KERN:     name:              <NULL>
716KERN:     content name:      Haiku
717KERN:     type:              Be File System
718KERN:     content type:      Be File System
719KERN:     params:            type = 235 ; active = 1
720KERN:     content params:    <NULL>
721KERN: Identified anyboot CD.
722KERN: bfs: mounted "Haiku" (root node at 131072, device = /dev/disk/atapi/1/master/0)
723KERN: Mounted boot partition: /dev/disk/atapi/1/master/0
724KERN: packagefs [1366020:    15] Adding packages from "/boot/system/packages"
725KERN: packagefs [1366426:    15] Failed to open packages activation file: No such file or directory
726KERN: packagefs [1366938:    15] Loading packages from activation file failed. Loading all packages in packages directory.
727KERN: slab memory manager: created area 0xffffffff88001000 (351)
728KERN: slab memory manager: created area 0xffffffff88801000 (352)
729KERN: slab memory manager: created area 0xffffffff89001000 (353)
730KERN: packagefs [1831602:    15] StringPool usage:
731KERN: packagefs [1831902:    15]   total unique strings:       23296,   285987 bytes, overhead: 535808 bytes
732KERN: packagefs [1832483:    15]   total strings with dups:   107030,  1141274 bytes
733KERN: packagefs [1832961:    15]   unshared strings:             947
734KERN: packagefs [1833317:    15]   bytes saved:               319479
735KERN: packagefs [1837899:    15] Adding packages from "/boot/home/config/packages"
736KERN: packagefs [1838346:    15] Failed to open packages activation file: No such file or directory
737KERN: packagefs [1838878:    15] Loading packages from activation file failed. Loading all packages in packages directory.
738KERN: packagefs [1841239:    15] StringPool usage:
739KERN: packagefs [1841506:    15]   total unique strings:       23296,   285987 bytes, overhead: 535808 bytes
740KERN: packagefs [1842089:    15]   total strings with dups:   107041,  1141339 bytes
741KERN: packagefs [1842531:    15]   unshared strings:             944
742KERN: packagefs [1842887:    15]   bytes saved:               319544
743KERN: module_init_post_boot_device() failed to normalize path of module image 0xffffffff8280f240, "write_overlay"
744KERN: module: Search for file_cache/launch_speedup/v1 failed.
745KERN: partitioning system: partitioning_systems/efi_gpt/v1
746KERN: KDiskDeviceManager::_AddDiskSystem(partitioning_systems/efi_gpt/v1)
747KERN: KDiskDeviceManager::_AddDiskSystem() done: No error
748KERN: file system: file_systems/nfs4/v1
749KERN: KDiskDeviceManager::_AddDiskSystem(file_systems/nfs4/v1)
750KERN: KDiskDeviceManager::_AddDiskSystem() done: No error
751KERN: file system: file_systems/nfs/v1
752KERN: KDiskDeviceManager::_AddDiskSystem(file_systems/nfs/v1)
753KERN: KDiskDeviceManager::_AddDiskSystem() done: No error
754KERN: file system: file_systems/cdda/v1
755KERN: KDiskDeviceManager::_AddDiskSystem(file_systems/cdda/v1)
756KERN: KDiskDeviceManager::_AddDiskSystem() done: No error
757KERN: file system: file_systems/udf/v1
758KERN: KDiskDeviceManager::_AddDiskSystem(file_systems/udf/v1)
759KERN: KDiskDeviceManager::_AddDiskSystem() done: No error
760KERN: file system: file_systems/ntfs/v1
761KERN: KDiskDeviceManager::_AddDiskSystem(file_systems/ntfs/v1)
762KERN: KDiskDeviceManager::_AddDiskSystem() done: No error
763KERN: file system: file_systems/log_overlay/v1
764KERN: KDiskDeviceManager::_AddDiskSystem(file_systems/log_overlay/v1)
765KERN: KDiskDeviceManager::_AddDiskSystem() done: No error
766KERN: file system: file_systems/fat/v1
767KERN: KDiskDeviceManager::_AddDiskSystem(file_systems/fat/v1)
768KERN: dos_std_ops()
769Last message repeated 1 time
770KERN: KDiskDeviceManager::_AddDiskSystem() done: No error
771KERN: file system: file_systems/ext2/v1
772KERN: KDiskDeviceManager::_AddDiskSystem(file_systems/ext2/v1)
773KERN: KDiskDeviceManager::_AddDiskSystem() done: No error
774KERN: file system: file_systems/exfat/v1
775KERN: KDiskDeviceManager::_AddDiskSystem(file_systems/exfat/v1)
776KERN: KDiskDeviceManager::_AddDiskSystem() done: No error
777KERN: file system: file_systems/btrfs/v1
778KERN: KDiskDeviceManager::_AddDiskSystem(file_systems/btrfs/v1)
779KERN: KDiskDeviceManager::_AddDiskSystem() done: No error
780KERN: file system: file_systems/bindfs/v1
781KERN: KDiskDeviceManager::_AddDiskSystem(file_systems/bindfs/v1)
782KERN: KDiskDeviceManager::_AddDiskSystem() done: No error
783KERN: KDiskDeviceManager::_ScanPartition(/dev/disk/ata/0/master/raw)
784KERN:   trying: partitioning_systems/efi_gpt/v1
785KERN: publish device: node 0xffffffff88a13d20, path disk/virtual/ram/control, module drivers/disk/virtual/ram_disk/control/device_v1
786KERN: loaded driver /boot/system/add-ons/kernel/drivers/dev/zero
787KERN: usb_modeswitch: init_hardware()
788KERN: usb_modeswitch: init_driver()
789KERN: usb_modeswitch: trying module bus_managers/usb/v3
790KERN: usb xhci: no devices found
791KERN: usb uhci: no devices found
792KERN: usb ohci: no devices found
793KERN: usb ehci: no devices found
794KERN: usb error stack 0: no bus managers available
795KERN: usb_modeswitch: getting module failed 0x80007007
796KERN: loaded driver /boot/system/add-ons/kernel/drivers/dev/tty
797KERN: loaded driver /boot/system/add-ons/kernel/drivers/dev/null
798KERN: loaded driver /boot/system/add-ons/kernel/drivers/dev/dprintf
799KERN: con_init: trying module console/frame_buffer/v1
800KERN: loaded driver /boot/system/add-ons/kernel/drivers/dev/console
801KERN: EFI header: EFI PART
802KERN: EFI revision: 10000
803KERN: header size: 92
804KERN: header CRC: 19d0bb03
805KERN: absolute block: 1
806KERN: alternate block: 250069679
807KERN: first usable block: 34
808KERN: last usable block: 250069646
809KERN: disk GUID: afead161-9d0f-4845-b98a-8fde09c0ed3f
810KERN: entries block: 2
811KERN: entry size:  128
812KERN: entry count: 128
813KERN: entries CRC: 9d36c75b
814KERN: EFI header: EFI PART
815KERN: EFI revision: 10000
816KERN: header size: 92
817KERN: header CRC: 1867dc69
818KERN: absolute block: 250069679
819KERN: alternate block: 1
820KERN: first usable block: 34
821KERN: last usable block: 250069646
822KERN: disk GUID: afead161-9d0f-4845-b98a-8fde09c0ed3f
823KERN: entries block: 250069647
824KERN: entry size:  128
825KERN: entry count: 128
826KERN: entries CRC: 9d36c75b
827KERN: [  0] partition type: c12a7328-f81f-11d2-ba4b-00a0c93ec93b
828KERN:       unique id: 6abb4ee0-05c7-4790-8105-9beeb07969a0
829KERN:       start block: 2048
830KERN:       end block: 206847
831KERN:       size: 99.999 MB
832KERN:       attributes: 0
833KERN:       name: EFI System
834KERN: [  1] partition type: 42465331-3ba3-10f1-802a-4861696b7521
835KERN:       unique id: 371ef677-9275-47be-b42f-e94a5c599a03
836KERN:       start block: 206848
837KERN:       end block: 250069646
838KERN:       size: 122003.319 MB
839KERN:       attributes: 0
840KERN:       name: Haiku BFS
841KERN:   returned: 0.959
842KERN:   trying: file_systems/nfs4/v1
843KERN:   returned: -1
844KERN:   trying: file_systems/nfs/v1
845KERN:   returned: -1
846KERN:   trying: file_systems/cdda/v1
847KERN: raw_command:
848KERN:   returned: -1
849KERN:   trying: file_systems/udf/v1
850KERN: udf_recognize: Invalid sequence. status = -1
851KERN:   returned: -1
852KERN:   trying: file_systems/ntfs/v1
853KERN: fs_identify_partition: boot signature NTFS doesn't match
854KERN:   returned: -1
855KERN:   trying: file_systems/log_overlay/v1
856KERN:   returned: -1
857KERN: dos_std_ops()
858KERN:   trying: file_systems/fat/v1
859KERN:   returned: -1
860KERN: dos_std_ops()
861KERN:   trying: file_systems/ext2/v1
862KERN: [34mext2:[0m invalid superblock!
863KERN:   returned: -1
864KERN:   trying: file_systems/exfat/v1
865KERN: [34mexfat:[0m invalid superblock!
866KERN:   returned: -1
867KERN:   tKERN: rying: file_systems/btrfs/v1
868KERN: [34mbtrfs:[0m invalid superblock!
869KERN:   returned: -1
870KERN:   trying: file_systems/bindfs/v1
871KERN:   returned: -1
872KERN:   scanning with: partitioning_systems/efi_gpt/v1
873KERN: efi_gpt_scan_partition(cookie = 0xffffffff88a08388)
874KERN: KDiskDeviceManager::_ScanPartition(/dev/disk/ata/0/master/0)
875KERN:   trying: partitioning_systems/efi_gpt/v1
876KERN:   returned: -1
877KERN:   trying: file_systems/nfs4/v1
878KERN:   returned: -1
879KERN:   trying: file_systems/nfs/v1
880KERN:   returned: -1
881KERN:   trying: file_systems/cdda/v1
882KERN: raw_command:
883KERN:   returned: -1
884KERN:   trying: file_systems/udf/v1
885KERN: read_pos(pos:536879104, len:512) failed with: 0xffffffffffffffff
886KERN: udf_recognize: Invalid sequence. status = -1
887KERN:   returned: -1
888KERN:   trying: file_systems/ntfs/v1
889KERN: fs_identify_partition: boot signature NTFS doesn't match
890KERN:   returned: -1
891KERN:   trying: file_systems/log_overlay/v1
892KERN:   returned: -1
893KERN: dos_std_ops()
894KERN:   trying: file_systems/fat/v1
895KERN:   returned: 0.8
896KERN:   trying: file_systems/ext2/v1
897KERN: [34mext2:[0m invalid superblock!
898KERN:   returned: -1
899KERN:   trying: file_systems/exfat/v1
900KERN: [34mexfat:[0m invalid superblock!
901KERN:   returned: -1
902KERN:   trying: file_systems/btrfs/v1
903KERN: [34mbtrfs:[0m invalid superblock!
904KERN:   returned: -1
905KERN:   trying: file_systems/bindfs/v1
906KERN:   returned: -1
907KERN:   scanning with: file_systems/fat/v1
908KERN: KDiskDeviceManager::_ScanPartition(/dev/disk/ata/0/master/1)
909KERN:   trying: partitioning_systems/efi_gpt/v1
910KERN:   returned: -1
911KERN:   trying: file_systems/nfs4/v1
912KERN:   returned: -1
913KERN:   trying: file_systems/nfs/v1
914KERN:   returned: -1
915KERN:   trying: file_systems/cdda/v1
916KERN: raw_command:
917KERN:   returned: -1
918KERN:   trying: file_systems/udf/v1
919KERN: udf_recognize: Invalid sequence. status = -1
920KERN:   returned: -1
921KERN:   trying: file_systems/ntfs/v1
922KERN: fs_identify_partition: boot signature NTFS doesn't match
923KERN:   returned: -1
924KERN:   trying: file_systems/log_overlay/v1
925KERN:   returned: -1
926KERN:   trying: file_systems/fat/v1
927KERN:   returned: -1
928KERN:   trying: file_systems/ext2/v1
929KERN: [34mext2:[0m invalid superblock!
930KERN:   returned: -1
931KERN:   trying: file_systems/exfat/v1
932KERN: [34mexfat:[0m invalid superblock!
933KERN:   returned: -1
934KERN:   trying: file_systems/btrfs/v1
935KERN: [34mbtrfs:[0m invalid superblock!
936KERN:   returned: -1
937KERN:   trying: file_systems/bindfs/v1
938KERN:   returned: -1
939KERN: KDiskDeviceManager::_Scan(/dev/disk)
940KERN: KDiskDeviceManager::_Scan(/dev/disk/ata)
941KERN: KDiskDeviceManager::_Scan(/dev/disk/ata/0)
942KERN: KDiskDeviceManager::_Scan(/dev/disk/ata/0/master)
943KERN: KDiskDeviceManager::_Scan(/dev/disk/ata/0/master/0)
944KERN: KDiskDeviceManager::_Scan(/dev/disk/ata/0/master/1)
945KERN: KDiskDeviceManager::_Scan(/dev/disk/ata/0/master/raw)
946KERN: KDiskDeviceManager::_Scan(/dev/disk/atapi)
947KERN: KDiskDeviceManager::_Scan(/dev/disk/atapi/1)
948KERN: KDiskDeviceManager::_Scan(/dev/disk/atapi/1/master)
949KERN: KDiskDeviceManager::_Scan(/dev/disk/atapi/1/master/0)
950KERN: KDiskDeviceManager::_Scan(/dev/disk/atapi/1/master/raw)
951KERN: KDiskDeviceManager::_Scan(/dev/disk/usb)
952KERN: usb xhci: no devices found
953KERN: usb uhci: no devices found
954KERN: usb ohci: no devices found
955KERN: usb ehci: no devices found
956KERN: usb error stack 0: no bus managers available
957KERN: [35musb_floppy[0m: getting module failed 0x80007007
958KERN: loaded driver /boot/system/add-ons/kernel/drivers/dev/disk/usb/usb_disk
959KERN: KDiskDeviceManager::_Scan(/dev/disk/virtual)
960KERN: KDiskDeviceManager::_Scan(/dev/disk/virtual/ram)
961KERN: KDiskDeviceManager::_Scan(/dev/disk/virtual/ram/control)
962KERN: KDiskDeviceManager::_ScanPartition(/dev/disk/ata/0/master/0)
963KERN: intel: ep_std_ops(0x1)
964KERN:   trying: partitioning_systems/intel/extended/v1
965KERN:   returned: -1
966KERN: intel: ep_std_ops(0x2)
967KERN:   trying: partitioning_systems/session/v1
968KERN:   returned: -1
969KERN:   trying: partitioning_systems/intel/map/v1
970KERN: intel: pm_identify_partition(6, 3: 1048576, 104857600, 512)
971KERN:   returned: -1
972KERN:   trying: file_systems/devfs/v1
973KERN:   returned: -1
974KERN:   trying: file_systems/attribute_overlay/v1
975KERN:   returned: -1
976KERN:   trying: file_systems/rootfs/v1
977KERN:   returned: -1
978KERN:   trying: file_systems/packagefs/v1
979KERN:   returned: -1
980KERN:   trying: file_systems/iso9660/v1
981KERN: identify(6, 0xffffffff888f4080)
982KERN:   returned: -1
983KERN:   trying: file_systems/write_overlay/v1
984KERN:   returned: -1
985KERN:   trying: file_systems/bfs/v1
986KERN:   returned: -1
987KERN:   trying: partitioning_systems/efi_gpt/v1
988KERN:   returned: -1
989KERN:   trying: file_systems/nfs4/v1
990KERN:   returned: -1
991KERN:   trying: file_systems/nfs/v1
992KERN:   returned: -1
993KERN:   trying: file_systems/cdda/v1
994KERN: raw_command:
995KERN:   returned: -1
996KERN:   trying: file_systems/udf/v1
997KERN: read_pos(pos:536879104, len:512) failed with: 0xffffffffffffffff
998KERN: udf_recognize: Invalid sequence. status = -1
999KERN:   returned: -1
1000KERN:   trying: file_systems/ntfs/v1
1001KERN: fs_identify_partition: boot signature NTFS doesn't match
1002KERN:   returned: -1
1003KERN:   trying: file_systems/log_overlay/v1
1004KERN:   returned: -1
1005KERN:   trying: file_systems/fat/v1
1006KERN:   returned: 0.8
1007KERN:   trying: file_systems/ext2/v1
1008KERN: [34mext2:[0m invalid superblock!
1009KERN:   returned: -1
1010KERN:   trying: file_systems/exfat/v1
1011KERN: [34mexfat:[0m invalid superblock!
1012KERN:   returned: -1
1013KERN:   trying: file_systems/btrfs/v1
1014KERN: [34mbtrfs:[0m invalid superblock!
1015KERN:   returned: -1
1016KERN:   trying: file_systems/bindfs/v1
1017KERN:   returned: -1
1018KERN: KDiskDeviceManager::_ScanPartition(/dev/disk/ata/0/master/1)
1019KERN: intel: ep_std_ops(0x1)
1020KERN:   trying: partitioning_systems/intel/extended/v1
1021KERN: intel: ep_identify_partition(6, 105906176, 127929753088, 512)
1022KERN:   returned: -1
1023KERN: intel: ep_std_ops(0x2)
1024KERN:   trying: partitioning_systems/session/v1
1025KERN:   returned: -1
1026KERN:   trying: partitioning_systems/intel/map/v1
1027KERN: intel: pm_identify_partition(6, 4: 105906176, 127929753088, 512)
1028KERN:   returned: -1
1029KERN:   trying: file_systems/devfs/v1
1030KERN:   returned: -1
1031KERN:   trying: file_systems/attribute_overlay/v1
1032KERN:   returned: -1
1033KERN:   trying: file_systems/rootfs/v1
1034KERN:   returned: -1
1035KERN:   trying: file_systems/packagefs/v1
1036KERN:   returned: -1
1037KERN:   trying: file_systems/iso9660/v1
1038KERN: identify(6, 0xffffffff888f4080)
1039KERN:   returned: -1
1040KERN:   trying: file_systems/write_overlay/v1
1041KERN:   returned: -1
1042KERN:   trying: file_systems/bfs/v1
1043KERN:   returned: -1
1044KERN:   trying: partitioning_systems/efi_gpt/v1
1045KERN:   returned: -1
1046KERN:   trying: file_systems/nfs4/v1
1047KERN:   returned: -1
1048KERN:   trying: file_systems/nfs/v1
1049KERN:   returned: -1
1050KERN:   trying: file_systems/cdda/v1
1051KERN: raw_command:
1052KERN:   returned: -1
1053KERN:   trying: file_systems/udf/v1
1054KERN: udf_recognize: Invalid sequence. status = -1
1055KERN:   returned: -1
1056KERN:   trying: file_systems/ntfs/v1
1057KERN: fs_identify_partition: boot signature NTFS doesn't match
1058KERN:   returned: -1
1059KERN:   trying: file_systems/log_overlay/v1
1060KERN:   returned: -1
1061KERN:   trying: file_systems/fat/v1
1062KERN:   returned: -1
1063KERN:   trying: file_systems/ext2/v1
1064KERN: [34mext2:[0m invalid superblock!
1065KERN:   returned: -1
1066KERN:   trying: file_systems/exfat/v1
1067KERN: [34mexfat:[0m invalid superblock!
1068KERN:   returned: -1
1069KERN:   trying: file_systems/btrfs/v1
1070KERN: [34mbtrfs:[0m invalid superblock!
1071KERN:   returned: -1
1072KERN:   trying: file_systems/bindfs/v1
1073KERN:   returned: -1
1074KERN: allocate_commpage_entry(4, 16) -> 0x0000000000000260
1075KERN: no valid cpufreq module found
1076KERN: no valid cpuidle module found
1077KERN: add_memory_type_range(-1, 0x100000, 0x7fee0000, 6)
1078KERN: set MTRRs to:
1079KERN:   mtrr:  0: base: 0x7ffe0000, size:    0x20000, type: 0
1080KERN:   mtrr:  1: base: 0x80000000, size: 0x80000000, type: 0
1081KERN: kernel debugger extension "debugger/run_on_exit/v1": loaded
1082KERN: kernel debugger extension "debugger/usb_keyboard/v1": loaded
1083KERN: kernel debugger extension "debugger/invalidate_on_exit/v1": loaded
1084KERN: kernel debugger extension "debugger/hangman/v1": loaded
1085KERN: add_memory_type_range(82, 0xfd000000, 0x300000, 1)
1086KERN: set MTRRs to:
1087KERN:   mtrr:  0: base: 0x7ffe0000, size:    0x20000, type: 0
1088KERN:   mtrr:  1: base: 0xfe000000, size:  0x2000000, type: 0
1089KERN:   mtrr:  2: base: 0x80000000, size: 0x80000000, type: 1
1090KERN: publish device: node 0xffffffff82961aa0, path random, module bus_managers/random/device_v1
1091KERN: publish device: node 0xffffffff82961aa0, path urandom, module bus_managers/random/device_v1
1092KERN: publish device: node 0xffffffff82961820, path power/button/power_fixed, module drivers/power/acpi_button/device_v1
1093KERN: bfs: bfs_stat_index:2177: No such file or directory
1094Last message repeated 1 time
1095KERN: prevent_allow:
1096KERN: periph_simple_exec:
1097KERN: bfs: bfs_stat_index:2177: No such file or directory
1098KERN: Last message repeated 13 times.
1099KERN: REG: Failed to open shadow passwd DB file "/etc/shadow": No such file or directory
1100KERN: bfs: bfs_stat_index:2177: No such file or directory
1101Last message repeated 1 time
1102KERN: Running post install script /boot/system/boot/post-install/add_catalog_entry_attributes.sh ...
1103KERN: devfs: reload driver "usb_disk" (-1, -1)
1104KERN: usb xhci: no devices found
1105KERN: usb uhci: no devices found
1106KERN: usb ohci: no devices found
1107KERN: usb ehci: no devices found
1108KERN: usb error stack 0: no bus managers available
1109KERN: usb_disk: getting module failed: No such device
1110KERN: register_domain(9, unix)
1111KERN: unregister_dKERN: omain(0xffffffff88bcb580, 9, unix)
1112KERN: register_domain(5, internet6)
1113KERN: unregister_domain(0xffffffff88bcb400, 5, internet6)
1114KERN: register_domain(1, internet)
1115KERN: unregister_domain(0xffffffff88bcb380, 1, internet)
1116KERN: register_domain(5, internet6)
1117KERN: unregister_domain(0xffffffff88bcb200, 5, internet6)
1118KERN: register_domain(5, internet6)
1119KERN: unregister_domain(0xffffffff88ba2080, 5, internet6)
1120KERN: register_domain(5, internet6)
1121KERN: unregister_domain(0xffffffff88ba2080, 5, internet6)
1122KERN: register_domain(4, link)
1123KERN: unregister_domain(0xffffffff88bf3d80, 4, link)
1124KERN: register_domain(9, unix)
1125KERN: unregister_domain(0xffffffff88bf3d00, 9, unix)
1126KERN: register_domain(5, internet6)
1127KERN: unregister_domain(0xffffffff88bf3d00, 5, internet6)
1128KERN: register_domain(1, internet)
1129KERN: unregister_domain(0xffffffff88bf3d00, 1, internet)
1130KERN: register_domain(5, internet6)
1131KERN: unregister_domain(0xffffffff88bf3d00, 5, internet6)
1132KERN: register_domain(5, internet6)
1133KERN: unregister_domain(0xffffffff88bf3d00, 5, internet6)
1134KERN: register_domain(5, internet6)
1135KERN: unregister_domain(0xffffffff88bf3d00, 5, internet6)
1136KERN: register_domain(1, internet)
1137KERN: radeon_hd: init_hardware
1138KERN: Radeon - init_hardware: Version: 5.1.6.0
1139KERN: Radeon - Radeon_CardDetect: no supported devices found
1140KERN: intel_extreme: CALLED status_t init_hardware()
1141KERN: unregister_domain(0xffffffff88bf3d80, 1, internet)
1142KERN: register_domain(9, unix)
1143KERN: unregister_domain(0xffffffff88bf3180, 9, unix)
1144KERN: register_domain(5, internet6)
1145KERN: unregister_domain(0xffffffff88bf3180, 5, internet6)
1146KERN: register_domain(1, internet)
1147KERN: unregister_domain(0xffffffff88bf3180, 1, internet)
1148KERN: register_domain(5, internet6)
1149KERN: unregister_domain(0xffffffff88bf3180, 5, internet6)
1150KERN: register_domain(5, internet6)
1151KERN: unregister_domain(0xffffffff88bf3180, 5, internet6)
1152KERN: register_domain(5, internet6)
1153KERN: unregister_domain(0xffffffff88bf3180, 5, internet6)
1154KERN: devfs: "intel_810" api_version missing
1155KERN: i810: init_hardware() - no supported devices
1156KERN: register_domain(1, internet)
1157KERN: vesa: init_hardware()
1158KERN: vesa: init_driver()
1159KERN: unregister_domain(0xffffffff88bf3100, 1, internet)
1160KERN: vesa: publish_devices()
1161KERN: vesa: find_device()
1162KERN: loaded driver /boot/system/add-ons/kernel/drivers/dev/graphics/vesa
1163KERN: framebuffer: init_hardware()
1164KERN: register_domain(9, unix)
1165KERN: unregister_domain(0xffffffff88bcb700, 9, unix)
1166KERN: register_domain(5, internet6)
1167KERN: unregister_domain(0xffffffff82821c80, 5, internet6)
1168KERN: register_domain(1, internet)
1169KERN: unregister_domain(0xffffffff88bf3e80, 1, internet)
1170KERN: register_domain(5, internet6)
1171KERN: unregister_domain(0xffffffff88bcb700, 5, internet6)
1172KERN: register_domain(5, internet6)
1173KERN: unregister_domain(0xffffffff88bf3e80, 5, internet6)
1174KERN: register_domain(5, internet6)
1175KERN: unregister_domain(0xffffffff88bcb000, 5, internet6)
1176KERN: add_memory_type_range(2547, 0xfd000000, 0x1000000, 0)
1177KERN: set MTRRs to:
1178KERN:   mtrr:  0: base: 0x7ffe0000, size:    0x20000, type: 0
1179KERN:   mtrr:  1: base: 0xfd000000, size:  0x1000000, type: 0
1180KERN:   mtrr:  2: base: 0xfe000000, size:  0x2000000, type: 0
1181KERN: remove_memory_type_range(82, 0xfd000000, 0x300000, 1)
1182KERN: set MTRRs to:
1183KERN:   mtrr:  0: base: 0x7ffe0000, size:    0x20000, type: 0
1184KERN:   mtrr:  1: base: 0x80000000, size: 0x80000000, type: 0
1185KERN: add_memory_type_range(2547, 0xfd000000, 0x1000000, 1)
1186KERN: set MTRRs to:
1187KERN:   mtrr:  0: base: 0x7ffe0000, size:    0x20000, type: 0
1188KERN:   mtrr:  1: base: 0xfe000000, size:  0x2000000, type: 0
1189KERN:   mtrr:  2: base: 0x80000000, size: 0x80000000, type: 1
1190KERN: register_domain(5, internet6)
1191KERN: add_memory_type_range(2553, 0x90000, 0x70000, 0)
1192KERN: set MTRRs to:
1193KERN:   mtrr:  0: base:    0x90000, size:    0x10000, type: 0
1194KERN:   mtrr:  1: base:    0xa0000, size:    0x20000, type: 0
1195KERN:   mtrr:  2: base:    0xc0000, size:    0x40000, type: 0
1196KERN:   mtrr:  3: base: 0x7ffe0000, size:    0x20000, type: 0
1197KERN:   mtrr:  4: base: 0xfe000000, size:  0x2000000, type: 0
1198KERN:   mtrr:  5: base: 0x80000000, size: 0x80000000, type: 1
1199KERN: remove_memory_type_range(2553, 0x90000, 0x70000, 0)
1200KERN: set MTRRs to:
1201KERN:   mtrr:  0: base: 0x7ffe0000, size:    0x20000, type: 0
1202KERN:   mtrr:  1: base: 0xfe000000, size:  0x2000000, type: 0
1203KERN:   mtrr:  2: base: 0x80000000, size: 0x80000000, type: 1
1204KERN: vesa: vesa_init() completed successfully!
1205KERN: vesa: acc: vesa.accelerant
1206KERN: unregister_domain(0xffffffff88bcb000, 5, internet6)
1207KERN: register_domain(9, unix)
1208KERN: unregister_domain(0xffffffff88bfbc00, 9, unix)
1209KERN: register_domain(5, internet6)
1210KERN: unregister_domain(0xffffffff88bfbc00, 5, internet6)
1211KERN: register_domain(1, internet)
1212KERN: unregister_domain(0xffffffff88bfbc00, 1, internet)
1213KERN: register_domain(5, internet6)
1214KERN: unregister_domain(0xffffffff88bfbc00, 5, internet6)
1215KERN: register_domain(5, internet6)
1216KERN: unregister_domain(0xffffffff88bfbc00, 5, internet6)
1217KERN: register_domain(5, internet6)
1218KERN: unregister_domain(0xffffffff88bfbc00, 5, internet6)
1219KERN: register_domain(1, internet)
1220KERN: unregister_domain(0xffffffff88bfbc80, 1, internet)
1221KERN: register_domain(9, unix)
1222KERN: unregister_domain(0xffffffff88bfbc00, 9, unix)
1223KERN: register_domain(5, internet6)
1224KERN: unregister_domain(0xffffffff88bfbc00, 5, internet6)
1225KERN: register_domain(1, internet)
1226KERN: unregister_domain(0xffffffff88bfbc00, 1, internet)
1227KERN: register_domain(5, internet6)
1228KERN: unregister_domain(0xffffffff88bfbc00, 5, internet6)
1229KERN: register_domain(5, internet6)
1230KERN: unregister_domain(0xffffffff88bfbc00, 5, internet6)
1231KERN: register_domain(5, internet6)
1232KERN: unregister_domain(0xffffffff88bfbc00, 5, internet6)
1233KERN: register_domain(1, internet)
1234KERN: register_domain(5, internet6)
1235KERN: usb xhci: no devices found
1236KERN: usb uhci: no devices found
1237KERN: usb ohci: no devices found
1238KERN: usb ehci: no devices found
1239KERN: usb error stack 0: no bus managers available
1240KERN: usb xhci: no devices found
1241KERN: usb uhci: no devices found
1242KERN: usb ohci: no devices found
1243KERN: usb ehci: no devices found
1244KERN: usb error stack 0: no bus managers available
1245KERN: usb xhci: no devices found
1246KERN: usb uhci: no devices found
1247KERN: usb ohci: no devices found
1248KERN: usb ehci: no devices found
1249KERN: usb error stack 0: no bus managers available
1250KERN: usb xhci: no devices found
1251KERN: usb uhci: no devices found
1252KERN: usb ohci: no devices found
1253KERN: usb ehci: no devices found
1254KERN: usb error stack 0: no bus managers available
1255KERN: etherpci: init_driver init_driver: etherpci not found
1256KERN: sis19x:00.02.895:init_hardware::SiS19X:init_hardware()
1257KERN: [ipro1000] (em) bus_alloc_resource(3, [16], 0x0, 0xffffffffffffffff, 0x1,0x2)
1258KERN: add_memory_type_range(2806, 0xfebc0000, 0x20000, 0)
1259KERN: set MTRRs to:
1260KERN:   mtrr:  0: base: 0x7ffe0000, size:    0x20000, type: 0
1261KERN:   mtrr:  1: base: 0xfe000000, size:  0x2000000, type: 0
1262KERN:   mtrr:  2: base: 0x80000000, size: 0x80000000, type: 1
1263KERN: [ipro1000] (em) No MSI/MSIX using a Legacy IRQ
1264KERN: [ipro1000] (em) bus_alloc_resource(1, [0], 0x0, 0xffffffffffffffff, 0x1,0x6)
1265KERN: if_initname(0xffffffff875e9000, em, 25)
1266KERN: [ipro1000] ipro1000: /dev/net/ipro1000/0
1267KERN: ifmedia_add: Adding Entry...
1268KERN:   Type: Ethernet
1269KERN:   SubType: 10baseT/UTP
1270KERN: ifmedia_add: Adding Entry...
1271KERN:   Type: Ethernet
1272KERN:   SubType: 10baseT/UTP
1273KERN:   Shared Option[0]: full-duplex
1274KERN: ifmedia_add: Adding Entry...
1275KERN:   Type: Ethernet
1276KERN:   SubType: 100baseTX
1277KERN: ifmedia_add: Adding Entry...
1278KERN:   Type: Ethernet
1279KERN:   SubType: 100baseTX
1280KERN:   Shared Option[0]: full-duplex
1281KERN: ifmedia_add: Adding Entry...
1282KERN:   Type: Ethernet
1283KERN:   SubType: 1000baseT
1284KERN:   Shared Option[0]: full-duplex
1285KERN: ifmedia_add: Adding Entry...
1286KERN:   Type: Ethernet
1287KERN:   SubType: 1000baseT
1288KERN: ifmedia_add: Adding Entry...
1289KERN:   Type: Ethernet
1290KERN:   SubType: autoselect
1291KERN: ifmedia_set: target   Type: Ethernet
1292KERN:   SubType: autoselect
1293KERN: ifmedia_set: setting to   Type: Ethernet
1294KERN:   SubType: autoselect
1295KERN: ipro1000: init_driver(0xffffffff85b6cfd0) at 5
1296KERN: loaded driver /boot/system/add-ons/kernel/drivers/dev/net/ipro1000
1297KERN: [net/ipro1000/0] compat_open(0x2)
1298KERN: bfs: bfs_stat_index:2177: No such file or directory
1299KERN: Last message repeated 3 times.
1300KERN: ifmedia_ioctl: switching em to   Type: Ethernet
1301KERN: package_daemon [3304985:   171] root at "/boot" (device: 3, node: 131072) registered
1302KERN:   SubType: autoselect
1303KERN: prevent_allow:
1304KERN: periph_simple_exec:
1305KERN: package_daemon [3312721:   171] volume at "/boot/system" registered
1306KERN: package_daemon [3313159:   171] volume at "/boot/home/config" registered
1307KERN: Test: and [file_exists [/system/bin/FirstBootPrompt], or [not [file_exists [/boot/home/config/settings/Locale settings]], readonly ]] -> 1
1308KERN: /dev/net/ipro1000/0: media change, media 0x20 quality 1000 speed 1000000000
1309KERN: bfs: bfs_stat_index:2177: No such file or directory
1310Last message repeated 1 time
1311KERN: add_memory_type_range(3284, 0x90000, 0x70000, 0)
1312KERN: set MTRRs to:
1313KERN:   mtrr:  0: base:    0x90000, size:    0x10000, type: 0
1314KERN:   mtrr:  1: base:    0xa0000, size:    0x20000, type: 0
1315KERN:   mtrr:  2: base:    0xc0000, size:    0x40000, type: 0
1316KERN:   mtrr:  3: basKERN: e: 0x7ffe0000, size:    0x20000, type: 0
1317KERN:   mtrr:  4: base: 0xfe000000, size:  0x2000000, type: 0
1318KERN:   mtrr:  5: base: 0x80000000, size: 0x80000000, type: 1
1319KERN: remove_memory_type_range(3284, 0x90000, 0x70000, 0)
1320KERN: set MTRRs to:
1321KERN:   mtrr:  0: base: 0x7ffe0000, size:    0x20000, type: 0
1322KERN:   mtrr:  1: base: 0xfe000000, size:  0x2000000, type: 0
1323KERN:   mtrr:  2: base: 0x80000000, size: 0x80000000, type: 1
1324KERN: bfs: bfs_stat_index:2177: No such file or directory
1325KERN: Last message repeated 3 times.
1326KERN: slab memory manager: created area 0xffffffff8a801000 (3520)
1327KERN: bfs: bfs_stat_index:2177: No such file or directory
1328KERN: Last message repeated 5 times.
1329KERN: [ipro1000] (em) Link is up 1000 Mbps Full Duplex
1330KERN: /dev/net/ipro1000/0: media change, media 0x900030 quality 1000 speed 1000000000
1331KERN: bfs: bfs_stat_index:2177: No such file or directory
1332Last message repeated 1 time
1333KERN: package_daemon [3884834:   210] Failed to open packages activation file: No such file or directory
1334KERN: package_daemon [3887492:   210] KERN: Failed to get activated packages info from activated packages file. Assuming all package files in package directory are activated.
1335KERN: package_daemon [3888526:   210] KERN: latest volume state:
1336KERN: package_daemon [3888863:   210] active package: "findutils-4.4.2-4-x86_64.hpkg"
1337KERN: package_daemon [3889334:   210] active package: "xz_utils-5.2.2-2-x86_64.hpkg"
1338KERN: package_daemon [3889778:   210] active package: "mpc-1.0.3-2-x86_64.hpkg"
1339KERN: package_daemon [3892714:   210] active package: "gmp-6.1.2-1-x86_64.hpkg"
1340KERN: package_daemon [3893140:   210] active package: "ca_root_certificates-2015_10_28-1-any.hpkg"
1341KERN: package_daemon [3893694:   210] active package: "make-4.1-1-x86_64.hpkg"
1342KERN: package_daemon [3894145:   210] active package: "scons-2.5.1-2-x86_64.hpkg"
1343KERN: package_daemon [3894631:   210] active package: "sed-4.2.1-6-x86_64.hpkg"
1344KERN: package_daemon [3895038:   210] active package: "gawk-4.1.0-1-x86_64.hpkg"
1345KERN: package_daemon [3895452:   210] KERN: active package: "bash-4.4.012-1-x86_64.hpkg"
1346KERN: package_daemon [3895919:   210] active package: "haiku-r1~alpha4_pm_hrev51008-1-x86_64.hpkg"
1347KERN: usb xhci: no devices found
1348KERN: package_daemon [3901381:   210] active package: "haikuwebkit-1.5.4-1-x86_64.hpkg"
1349KERN: package_daemon [3901872:   210] active package: "cvsps-2.2b1-1-x86_64.hpkg"
1350KERN: package_daemon [3902284:   210] active package: "libpcre-8.39-2-x86_64.hpkg"
1351KERN: package_daemon [3902724:   210] active package: "mkdepend-1.7-4-x86_64.hpkg"
1352KERN: package_daemon [3903143:   210] active package: "curl_devel-7.52.1-1-x86_64.hpkg"
1353KERN: package_daemon [3904890:   210] active package: "sharutils-4.15.2-2-x86_64.hpkg"
1354KERN: package_daemon [3905349:   210] active package: "glu-9.0.0-5-x86_64.hpkg"
1355KERN: package_daemon [3905791:   210] active package: "coreutils-8.24-1-x86_64.hpkg"
1356KERN: package_daemon [3906237:   210] active package: "libxml2-2.9.3-4-x86_64.hpkg"
1357KERN: package_daemon [3906691:   210] active package: "libiconv-1.13.1-8-x86_64.hpkg"
1358KERN: package_daemon [3907161:   210] active package: "nasm-2.12.01-1-x86_64.hpkg"
1359KERN: package_daemon [3907580:   210] KERN: active package: "ffmpeg_devel-3.2.2-1-x86_64.hpkg"
1360KERN: package_daemon [3908077:   210] active package: "tar-1.29-2-x86_64.hpkg"
1361KERN: usb uhci: no devices found
1362KERN: usb ohci: no devices found
1363KERN: package_daemon [3913215:   210] active package: "grep-2.24-1-x86_64.hpkg"
1364KERN: package_daemon [3913639:   210] active package: "curl-7.52.1-1-x86_64.hpkg"
1365KERN: package_daemon [3914055:   210] active package: "haiku_devel-r1~alpha4_pm_hrev51008-1-x86_64.hpkg"
1366KERN: package_daemon [3914602:   210] active package: "libexecinfo-1.1-1-x86_64.hpkg"
1367KERN: package_daemon [3915037:   210] active package: "libogg-1.3.2-3-x86_64.hpkg"
1368KERN: package_daemon [3915458:   210] active package: "patch-2.7.5-1-x86_64.hpkg"
1369KERN: package_daemon [3918892:   210] active package: "freetype_devel-2.7.1-1-x86_64.hpkg"
1370KERN: package_daemon [3919377:   210] active package: "tcpdump-4.8.1-1-x86_64.hpkg"
1371KERN: package_daemon [3919843:   210] active package: "gutenprint-5.2.12-1-x86_64.hpkg"
1372KERN: package_daemon [3920290:   210] active package: "freetype-2.7.1-1-x86_64.hpkg"
1373KERN: package_daemon [3920748:   210] active package: "makefile_engine-r1~alpha4_pm_hrev51008-1-any.hpkg"
1374KERN: package_daemon [3921436:   210] KERN: active package: "readline6-6.3.8-1-x86_64.hpkg"
1375KERN: package_daemon [3921945:   210] active package: "libvpx3-1.5.0-1-x86_64.hpkg"
1376KERN: package_daemon [3922368:   210] active package: "git-2.11.0-1-x86_64.hpkg"
1377KERN: package_daemon [3926523:   210] active package: "glu_devel-9.0.0-5-x86_64.hpkg"
1378KERN: package_daemon [3926976:   210] active package: "unzip-6.0-3-x86_64.hpkg"
1379KERN: package_daemon [3927377:   210] active package: "gzip-1.8-1-x86_64.hpkg"
1380KERN: package_daemon [3927784:   210] KERN: usb ehci: no devices found
1381KERN: usb error stack 0: no bus managers available
1382KERN: active package: "icu-57.1-1-x86_64.hpkg"
1383KERN: package_daemon [3931182:   210] active package: "webpositive-r1~alpha4_pm_hrev51008-1-x86_64.hpkg"
1384KERN: package_daemon [3931764:   210] active package: "readline-7.0-1-x86_64.hpkg"
1385KERN: package_daemon [3932188:   210] active package: "libmodplug-0.8.8.5-4-x86_64.hpkg"
1386KERN: package_daemon [3932851:   210] active package: "jpeg_devel-9b-4-x86_64.hpkg"
1387KERN: package_daemon [3933277:   210] active package: "wget-1.18-2-x86_64.hpkg"
1388KERN: package_daemon [3933691:   210] active package: "jasper-1.900.5-2-x86_64.hpkg"
1389KERN: package_daemon [3934122:   210] active package: "libsolv-0.3.0_haiku_2014_12_22-1-x86_64.hpkg"
1390KERN: bfs: bfs_stat_index:2177: No such file or directory
1391Last message repeated 1 time
1392KERN: package_daemon [3937064:   210] KERN: active package: "man-1.6g-4-x86_64.hpkg"
1393KERN: package_daemon [3937982:   210] active package: "libedit-2015_03_21_3.1-5-x86_64.hpkg"
1394KERN: package_daemon [3938455:   210] KERN: active package: "giflib-5.1.2-2-x86_64.hpkg"
1395KERN: package_daemon [3938922:   210] active package: "libpng16_devel-1.6.28-1-x86_64.hpkg"
1396KERN: package_daemon [3939388:   210] active package: "which-2.21-3-x86_64.hpkg"
1397KERN: package_daemon [3939850:   210] active package: "jpeg-9b-4-x86_64.hpkg"
1398KERN: package_daemon [3940242:   210] KERN: active package: "zlib-1.2.11-2-x86_64.hpkg"
1399KERN: package_daemon [3942419:   210] active package: "nano-2.7.2-1-x86_64.hpkg"
1400KERN: package_daemon [3942848:   210] active package: "gettext_libintl-0.19.8.1-3-x86_64.hpkg"
1401KERN: package_daemon [3943332:   210] active package: "qrencode-3.4.4-2-x86_64.hpkg"
1402KERN: package_daemon [3943774:   210] active package: "git_arch-2.11.0-1-x86_64.hpkg"
1403KERN: package_daemon [3944211:   210] active package: "zlib_devel-1.2.11-2-x86_64.hpkg"
1404KERN: wacom: cannot get module "bus_managers/usb/v3"
1405KERN: package_daemon [3948691:   210] active package: "zip-3.0-3-x86_64.hpkg"
1406KERN: package_daemon [3949109:   210] active package: "less-481-1-x86_64.hpkg"
1407KERN: package_daemon [3949510:   210] KERN: active package: "bzip2-1.0.6-5-x86_64.hpkg"
1408KERN: package_daemon [3949974:   210] active package: "noto-20170202-4-any.hpkg"
1409KERN: package_daemon [3950385:   210] active package: "speex-1.2~rc2-3-x86_64.hpkg"
1410KERN: package_daemon [3951304:   210] active package: "noto_sans_cjk_jp-1.004-2-any.hpkg"
1411KERN: package_daemon [3951811:   210] active package: "git_daemon-2.11.0-1-x86_64.hpkg"
1412KERN: package_daemon [3952264:   210] active package: "binutils-2.26.1_2016_07_22-3-x86_64.hpkg"
1413KERN: package_daemon [3952795:   210] active package: "gcc_syslibs-5.4.0_2016_06_04-4-x86_64.hpkg"
1414KERN: package_daemon [3953301:   210] active package: "libicns-0.8.1-5-x86_64.hpkg"
1415KERN: package_daemon [3953735:   210] KERN: active package: "ctags-5.8-4-x86_64.hpkg"
1416KERN: package_daemon [3954190:   210] active package: "openssh-7.4p1-1-x86_64.hpkg"
1417KERN: package_daemon [3954650:   210] active package: "libvorbis-1.3.5-3-x86_64.hpkg"
1418KERN: package_daemon [3955087:   210] active package: "tiff4-4.0.7-1-x86_64.hpkg"
1419KERN: package_daemon [3955500:   210] KERN: active package: "git_email-2.11.0-1-x86_64.hpkg"
1420KERN: package_daemon [3955977:   210] active package: "gcc-5.4.0_2016_06_04-4-x86_64.hpkg"
1421KERN: package_daemon [3956504:   210] active package: "autoconf-2.69-6-x86_64.hpkg"
1422KERN: package_daemon [3956943:   210] active package: "libpcap-1.8.1-2-x86_64.hpkg"
1423KERN: package_daemon [3957366:   210] active package: "openssl-1.0.2k-1-x86_64.hpkg"
1424KERN: package_daemon [3958875:   210] active package: "libtheora-1.1.1-5-x86_64.hpkg"
1425KERN: package_daemon [3959318:   210] active package: "libtool_libltdl-2.4.2-2-x86_64.hpkg"
1426KERN: package_daemon [3959797:   210] active package: "git_svn-2.11.0-1-x86_64.hpkg"
1427KERN: package_daemon [3960226:   210] active package: "bison-3.0.4-3-x86_64.hpkg"
1428KERN: package_daemon [3960649:   210] active package: "automake-1.15.0-1-x86_64.hpkg"
1429KERN: package_daemon [3961085:   210] active package: "libpng16-1.6.28-1-x86_64.hpkg"
1430KERN: package_daemon [3962534:   210] KERN: active package: "p7zip-9.20.1-6-x86_64.hpkg"
1431KERN: package_daemon [3963455:   210] KERN: active package: "haiku_loader-r1~alpha4_pm_hrev51008-1-x86_64.hpkg"
1432KERN: package_daemon [3964061:   210] active package: "mpfr-3.1.4-4-x86_64.hpkg"
1433KERN: package_daemon [3964472:   210] KERN: active package: "sqlite-3.15.2.0-1-x86_64.hpkg"
1434KERN: package_daemon [3964947:   210] active package: "git_cvs-2.11.0-1-x86_64.hpkg"
1435KERN: package_daemon [3965377:   210] active package: "cdrtools-3.02~a07-1-x86_64.hpkg"
1436KERN: package_daemon [3965836:   210] active package: "libtool-2.4.2-2-x86_64.hpkg"
1437KERN: package_daemon [3966260:   210] active package: "libwebp-0.5.2-1-x86_64.hpkg"
1438KERN: package_daemon [3970134:   210] active package: "diffutils-3.5-1-x86_64.hpkg"
1439KERN: package_daemon [3970579:   210] active package: "pe-2.4.5-3-x86_64.hpkg"
1440KERN: package_daemon [3971022:   210] active package: "libxslt-1.1.28-8-x86_64.hpkg"
1441KERN: package_daemon [3971463:   210] active package: "libffi-3.2.1-3-x86_64.hpkg"
1442KERN: package_daemon [3971892:   210] active package: "flex-2.6.1-2-x86_64.hpkg"
1443KERN: package_daemon [3972298:   210] active package: "perl-5.18.2-2-x86_64.hpkg"
1444KERN: package_daemon [3972840:   210] active package: "mesa-13.0.2-1-x86_64.hpkg"
1445KERN: package_daemon [3973255:   210] active package: "expat-2.2.0-2-x86_64.hpkg"
1446KERN: package_daemon [3973704:   210] active package: "vision-0.9.8-2-x86_64.hpkg"
1447KERN: package_daemon [3974125:   210] active package: "python-2.7.12-1-x86_64.hpkg"
1448KERN: package_daemon [3974547:   210] KERN: active package: "openssl_devel-1.0.2k-1-x86_64.hpkg"
1449KERN: package_daemon [3975045:   210] active package: "groff-1.20.1-3-x86_64.hpkg"
1450KERN: package_daemon [3975464:   210] KERN: active package: "jam-2.5_2012_10_12-2-x86_64.hpkg"
1451KERN: package_daemon [3975999:   210] active package: "texinfo-6.1-1-x86_64.hpkg"
1452KERN: package_daemon [3976411:   210] active package: "mesa_devel-13.0.2-1-x86_64.hpkg"
1453KERN: package_daemon [3977357:   210] active package: "ffmpeg-3.2.2-1-x86_64.hpkg"
1454KERN: package_daemon [3977794:   210] active package: "wpa_supplicant-2.0-5-x86_64.hpkg"
1455KERN: package_daemon [3978259:   210] active package: "speex_devel-1.2~rc2-3-x86_64.hpkg"
1456KERN: package_daemon [3978729:   210] active package: "bzip2_devel-1.0.6-5-x86_64.hpkg"
1457KERN: package_daemon [3991024:   210] active package: "ncurses6-6.0-2-x86_64.hpkg"
1458KERN: package_daemon [3991493:   210] KERN: active package: "m4-1.4.17-3-x86_64.hpkg"
1459KERN: package_daemon [3991978:   210] active package: "pkgconfig-0.29.1-1-x86_64.hpkg"
1460KERN: package_daemon [3992612:   210] active package: "netcat-1.10-2-x86_64.hpkg"
1461KERN: package_daemon [3993077:   210] The latest volume state is also the currently active one
1462KERN: package_daemon [3997779:   210] Volume::InitialVerify((nil), (nil))
1463KERN: usb xhci: no devices found
1464KERN: usb uhci: no devices found
1465KERN: usb ohci: no devices found
1466KERN: usb ehci: no devices found
1467KERN: usb error stack 0: no bus managers available
1468KERN: bfs: bfs_stat_index:2177: No such file or directory
1469Last message repeated 1 time
1470KERN: register_domain(4, link)
1471KERN: ps2_hid: init_hardware
1472KERN: ps2_hid: init_driver
1473KERN: ps2_hid: publish_devices
1474KERN: ps2_hid: uninit_driver
1475KERN: loaded driver /boot/system/add-ons/kernel/drivers/dev/input/ps2_hid
1476DAEMON 'DHCP': /dev/net/ipro1000/0: Send DHCP_DISCOVER to 255.255.255.255:67
1477DAEMON 'DHCP': /dev/net/ipro1000/0: Received DHCP_OFFER from 10.0.2.2
1478DAEMON 'DHCP':   your_address: 10.0.2.15
1479DAEMON 'DHCP':   server: 10.0.2.2
1480DAEMON 'DHCP':   subnet: 255.255.255.0
1481DAEMON 'DHCP':   gateway: 10.0.2.2
1482DAEMON 'DHCP':   nameserver[0]: 10.0.2.3
1483DAEMON 'DHCP':   lease time: 86400 seconds
1484DAEMON 'DHCP': /dev/net/ipro1000/0: Send DHCP_REQUEST for 10.0.2.15 to 255.255.255.255:67
1485DAEMON 'DHCP': /dev/net/ipro1000/0: Received DHCP_ACK from 10.0.2.2
1486DAEMON 'DHCP':   server: 10.0.2.2
1487DAEMON 'DHCP':   subnet: 255.255.255.0
1488DAEMON 'DHCP':   gateway: 10.0.2.2
1489DAEMON 'DHCP':   nameserver[0]: 10.0.2.3
1490DAEMON 'DHCP':   lease time: 86400 seconds
1491KERN: package_daemon [4083099:   210] Volume::InitialVerify(): volume at "/boot/system" is consistent
1492KERN: package_daemon [4084186:   210] Failed to open packages activation file: No such file or directory
1493KERN: package_daemon [4084779:   210] Failed to get activated packages info from activated packages file. Assuming all package files in package directory are activated.
1494KERN: package_daemon [4087059:   210] latest volume state:
1495KERN: package_daemon [4087361:   210] The latest volume state is also the currently active one
1496KERN: package_daemon [4088019:   210] Volume::InitialVerify(0x1c3f9ad9d00, (nil))
1497KERN: package_daemon [4092488:   210] bfs: bfs_stat_index:2177: No such file or directory
1498KERN: bfs: bfs_stat_index:2177: No such file or directory
1499KERN: Volume::InitialVerify(): volume at "/boot/home/config" is consistent
1500DAEMON 'DHCP': /dev/net/ipro1000/0: DHCP status = No error
1501KERN: bfs: bfs_stat_index:2177: No such file or directory
1502KERN: Last message repeated 27 times.
1503KERN: Running post install script /boot/system/boot/post-install/fix_openssh_config_paths.sh ...
1504KERN: Running post install script /boot/system/boot/post-install/sshd_keymaker.sh ...
1505KERN: bfs: bfs_stat_index:2177: No such file or directory
1506KERN: Last message repeated 3 times.
1507KERN: usb xhci: no devices found
1508KERN: usb uhci: no devices found
1509KERN: usb ohci: no devices found
1510KERN: usb ehci: no devices found
1511KERN: usb error stack 0: no bus managers available
1512KERN: sis7018:init_hardware:ver:2.0.2
1513KERN: emuxki: init_hardware()
1514KERN: echo3g: init_hardware()
1515KERN: echo3g: no card found
1516KERN: auvia: init_hardware()
1517KERN: auich: init_hardware()
1518KERN: bfs: bfs_stat_index:2177: No such file or directory
1519KERN: Last message repeated 9 times.
1520KERN: ps2: possibly a hot plugin of input/mouse/ps2/0
1521KERN: Last message repeated 57 times.
1522KERN: ALPS not supported: 10 00 64
1523KERN: ps2: probe_mouse Extended PS/2 mouse found
1524KERN: ps2: devfs_publish_device input/mouse/ps2/intelli_0, status = 0x00000000
1525KERN: ps2: devfs_publish_device input/keyboard/at/0, status = 0x00000000
1526KERN: ps2: keyboard found
1527KERN: bfs: bfs_stat_index:2177: No such file or directory
1528Last message repeated 1 time
1529KERN: Last message repeated 2 times.
1530KERN: KDiskDeviceManager::_ScanPartition(/dev/disk/ata/0/master/1)
1531KERN: intel: ep_std_ops(0x1)
1532KERN:   trying: partitioning_systems/intel/extended/v1
1533KERN: intel: ep_identify_partition(34, 105906176, 127929753088, 512)
1534KERN:   returned: -1
1535KERN: intel: ep_std_ops(0x2)
1536KERN:   trying: partitioning_systems/session/v1
1537KERN:   returned: -1
1538KERN:   trying: partitioning_systems/intel/map/v1
1539KERN: intel: pm_identify_partition(34, 4: 105906176, 127929753088, 512)
1540KERN:   returned: -1
1541KERN:   trying: file_systems/devfs/v1
1542KERN:   returned: -1
1543KERN:   trying: file_systems/attribute_overlay/v1
1544KERN:   returned: -1
1545KERN:   trying: file_systems/rootfs/v1
1546KERN:   returned: -1
1547KERN:   trying: file_systems/packagefs/v1
1548KERN:   returned: -1
1549KERN:   trying: file_systems/iso9660/v1
1550KERN: identify(34, 0xffffffff88fcff18)
1551KERN:   returned: -1
1552KERN:   trying: file_systems/write_overlay/v1
1553KERN:   returned: -1
1554KERN:   trying: file_systems/bfs/v1
1555KERN:   returned: 0.8
1556KERN:   trying: partitioning_systems/efi_gpt/v1
1557KERN:   returned: -1
1558KERN:   trying: file_systems/nfs4/v1
1559KERN:   returned: -1
1560KERN:   trying: file_systems/nfs/v1
1561KERN:   returned: -1
1562KERN:   trying: file_systems/cdda/v1
1563KERN: raw_command:
1564KERN:   returned: -1
1565KERN:   trying: file_systems/udf/v1
1566KERN: udf_recognize: Invalid sequence. status = -1
1567KERN:   returned: -1
1568KERN:   trying: file_systems/ntfs/v1
1569KERN: fs_identify_partition: boot signature NTFS doesn't match
1570KERN:   returned: -1
1571KERN:   trying: file_systems/log_overlay/v1
1572KERN:   returned: -1
1573KERN:   trying: file_systems/fat/v1
1574KERN:   returned: -1
1575KERN:   trying: file_systems/ext2/v1
1576KERN: [34mext2:[0m invalid superblock!
1577KERN:   returned: -1
1578KERN:   trying: file_systems/exfat/v1
1579KERN: [34mexfat:[0m invalid superblock!
1580KERN:   returned: -1
1581KERN:   trying: file_systems/btrfs/v1
1582KERN: [34mbtrfs:[0m invalid superblock!
1583KERN:   returned: -1
1584KERN:   trying: file_systems/bindfs/v1
1585KERN:   returned: -1
1586KERN:   scanning with: file_systems/bfs/v1
1587KERN: bfs: mounted "Haiku" (root node at 524288, device = /dev/disk/ata/0/master/1)
1588KERN: bfs: bfs_create_index:2135: File or Directory already exists
1589KERN: bfs: bfs_stat_index:2177: No such file or directory
1590Last message repeated 1 time
1591KERN: bfs: bfs_create_index:2135: File or Directory already exists
1592KERN: oller
1593KERN: add_memory_type_range(945, 0xfe500000, 0x8000, 0)
1594KERN: allocate_io_interrupt_vectors: allocated 1 vectors starting from 57
1595KERN: msi_allocate_vectors: allocated 1 vectors starting from 57
1596KERN: msi enabled: 0x0087
1597KERN: usb xhci -1: using message signaled interrupts
1598KERN: usb xhci -1: starting XHCI host controller
1599KERN: usb xhci -1: successfully started the controller
1600KERN: add_memory_type_range(966, 0xfe100000, 0x100000, 0)
1601KERN: allocate_io_interrupt_vectors: allocated 1 vectors starting from 58
1602KERN: msi_allocate_vectors: allocated 1 vectors starting from 58
1603KERN: msi enabled: 0x0087
1604KERN: usb xhci -1: using message signaled interrupts
1605KERN: usb xhci -1: starting XHCI host controller
1606KERN: usb xhci -1: successfully started the controller
1607KERN: usb uhci: no devices found
1608KERN: usb ohci: no devices found
1609KERN: usb ehci: no devices found
1610KERN: usb hub 2: port 21: new device connected
1611KERN: usb xhci -1: cancel queued transfers for pipe 0xffffffff801ffe30 (0)
1612KERN: usb hub 7: port 1 is not suspended
1613KERN: usb hub 7: port 1 is not in an over current state
1614KERN: usb hub 7: port 1 was reset
1615KERN: usb hub 7: port 2: new device connected
1616KERN: usb xhci -1: cancel queued transfers for pipe 0xffffffff801ffe30 (0)
1617KERN: usb hub 7: port 3: new device connected
1618KERN: usb error control pipe 29: timeout waiting for queued request to complete
1619KERN: usb xhci -1: cancel queued transfers for pipe 0xffffffff801ffe30 (0)
1620KERN: usb error xhci -1: error while getting the hub descriptor
1621KERN: usb xhci -1: cancel queued transfers for pipe 0xffffffff801ffe30 (0)
1622KERN: usb error control pipe 30: timeout waiting for queued request to complete
1623KERN: usb xhci -1: cancel queued transfers for pipe 0xffffffff801ffe30 (0)
1624KERN: usb error xhci -1: error while getting the hub descriptor
1625KERN: usb xhci -1: cancel queued transfers for pipe 0xffffffff801ffe30 (0)
1626KERN: usb hub 12: port 3: new device connected
1627KERN: usb error xhci -1: unsuccessful command Parameter (17)
1628KERN: usb error xhci -1: unable to set address
1629KERN: usb error xhci -1: unsuccessful command Parameter (17)
1630KERN: usb error xhci -1: unable to set address
1631KERN: get_boot_partitions(): boot volume message:
1632KERN: KMessage: buffer: 0xffffffff824d71d0 (size/capacity: 299/299), flags: 0xa
1633KERN:   field: "partition offset"  (LLNG): 105906176 (0x6500000)
1634KERN:   field: "packaged"          (BOOL): true
1635KERN:   field: "boot method"       (LONG): 0 (0x0)
1636KERN:   field: "booted from image" (BOOL): false
1637KERN:   field: "disk identifier"   (RAWT): data at 0xffffffff824d72ac, 79 bytes
1638KERN: get_boot_partitions(): boot method type: 0
1639KERN: partitioning system: partitioning_systems/intel/extended/v1
1640KERN: KDiskDeviceManager::_AddDiskSystem(partitioning_systems/intel/extended/v1)
1641KERN: intel: ep_std_ops(0x1)
1642KERN: intel: ep_std_ops(0x2)
1643KERN: KDiskDeviceManager::_AddDiskSystem() done: No error
1644KERN: partitioning system: partitioning_systems/intel/map/v1
1645KERN: KDiskDeviceManager::_AddDiskSystem(partitioning_systems/intel/map/v1)
1646KERN: intel: pm_std_ops(0x1)
1647KERN: intel: pm_std_ops(0x2)
1648KERN: KDiskDeviceManager::_AddDiskSystem() done: No error
1649KERN: partitioning system: partitioning_systems/efi_gpt/v1
1650KERN: KDiskDeviceManager::_AddDiskSystem(partitioning_systems/efi_gpt/v1)
1651KERN: KDiskDeviceManager::_AddDiskSystem() done: No error
1652KERN: file system: file_systems/devfs/v1
1653KERN: KDiskDeviceManager::_AddDiskSystem(file_systems/devfs/v1)
1654KERN: KDiskDeviceManager::_AddDiskSystem() done: No error
1655KERN: file system: file_systems/rootfs/v1
1656KERN: KDiskDeviceManager::_AddDiskSystem(file_systems/rootfs/v1)
1657KERN: KDiskDeviceManager::_AddDiskSystem() done: No error
1658KERN: file system: file_systems/packagefs/v1
1659KERN: KDiskDeviceManager::_AddDiskSystem(file_systems/packagefs/v1)
1660KERN: KDiskDeviceManager::_AddDiskSystem() done: No error
1661KERN: file system: file_systems/bfs/v1
1662KERN: KDiskDeviceManager::_AddDiskSystem(file_systems/bfs/v1)
1663KERN: KDiskDeviceManager::_AddDiskSystem() done: No error
1664KERN: number of disk systems: 7
1665KERN: KDiskDeviceManager::_Scan(/dev/disk)
1666KERN: ahci: generic AHCI controller found! vendor 0x1022, device 0x7901
1667KERN: ahci: ahci_register_device
1668KERN: ahci: ahci_init_driver
1669KERN: ahci: ahci_sim_init_bus
1670KERN: ahci: ahci_sim_init_bus: pciDevice 0xffffffff82d824b0
1671KERN: ahci: AHCIController::Init 42:0:2 vendor 1022, device 7901
1672KERN: ahci: PCI SATA capability found at offset 0xd0
1673KERN: ahci: satacr0 = 0x00100012, satacr1 = 0x0000000f
1674KERN: ahci: pcicmd old 0x0007
1675KERN: ahci: pcicmd new 0x0006
1676KERN: allocate_io_interrupt_vectors: allocated 1 vectors starting from 59
1677KERN: msi_allocate_vectors: allocated 1 vectors starting from 59
1678KERN: msi enabled: 0x0089
1679KERN: ahci: using MSI vector 59
1680KERN: ahci: registers at 0xfe708000, size 0x1000
1681KERN: ahci: mapping physical address 0xfe708000 with 4096 bytes for AHCI HBA regs
1682KERN: add_memory_type_range(1006, 0xfe708000, 0x1000, 0)
1683KERN: ahci: physical = 0xfe708000, virtual = 0xffffffff8244f000, offset = 0, phyadr = 0xfe708000, mapadr = 0xffffffff8244f000, size = 4096, area = 0x000003ee
1684KERN: ahci: cap: Interface Speed Support: generation 3
1685KERN: ahci: cap: Number of Command Slots: 32 (raw 0x1f)
1686KERN: ahci: cap: Number of Ports: 1 (raw 0x0)
1687KERN: ahci: cap: Supports Port Multiplier: yes
1688KERN: ahci: cap: Supports External SATA: no
1689KERN: ahci: cap: Enclosure Management Supported: no
1690KERN: ahci: cap: FIS-based Switching Control: yes
1691KERN: ahci: cap: Supports Command List Override: yes
1692KERN: ahci: cap: Supports Staggered Spin-up: no
1693KERN: ahci: cap: Supports Mechanical Presence Switch: yes
1694KERN: ahci: cap: Supports 64-bit Addressing: yes
1695KERN: ahci: cap: Supports Native Command Queuing: yes
1696KERN: ahci: cap: Supports SNotification Register: yes
1697KERN: ahci: cap: Supports Command List Override: yes
1698KERN: ahci: cap: Supports AHCI mode only: yes
1699KERN: ahci: cap2: DevSleep Entrance from Slumber Only: no
1700KERN: ahci: cap2: Supports Aggressive Device Sleep Management: no
1701KERN: ahci: cap2: Supports Device Sleep: no
1702KERN: ahci: cap2: Automatic Partial to Slumber Transitions: no
1703KERN: ahci: cap2: NVMHCI Present: no
1704KERN: ahci: cap2: BIOS/OS Handoff: no
1705KERN: ahci: ghc: AHCI Enable: yes
1706KERN: ahci: Ports Implemented Mask: 0x000001 Number of Available Ports: 1
1707KERN: ahci: AHCI Version 0001.03.01 Interrupt 59
1708KERN: ahci: allocating 4096 bytes for AHCI port 0
1709KERN: ahci: area = 1007, size = 4096, virt = 0xffffffff82450000, phy = 0x1598000
1710KERN: usb hub 7: port 1 is not suspended
1711KERN: usb hub 7: port 1 is not in an over current state
1712KERN: usb hub 7: port 1 was reset
1713KERN: ahci: PortReset: port 0 undergoing COMRESET
1714KERN: usb hub 7: port 1 is not suspended
1715KERN: usb hub 7: ahci: cookie = 0xffffffff82ab4600
1716KERN: port 1 is not in an over current state
1717KERN: ahci: ahci_path_inquiry, cookie 0xffffffff82ab4600
1718KERN: usb hub 7: ahci: ahci_path_inquiry, cookie 0xffffffff82ab4600
1719KERN: port 1 was reset
1720KERN: ahci: ahci_scan_bus, cookie 0xffffffff82ab4600
1721KERN: ahci: generic AHCI controller found! vendor 0x1022, device 0x43b5
1722KERN: ahci: ahci_register_device
1723KERN: ahci: ahci_init_driver
1724KERN: ahci: ahci_sim_init_bus
1725KERN: ahci: ahci_sim_init_bus: pciDevice 0xffffffff82d786f0
1726KERN: ahci: AHCIController::Init 3:0:1 vendor 1022, device 43b5
1727KERN: ahci: pcicmd old 0x0006
1728KERN: ahci: pcicmd new 0x0006
1729KERN: allocate_io_interrupt_vectors: allocated 1 vectors starting from 60
1730KERN: msi_allocate_vectors: allocated 1 vectors starting from 60
1731KERN: msi enabled: 0x0081
1732KERN: ahci: using MSI vector 60
1733KERN: ahci: registers at 0xfe680000, size 0x20000
1734KERN: ahci: mapping physical address 0xfe680000 with 131072 bytes for AHCI HBA regs
1735KERN: add_memory_type_range(1011, 0xfe680000, 0x20000, 0)
1736KERN: ahci: physical = 0xfe680000, virtual = 0xffffffff81820000, offset = 0, phyadr = 0xfe680000, mapadr = 0xffffffff81820000, size = 131072, area = 0x000003f3
1737KERN: ahci: cap: Interface Speed Support: generation 3
1738KERN: ahci: cap: Number of Command Slots: 32 (raw 0x1f)
1739KERN: ahci: cap: Number of Ports: 8 (raw 0x7)
1740KERN: ahci: cap: Supports Port Multiplier: yes
1741KERN: ahci: cap: Supports External SATA: yes
1742KERN: ahci: cap: Enclosure Management Supported: no
1743KERN: ahci: cap: FIS-based Switching Control: no
1744KERN: ahci: cap: Supports Command List Override: yes
1745KERN: ahci: cap: Supports Staggered Spin-up: yes
1746KERN: ahci: cap: Supports Mechanical Presence Switch: no
1747KERN: ahci: cap: Supports 64-bit Addressing: yes
1748KERN: ahci: cap: Supports Native Command Queuing: yes
1749KERN: ahci: cap: Supports SNotification Register: yes
1750KERN: ahci: cap: Supports Command List Override: yes
1751KERN: ahci: cap: Supports AHCI mode only: yes
1752KERN: ahci: cap2: DevSleep Entrance from Slumber Only: yes
1753KERN: ahci: cap2: Supports Aggressive Device Sleep Management: yes
1754KERN: ahci: cap2: Supports Device Sleep: yes
1755KERN: ahci: cap2: Automatic Partial to Slumber Transitions: yes
1756KERN: ahci: cap2: NVMHCI Present: no
1757KERN: ahci: cap2: BIOS/OS Handoff: no
1758KERN: ahci: ghc: AHCI Enable: yes
1759KERN: ahci: Ports Implemented Mask: 0x0000ff Number of Available Ports: 8
1760KERN: ahci: AHCI Version 0001.03.01 Interrupt 60
1761KERN: ahci: allocating 4096 bytes for AHCI port 0
1762KERN: ahci: area = 1012, size = 4096, virt = 0xffffffff824570KERN: 00, phy = 0x16ba000
1763KERN: ahci: allocating 4096 bytes for AHCI port 1
1764KERN: ahci: area = 1013, size = 4096, virt = 0xffffffff82458000, phy = 0x16b9000
1765KERN: ahci: allocating 4096 bytes for AHCI port 2
1766KERN: ahci: area = 1014, size = 4096, virt = 0xffffffff82459000, phy = 0x16b8000
1767KERN: ahci: allocating 4096 bytes for AHCI port 3
1768KERN: ahci: area = 1015, size = 4096, virt = 0xffffffff8180c000, phy = 0x16b7000
1769KERN: ahci: allocating 4096 bytes for AHCI port 4
1770KERN: ahci: area = 1016, size = 4096, virt = 0xffffffff8180d000, phy = 0x16cb000
1771KERN: ahci: allocating 4096 bytes for AHCI port 5
1772KERN: ahci: area = 1017, size = 4096, virt = 0xffffffff8180e000, phy = 0x16ca000
1773KERN: ahci: allocating 4096 bytes for AHCI port 6
1774KERN: ahci: area = 1018, size = 4096, virt = 0xffffffff8180f000, phy = 0x16c9000
1775KERN: ahci: allocating 4096 bytes for AHCI port 7
1776KERN: ahci: area = 1019, size = 4096, virt = 0xffffffff81810000, phy = 0x16c8000
1777KERN: usb hub 7: port 1 is not suspended
1778KERN: usb hub 7: port 1 is not in an over current state
1779KERN: usb hub 7: port 1 was reset
1780KERN: ahci: PortReset: port 0 undergoing COMRESET
1781KERN: ahci: Probe: port 1 link speed 6.0Gb/s
1782KERN: usb hub 7: port 1 is not suspended
1783KERN: usb hub 7: port 1 is not in an over current state
1784KERN: usb hub 7: port 1 was reset
1785KERN: ahci: PortReset: port 2 undergoing COMRESET
1786KERN: usb hub 7: port 1 is not suspended
1787KERN: usb hub 7: port 1 is not in an over current state
1788KERN: usb hub 7: port 1 was reset
1789KERN: usb hub 7: port 1 is not suspended
1790KERN: usb hub 7: port 1 is not in an over current state
1791KERN: usb hub 7: port 1 was reset
1792KERN: ahci: PortReset: port 3 undergoing COMRESET
1793KERN: ahci: Probe: port 4 link speed 6.0Gb/s
1794KERN: ahci: Probe: port 5 link speed 6.0Gb/s
1795KERN: usb hub 7: port 1 is not suspended
1796KERN: usb hub 7: port 1 is not in an over current state
1797KERN: usb hub 7: port 1 was reset
1798KERN: ahci: PortReset: port 6 undergoing COMRESET
1799KERN: usb hub 7: port 1 is not suspended
1800KERN: usb hub 7: port 1 is not in an over current state
1801KERN: usb hub 7: port 1 was reset
1802KERN: usb hub 7: port 1 is not suspended
1803KERN: usb hub 7: port 1 is not in an over current state
1804KERN: usb hub 7: port 1 was reset
1805KERN: ahci: PortReset: port 7 undergoing COMRESET
1806KERN: usb hub 7: port 1 is not suspended
1807KERN: usb hub 7: port 1 is not in an over current state
1808KERN: usb hub 7: port 1 was reset
1809KERN: ahci: cookie = 0xffffffff82ab4480
1810KERN: ahci: ahci_path_inquiry, cookie 0xffffffff82ab4480
1811Last message repeated 1 time
1812KERN: ahci: ahci_scan_bus, cookie 0xffffffff82ab4480
1813KERN: ahci: sg_memcpy phyAddr 0x473190, size 96
1814KERN: ahci: ahci_get_restrictions, cookie 0xffffffff82ab4480
1815KERN: publish device: node 0xffffffff82df3840, path disk/scsi/1/1/0/raw, module drivers/disk/scsi/scsi_disk/device_v1
1816KERN: ahci: sg_memcpy phyAddr 0x473190, size 96
1817KERN: ahci: ahci_get_restrictions, cookie 0xffffffff82ab4480
1818KERN: publish device: node 0xffffffff82df3340, path disk/scsi/1/4/0/raw, module drivers/disk/scsi/scsi_disk/device_v1
1819KERN: ahci: sg_memcpy phyAddr 0x473190, size 96
1820KERN: ahci: ahci_get_restrictions, cookie 0xffffffff82ab4480
1821KERN: publish device: node 0xffffffff82dfaf28, path disk/scsi/1/5/0/raw, module drivers/disk/scsi/scsi_disk/device_v1
1822KERN: KDiskDeviceManager::_Scan(/dev/disk/scsi)
1823KERN: KDiskDeviceManager::_Scan(/dev/disk/scsi/1)
1824KERN: KDiskDeviceManager::_Scan(/dev/disk/scsi/1/1)
1825KERN: KDiskDeviceManager::_Scan(/dev/disk/scsi/1/1/0)
1826KERN: KDiskDeviceManager::_Scan(/dev/disk/scsi/1/1/0/raw)
1827KERN:   found device: /dev/disk/scsi/1/1/0/raw
1828KERN: ahci: sg_memcpy phyAddr 0x473270, size 8
1829KERN: DMAResource@0xffffffff82df37a0: low/high 0/100000000, max segment count 32, align 2, boundary 65536, max transfer 130560, max segment size 33554432
1830KERN: slab memory manager: created area 0xffffffffb1001000 (1025)
1831KERN: ahci: sg_memcpy phyAddr 0x473290, size 8
1832KERN: ahci: ahci_ioctl, cookie 0xffffffff82ab4480
1833KERN: KDiskDeviceManager::_Scan(/dev/disk/scsi/1/4)
1834KERN: KDiskDeviceManager::_Scan(/dev/disk/scsi/1/4/0)
1835KERN: KDiskDeviceManager::_Scan(/dev/disk/scsi/1/4/0/raw)
1836KERN:   found device: /dev/disk/scsi/1/4/0/raw
1837KERN: ahci: sg_memcpy phyAddr 0x473270, size 8
1838KERN: DMAResource@0xffffffff82df32a0: low/high 0/100000000, max segment count 32, align 2, boundary 65536, max transfer 130560, max segment size 33554432
1839KERN: ahci: sg_memcpy phyAddr 0x473290, size 8
1840KERN: ahci: ahci_ioctl, cookie 0xffffffff82ab4480
1841KERN: KDiskDeviceManager::_Scan(/dev/disk/scsi/1/5)
1842KERN: KDiskDeviceManager::_Scan(/dev/disk/scsi/1/5/0)
1843KERN: KDiskDeviceManager::_Scan(/dev/disk/scsi/1/5/0/raw)
1844KERN:   found device: /dev/disk/scsi/1/5/0/raw
1845KERN: ahci: sg_memcpy phyAddr 0x473270, size 8
1846KERN: DMAResource@0xffffffff82dfae88: low/high 0/100000000, max segment count 32, align 2, boundary 65536, max transfer 130560, max segment size 33554432
1847KERN: ahci: sg_memcpy phyAddr 0x473290, size 8
1848KERN: ahci: ahci_ioctl, cookie 0xffffffff82ab4480
1849KERN: KDiskDeviceManager::_ScanPartition(/dev/disk/scsi/1/1/0/raw)
1850KERN: intel: ep_std_ops(0x1)
1851KERN:   trying: partitioning_systems/intel/extended/v1
1852KERN:   returned: -1
1853KERN: intel: ep_std_ops(0x2)
1854KERN: intel: pm_std_ops(0x1)
1855KERN:   trying: partitioning_systems/intel/map/v1
1856KERN: intel: pm_identify_partition(0, 0: 0, 128035676160, 512)
1857KERN: intel: Found GPT signature, ignoring.
1858KERN:   returned: -1
1859KERN: intel: pm_std_ops(0x2)
1860KERN:   trying: partitioning_systems/efi_gpt/v1
1861KERN: EFI header: EFI PART
1862KERN: EFI revision: 10000
1863KERN: header size: 92
1864KERN: header CRC: f28b4ab4
1865KERN: absolute block: 1
1866KERN: alternate block: 250069679
1867KERN: first usable block: 34
1868KERN: last usable block: 250069646
1869KERN: disk GUID: afead161-9d0f-4845-b98a-8fde09c0ed3f
1870KERN: entries block: 2
1871KERN: entry size:  128
1872KERN: entry count: 128
1873KERN: entries CRC: 549edf52
1874KERN: EFI header: EFI PART
1875KERN: EFI revision: 10000
1876KERN: header size: 92
1877KERN: header CRC: f33c2dde
1878KERN: absolute block: 250069679
1879KERN: alternate block: 1
1880KERN: first usable block: 34
1881KERN: last usable block: 250069646
1882KERN: disk GUID: afead161-9d0f-4845-b98a-8fde09c0ed3f
1883KERN: entries block: 250069647
1884KERN: entry size:  128
1885KERN: entry count: 128
1886KERN: entries CRC: 549edf52
1887KERN: [  0] partition type: c12a7328-f81f-11d2-ba4b-00a0c93ec93b
1888KERN:       unique id: 6abb4ee0-05c7-4790-8105-9beeb07969a0
1889KERN:       start block: 2048
1890KERN:       end block: 206847
1891KERN:       size: 99.999 MB
1892KERN:       attributes: 0
1893KERN:       name: EFI System
1894KERN: [  1] partition type: 42465331-3ba3-10f1-802a-4861696b7521
1895KERN:       unique id: 371ef677-9275-47be-b42f-e94a5c599a03
1896KERN:       start block: 206848
1897KERN:       end block: 250069646
1898KERN:       size: 122003.319 MB
1899KERN:       attributes: 0
1900KERN:       name: Haiku
1901KERN:   returned: 0.959
1902KERN:   trying: file_systems/devfs/v1
1903KERN:   returned: -1
1904KERN:   trying: file_systems/rootfs/v1
1905KERN:   returned: -1
1906KERN:   trying: file_systems/packagefs/v1
1907KERN:   returned: -1
1908KERN:   trying: file_systems/bfs/v1
1909KERN:   returned: -1
1910KERN:   scanning with: partitioning_systems/efi_gpt/v1
1911KERN: efi_gpt_scan_partition(cookie = 0xffffffff82810e00)
1912KERN: KDiskDeviceManager::_ScanPartition(/dev/disk/scsi/1/1/0/0)
1913KERN: intel: ep_std_ops(0x1)
1914KERN:   trying: partitioning_systems/intel/extended/v1
1915KERN:   returned: -1
1916KERN: intel: ep_std_ops(0x2)
1917KERN: intel: pm_std_ops(0x1)
1918KERN:   trying: partitioning_systems/intel/map/v1
1919KERN: intel: pm_identify_partition(0, 3: 1048576, 104857600, 512)
1920KERN:   returned: -1
1921KERN: intel: pm_std_ops(0x2)
1922KERN:   trying: partitioning_systems/efi_gpt/v1
1923KERN:   returned: -1
1924KERN:   trying: file_systems/devfs/v1
1925KERN:   returned: -1
1926KERN:   trying: file_systems/rootfs/v1
1927KERN:   returned: -1
1928KERN:   trying: file_systems/packagefs/v1
1929KERN:   returned: -1
1930KERN:   trying: file_systems/bfs/v1
1931KERN:   returned: -1
1932KERN: KDiskDeviceManager::_ScanPartition(/dev/disk/scsi/1/1/0/1)
1933KERN: intel: ep_std_ops(0x1)
1934KERN:   trying: partitioning_systems/intel/extended/v1
1935KERN: intel: ep_identify_partition(0, 105906176, 127929753088, 512)
1936KERN:   returned: -1
1937KERN: intel: ep_std_ops(0x2)
1938KERN: intel: pm_std_ops(0x1)
1939KERN:   trying: partitioning_systems/intel/map/v1
1940KERN: intel: pm_identify_partition(0, 4: 105906176, 127929753088, 512)
1941KERN:   returned: -1
1942KERN: intel: pm_std_ops(0x2)
1943KERN:   trying: partitioning_systems/efi_gpt/v1
1944KERN:   returned: -1
1945KERN:   trying: file_systems/devfs/v1
1946KERN:   returned: -1
1947KERN:   trying: file_systems/rootfs/v1
1948KERN:   returned: -1
1949KERN:   trying: file_systems/packagefs/v1
1950KERN:   returned: -1
1951KERN:   trying: file_systems/bfs/v1
1952KERN:   returned: 0.8
1953KERN:   scanning with: file_systems/bfs/v1
1954KERN: KDiskDeviceManager::_ScanPartition(/dev/disk/scsi/1/4/0/raw)
1955KERN: intel: ep_std_ops(0x1)
1956KERN:   trying: partitioning_systems/intel/extended/v1
1957KERN:   returned: -1
1958KERN: intel: ep_std_ops(0x2)
1959KERN: intel: pm_std_ops(0x1)
1960KERN:   trying: partitioning_systems/intel/map/v1
1961KERN: intel: pm_identify_partition(0, 1: 0, 750156374016, 512)
1962KERN: usb hub 7: port 1 is not suspended
1963KERN: usb hub 7: port 1 is not in an over current state
1964KERN: usb hub 7: port 1 was reset
1965KERN: intel: Found GPT signature, ignoring.
1966KERN:   returned: -1
1967KERN: intel: pm_std_ops(0x2)
1968KERN:   trying: partitioning_systems/efi_gpt/v1
1969KERN: EFI header: EFI PART
1970KERN: EFI revision: 10000
1971KERN: header size: 92
1972KERN: header CRC: a6464145
1973KERN: absolute block: 1
1974KERN: alternate block: 1465149167
1975KERN: first usable KERN: block: 34
1976KERN: last usable block: 1465149134
1977KERN: disk GUID: 99ce833c-ca7d-4988-8b32-a0536bbd3c98
1978KERN: entries block: 2
1979KERN: entry size:  128
1980KERN: entry count: 128
1981KERN: entries CRC: ab54d286
1982KERN: EFI header: EFI PART
1983KERN: EFI revision: 10000
1984KERN: header size: 92
1985KERN: header CRC: 3a46d7f6
1986KERN: absolute block: 1465149167
1987KERN: alternate block: 1
1988KERN: first usable block: 34
1989KERN: last usable block: 1465149134
1990KERN: disk GUID: 99ce833c-ca7d-4988-8b32-a0536bbd3c98
1991KERN: entries block: 1465149135
1992KERN: entry size:  128
1993KERN: entry count: 128
1994KERN: entries CRC: ab54d286
1995KERN:   returned: 0.959
1996KERN:   trying: file_systems/devfs/v1
1997KERN:   returned: -1
1998KERN:   trying: file_systems/rootfs/v1
1999KERN:   returned: -1
2000KERN:   trying: file_systems/packagefs/v1
2001KERN:   returned: -1
2002KERN:   trying: file_systems/bfs/v1
2003KERN:   returned: -1
2004KERN:   scanning with: partitioning_systems/efi_gpt/v1
2005KERN: efi_gpt_scan_partition(cookie = 0xffffffff82810d20)
2006KERN: KDiskDeviceManager::_ScanPartition(/dev/disk/scsi/1/5/0/raw)
2007KERN: intel: ep_std_ops(0x1)
2008KERN:   trying: partitioning_systems/intel/extended/v1
2009KERN:   returned: -1
2010KERN: intel: ep_std_ops(0x2)
2011KERN: intel: pm_std_ops(0x1)
2012KERN:   trying: partitioning_systems/intel/map/v1
2013KERN: intel: pm_identify_partition(0, 2: 0, 750156374016, 512)
2014KERN: intel: Found GPT signature, ignoring.
2015KERN:   returned: -1
2016KERN: intel: pm_std_ops(0x2)
2017KERN:   trying: partitioning_systems/efi_gpt/v1
2018KERN: EFI header: EFI PART
2019KERN: EFI revision: 10000
2020KERN: header size: 92
2021KERN: header CRC: 1f82d684
2022KERN: absolute block: 1
2023KERN: alternate block: 1465149167
2024KERN: first usable block: 34
2025KERN: last usable block: 1465149134
2026KERN: disk GUID: 4f9f3823-01b2-499a-8556-423073a9d12a
2027KERN: entries block: 2
2028KERN: entry size:  128
2029KERN: entry count: 128
2030KERN: entries CRC: 145b6e6e
2031KERN: EFI header: EFI PART
2032KERN: EFI revision: 10000
2033KERN: header size: 92
2034KERN: header CRC: 83824037
2035KERN: absolute block: 1465149167
2036KERN: alternate block: 1
2037KERN: first usable block: 34
2038KERN: last usable block: 1465149134
2039KERN: disk GUID: 4f9f3823-01b2-499a-8556-423073a9d12a
2040KERN: entries block: 1465149135
2041KERN: entry size:  128
2042KERN: entry count: 128
2043KERN: entries CRC: 145b6e6e
2044KERN: [  0] partition type: 0fc63daf-8483-4772-8e79-3d69d8477de4
2045KERN:       unique id: 67fc6a57-4713-4fe9-9fae-11b6f08f5938
2046KERN:       start block: 2048
2047KERN:       end block: 1465147391
2048KERN:       size: 715402.999 MB
2049KERN:       attributes: 0
2050KERN:       name:
2051KERN:   returned: 0.959
2052KERN:   trying: file_systems/devfs/v1
2053KERN:   returned: -1
2054KERN:   trying: file_systems/rootfs/v1
2055KERN:   returned: -1
2056KERN:   trying: file_systems/packagefs/v1
2057KERN:   returned: -1
2058KERN:   trying: file_systems/bfs/v1
2059KERN:   returned: -1
2060KERN:   scanning with: partitioning_systems/efi_gpt/v1
2061KERN: efi_gpt_scan_partition(cookie = 0xffffffff82810c40)
2062KERN: KDiskDeviceManager::_ScanPartition(/dev/disk/scsi/1/5/0/0)
2063KERN: intel: ep_std_ops(0x1)
2064KERN:   trying: partitioning_systems/intel/extended/v1
2065KERN:   returned: -1
2066KERN: intel: ep_std_ops(0x2)
2067KERN: intel: pm_std_ops(0x1)
2068KERN: usb hub 7:   trying: partitioning_systems/intel/map/v1
2069KERN: port 1 is not suspended
2070KERN: intel: pm_identify_partition(0, 5: 1048576, 750154416128, 512)
2071KERN: usb hub 7:   returned: -1
2072KERN: port 1 is not in an over current state
2073KERN: intel: pm_std_ops(0x2)
2074KERN: usb hub 7:   trying: partitioning_systems/efi_gpt/v1
2075KERN: port 1 was reset
2076KERN:   returned: -1
2077KERN:   trying: file_systems/devfs/v1
2078KERN:   returned: -1
2079KERN:   trying: file_systems/rootfs/v1
2080KERN:   returned: -1
2081KERN:   trying: file_systems/packagefs/v1
2082KERN:   returned: -1
2083KERN:   trying: file_systems/bfs/v1
2084KERN:   returned: -1
2085KERN: device 0: /dev/disk/scsi/1/1/0/raw
2086KERN:   media status:      No error
2087KERN:   device flags:      2
2088KERN:   offset:            0
2089KERN:   size:              128035676160 (122104.335 MB)
2090KERN:   content size:      128035676160
2091KERN:   block size:        512
2092KERN:   child count:       2
2093KERN:   index:             -1
2094KERN:   status:            0
2095KERN:   flags:             5
2096KERN:   volume:            -1
2097KERN:   disk system:       partitioning_systems/efi_gpt/v1
2098KERN:   name:              SanDisk SD6SB1M-128G-100
2099KERN:   content name:      <NULL>
2100KERN:   type:              <NULL>
2101KERN:   content type:      GUID Partition Map
2102KERN:   params:            <NULL>
2103KERN:   content params:    <NULL>
2104KERN:   partition 3: /dev/disk/scsi/1/1/0/0
2105KERN:     offset:            1048576
2106KERN:     size:              104857600 (100 MB)
2107KERN:     content size:      0
2108KERN:     block size:        512
2109KERN:     child count:       0
2110KERN:     index:             0
2111KERN:     status:            2
2112KERN:     flags:             0
2113KERN:     volume:            -1
2114KERN:     disk system:       <NULL>
2115KERN:     name:              EFI System
2116KERN:     content name:      <NULL>
2117KERN:     type:              EFI system data
2118KERN:     content type:      <NULL>
2119KERN:     params:            <NULL>
2120KERN:     content params:    <NULL>
2121KERN:   partition 4: /dev/disk/scsi/1/1/0/1
2122KERN:     offset:            105906176
2123KERN:     size:              127929753088 (122003.319 MB)
2124KERN:     content size:      127929751552
2125KERN:     block size:        2048
2126KERN:     child count:       0
2127KERN:     index:             1
2128KERN:     status:            0
2129KERN:     flags:             2
2130KERN:     volume:            -1
2131KERN:     disk system:       file_systems/bfs/v1
2132KERN:     name:              Haiku
2133KERN:     content name:      Haiku
2134KERN:     type:              Be File System
2135KERN:     content type:      Be File System
2136KERN:     params:            <NULL>
2137KERN:     content params:    <NULL>
2138KERN: device 1: /dev/disk/scsi/1/4/0/raw
2139KERN:   media status:      No error
2140KERN:   device flags:      2
2141KERN:   offset:            0
2142KERN:   size:              750156374016 (715404.867 MB)
2143KERN:   content size:      750156374016
2144KERN:   block size:        512
2145KERN:   child count:       0
2146KERN:   index:             -1
2147KERN:   status:            0
2148KERN:   flags:             5
2149KERN:   volume:            -1
2150KERN:   disk system:       partitioning_systems/efi_gpt/v1
2151KERN:   name:              WDC WD7500BPVX-00JC3
2152KERN:   content name:      <NULL>
2153KERN:   type:              <NULL>
2154KERN:   content type:      GUID Partition Map
2155KERN:   params:            <NULL>
2156KERN:   content params:    <NULL>
2157KERN: device 2: /dev/disk/scsi/1/5/0/raw
2158KERN:   media status:      No error
2159KERN:   device flags:      2
2160KERN:   offset:            0
2161KERN:   size:              750156374016 (715404.867 MB)
2162KERN:   content size:      750156374016
2163KERN:   block size:        512
2164KERN:   child count:       1
2165KERN:   index:             -1
2166KERN:   status:            0
2167KERN:   flags:             5
2168KERN:   volume:            -1
2169KERN:   disk system:       partitioning_systems/efi_gpt/v1
2170KERN:   name:              WDC WD7500BPVX-00JC3
2171KERN:   content name:      <NULL>
2172KERN:   type:              <NULL>
2173KERN:   content type:      GUID Partition Map
2174KERN:   params:            <NULL>
2175KERN:   content params:    <NULL>
2176KERN:   partition 5: /dev/disk/scsi/1/5/0/0
2177KERN:     offset:            1048576
2178KERN:     size:              750154416128 (715403 MB)
2179KERN:     content size:      0
2180KERN:     block size:        512
2181KERN:     child count:       0
2182KERN:     index:             0
2183KERN:     status:            2
2184KERN:     flags:             0
2185KERN:     volume:            -1
2186KERN:     disk system:       <NULL>
2187KERN:     name:             
2188KERN:     content name:      <NULL>
2189KERN:     type:              Linux data
2190KERN:     content type:      <NULL>
2191KERN:     params:            <NULL>
2192KERN:     content params:    <NULL>
2193KERN: Identified boot partition by partition offset.
2194KERN: ahci: sg_memcpy phyAddr 0x4734f0, size 8
2195KERN: ahci: sg_memcpy phyAddr 0x473480, size 8
2196KERN: bfs: mounted "Haiku" (root node at 524288, device = /dev/disk/scsi/1/1/0/1)
2197KERN: Mounted boot partition: /dev/disk/scsi/1/1/0/1
2198KERN: packagefs [27390282:    30] Adding packages from "/boot/system/packages"
2199KERN: packagefs [27398976:    30] Failed to open packages activation file: No such file or directory
2200KERN: packagefs [27409330:    30] Loading packages from activation file failed. Loading all packages in packages directory.
2201KERN: slab memory manager: created area 0xffffffffb1801000 (1129)
2202KERN: slab memory manager: created area 0xffffffffb2001000 (1130)
2203KERN: slab memory manager: created area 0xffffffffb2801000 (1131)
2204KERN: packagefs [27754473:    30] StringPool usage:
2205KERN: packagefs [27760414:    30]   total unique strings:       23296,   285987 bytes, overhead: 535808 bytes
2206KERN: packagefs [27771557:    30]   total strings with dups:   107031,  1141278 bytes
2207KERN: packagefs [27780546:    30]   unshared strings:             947
2208KERN: packagefs [27788092:    30]   bytes saved:               319483
2209KERN: packagefs [27797117:    30] Adding packages from "/boot/home/config/packages"
2210KERN: packagefs [27806488:    30] Failed to open packages activation file: No such file or directory
2211KERN: packagefs [27816812:    30] Loading packages from activation file failed. Loading all packages in packages directory.
2212KERN: packagefs [27830965:    30] StringPool usage:
2213KERN: packagefs [27836906:    30]   total unique strings:       23296,   285987 bytes, overhead: 535808 bytes
2214KERN: packagefs [27848049:    30] usb hub 7:   total strings with dups:   107042,  1141343 bytes
2215KERN: port 1 is not suspended
2216KERN: packagefs [27858466:    30] usb hub 7:   unshared strings:             944
2217KERN: port 1 is not in an over current state
2218KERN: packagefs [27871050:    30] usb hub 7:   bytes saKERN: ved:               319548
2219KERN: port 1 was reset
2220KERN: module: Search for file_cache/launch_speedup/v1 failed.
2221KERN: partitioning system: partitioning_systems/session/v1
2222KERN: KDiskDeviceManager::_AddDiskSystem(partitioning_systems/session/v1)
2223KERN: KDiskDeviceManager::_AddDiskSystem() done: No error
2224KERN: file system: file_systems/nfs4/v1
2225KERN: KDiskDeviceManager::_AddDiskSystem(file_systems/nfs4/v1)
2226KERN: KDiskDeviceManager::_AddDiskSystem() done: No error
2227KERN: file system: file_systems/nfs/v1
2228KERN: KDiskDeviceManager::_AddDiskSystem(file_systems/nfs/v1)
2229KERN: KDiskDeviceManager::_AddDiskSystem() done: No error
2230KERN: file system: file_systems/cdda/v1
2231KERN: KDiskDeviceManager::_AddDiskSystem(file_systems/cdda/v1)
2232KERN: KDiskDeviceManager::_AddDiskSystem() done: No error
2233KERN: file system: file_systems/write_overlay/v1
2234KERN: KDiskDeviceManager::_AddDiskSystem(file_systems/write_overlay/v1)
2235KERN: KDiskDeviceManager::_AddDiskSystem() done: No error
2236KERN: file system: file_systems/udf/v1
2237KERN: KDiskDeviceManager::_AddDiskSystem(file_systems/udf/v1)
2238KERN: KDiskDeviceManager::_AddDiskSystem() done: No error
2239KERN: file system: file_systems/ntfs/v1
2240KERN: KDiskDeviceManager::_AddDiskSystem(file_systems/ntfs/v1)
2241KERN: KDiskDeviceManager::_AddDiskSystem() done: No error
2242KERN: file system: file_systems/log_overlay/v1
2243KERN: KDiskDeviceManager::_AddDiskSystem(file_systems/log_overlay/v1)
2244KERN: KDiskDeviceManager::_AddDiskSystem() done: No error
2245KERN: file system: file_systems/iso9660/v1
2246KERN: KDiskDeviceManager::_AddDiskSystem(file_systems/iso9660/v1)
2247KERN: KDiskDeviceManager::_AddDiskSystem() done: No error
2248KERN: file system: file_systems/fat/v1
2249KERN: KDiskDeviceManager::_AddDiskSystem(file_systems/fat/v1)
2250KERN: dos_std_ops()
2251Last message repeated 1 time
2252KERN: KDiskDeviceManager::_AddDiskSystem() done: No error
2253KERN: file system: file_systems/ext2/v1
2254KERN: KDiskDeviceManager::_AddDiskSystem(file_systems/ext2/v1)
2255KERN: KDiskDeviceManager::_AddDiskSystem() done: No error
2256KERN: file system: file_systems/exfat/v1
2257KERN: KDiskDeviceManager::_AddDiskSystem(file_systems/exfat/v1)
2258KERN: KDiskDeviceManager::_AddDiskSystem() done: No error
2259KERN: file system: file_systems/btrfs/v1
2260KERN: KDiskDeviceManager::_AddDiskSystem(file_systems/btrfs/v1)
2261KERN: KDiskDeviceManager::_AddDiskSystem() done: No error
2262KERN: file system: file_systems/bindfs/v1
2263KERN: KDiskDeviceManager::_AddDiskSystem(file_systems/bindfs/v1)
2264KERN: KDiskDeviceManager::_AddDiskSystem() done: No error
2265KERN: file system: file_systems/attribute_overlay/v1
2266KERN: KDiskDeviceManager::_AddDiskSystem(file_systems/attribute_overlay/v1)
2267KERN: KDiskDeviceManager::_AddDiskSystem() done: No error
2268KERN: KDiskDeviceManager::_ScanPartition(/dev/disk/scsi/1/1/0/0)
2269KERN:   trying: partitioning_systems/session/v1
2270KERN: publish device: node 0xffffffffb1ba6648, path disk/virtual/ram/control, module drivers/disk/virtual/ram_disk/control/device_v1
2271KERN: loaded driver /boot/system/add-ons/kernel/drivers/dev/zero
2272KERN: usb_modeswitch: init_hardware()
2273KERN: usb_modeswitch: init_driver()
2274KERN: usb_modeswitch: trying module bus_managers/usb/v3
2275KERN: usb_modeswitch: publish_devices()
2276KERN: usb_modeswitch: uninit_driver()
2277KERN: loaded driver /boot/system/add-ons/kernel/drivers/dev/usb_modeswitch
2278KERN: loaded driver /boot/system/add-ons/kernel/drivers/dev/tty
2279KERN: loaded driver /boot/system/add-ons/kernel/drivers/dev/null
2280KERN: loaded driver /boot/system/add-ons/kernel/drivers/dev/dprintf
2281KERN: con_init: trying module console/frame_buffer/v1
2282KERN: loaded driver /boot/system/add-ons/kernel/drivers/dev/console
2283KERN: module: Search for bus_managers/ide/controller/driver_v1 failed.
2284KERN: loading dependent module bus_managers/ide/controller/driver_v1 of busses/ata/silicon_image_3112/driver_v1 failed!
2285KERN: module: Search for bus_managers/ide/controller/driver_v1 failed.
2286KERN: loading dependent module bus_managers/ide/controller/driver_v1 of busses/ata/legacy_sata/driver_v1 failed!
2287KERN: module: Search for bus_managers/ide/controller/driver_v1 failed.
2288KERN: loading dependent module bus_managers/ide/controller/driver_v1 of generic/ata_adapter/v1 failed!
2289KERN: loading dependent module generic/ata_adapter/v1 of busses/ata/it8211/driver_v1 failed!
2290KERN: module: Search for bus_managers/ide/controller/driver_v1 failed.
2291KERN: loading dependent module bus_managers/ide/controller/driver_v1 of busses/ata/generic_ide_pci/driver_v1 failed!
2292KERN: module: Search for bus_managers/ide/controller/driver_v1 failed.
2293KERN: loading dependent module bus_managers/ide/controller/driver_v1 of busses/ata/silicon_image_3112/driver_v1 failed!
2294KERN: module: Search for bus_managers/ide/controller/driver_v1 failed.
2295KERN: loading dependent module bus_managers/ide/controller/driver_v1 of busses/ata/legacy_sata/driver_v1 failed!
2296KERN: module: Search for bus_managers/ide/controller/driver_v1 failed.
2297KERN: loading dependent module bus_managers/ide/controller/driver_v1 of generic/ata_adapter/v1 failed!
2298KERN: loading dependent module generic/ata_adapter/v1 of busses/ata/it8211/driver_v1 failed!
2299KERN: module: Search for bus_managers/ide/controller/driver_v1 failed.
2300KERN: loading dependent module bus_managers/ide/controller/driver_v1 of busses/ata/generic_ide_pci/driver_v1 failed!
2301KERN: module: Search for bus_managers/ide/controller/driver_v1 failed.
2302KERN: loading dependent module bus_managers/ide/controller/driver_v1 of busses/ata/silicon_image_3112/driver_v1 failed!
2303KERN: module: Search for bus_managers/ide/controller/driver_v1 failed.
2304KERN: loading dependent module bus_managers/ide/controller/driver_v1 of busses/ata/legacy_sata/driver_v1 failed!
2305KERN: module: Search for bus_managers/ide/controller/driver_v1 failed.
2306KERN: loading dependent module bus_managers/ide/controller/driver_v1 of generic/ata_adapter/v1 failed!
2307KERN: loading dependent module generic/ata_adapter/v1 of busses/ata/it8211/driver_v1 failed!
2308KERN: module: Search for bus_managers/ide/controller/driver_v1 failed.
2309KERN: loading dependent module bus_managers/ide/controller/driver_v1 of busses/ata/generic_ide_pci/driver_v1 failed!
2310KERN: module: Search for bus_managers/ide/controller/driver_v1 failed.
2311KERN: loading dependent module bus_managers/ide/controller/driver_v1 of busses/ata/silicon_image_3112/driver_v1 failed!
2312KERN: module: Search for bus_managers/ide/controller/driver_v1 failed.
2313KERN: loading dependent module bus_managers/ide/controller/driver_v1 of busses/ata/legacy_sata/driver_v1 failed!
2314KERN: module: Search for bus_managers/ide/controller/driver_v1 failed.
2315KERN: loading dependent module bus_managers/ide/controller/driver_v1 of generic/ata_adapter/v1 failed!
2316KERN: loading dependent module generic/ata_adapter/v1 of busses/ata/it8211/driver_v1 failed!
2317KERN: module: Search for bus_managers/ide/controller/driver_v1 failed.
2318KERN: loading dependent module bus_managers/ide/controller/driver_v1 of busses/ata/generic_ide_pci/driver_v1 failed!
2319KERN: module: Search for bus_managers/ide/controller/driver_v1 failed.
2320KERN: loading dependent module bus_managers/ide/controller/driver_v1 of busses/ata/silicon_image_3112/driver_v1 failed!
2321KERN: module: Search for bus_managers/ide/controller/driver_v1 failed.
2322KERN: loading dependent module bus_managers/ide/controller/driver_v1 of busses/ata/legacy_sata/driver_v1 failed!
2323KERN: module: Search for bus_managers/ide/controller/driver_v1 failed.
2324KERN: loading dependent module bus_managers/ide/controller/driver_v1 of generic/ata_adapter/v1 failed!
2325KERN: loading dependent module generic/ata_adapter/v1 of busses/ata/it8211/driver_v1 failed!
2326KERN: module: Search for bus_managers/ide/controller/driver_v1 failed.
2327KERN: loading dependent module bus_managers/ide/controller/driver_v1 of busses/ata/generic_ide_pci/driver_v1 failed!
2328KERN:   returned: -1
2329KERN:   trying: file_systems/nfs4/v1
2330KERN:   returned: -1
2331KERN:   trying: file_systems/nfs/v1
2332KERN:   returned: -1
2333KERN:   trying: file_systems/cdda/v1
2334KERN: raw_command:
2335KERN: ahci: AHCIPort::ScsiExecuteRequest port 1 unsupported request opcode 0x43
2336KERN:   returned: -1
2337KERN:   trying: file_systems/write_overlay/v1
2338KERN:   returned: -1
2339KERN:   trying: file_systems/udf/v1
2340KERN: read_pos(pos:536879104, len:512) failed with: 0xffffffffffffffff
2341KERN: udf_recognize: Invalid sequence. status = -1
2342KERN:   returned: -1
2343KERN:   trying: file_systems/ntfs/v1
2344KERN: fs_identify_partition: boot signature NTFS doesn't match
2345KERN:   returned: -1
2346KERN:   trying: file_systems/log_overlay/v1
2347KERN:   returned: -1
2348KERN:   trying: file_systems/iso9660/v1
2349KERN: identify(4, 0xffffffffb1ff1498)
2350KERN:   returned: -1
2351KERN: dos_std_ops()
2352KERN:   trying: file_systems/fat/v1
2353KERN:   returned: 0.8
2354KERN:   trying: file_systems/ext2/v1
2355KERN: [34mext2:[0m invalid superblock!
2356KERN:   returned: -1
2357KERN:   trying: file_systems/exfat/v1
2358KERN: [34mexfat:[0m invalid superblock!
2359KERN:   returned: -1
2360KERN:   trying: file_systems/btrfs/v1
2361KERN: [34mbtrfs:[0m invalid superblock!
2362KERN:   returned: -1
2363KERN:   trying: file_systems/bindfs/v1
2364KERN:   returned: -1
2365KERN:   trying: file_systems/attributKERN: e_overlay/v1
2366KERN:   returned: -1
2367KERN:   scanning with: file_systems/fat/v1
2368KERN: usb hub 7: KDiskDeviceManager::_ScanPartition(/dev/disk/scsi/1/4/0/raw)
2369KERN: port 1 is not suspended
2370KERN: usb hub 7:   trying: partitioning_systems/session/v1
2371KERN: port 1 is not in an over current state
2372KERN: usb hub 7: port 1 was reset
2373KERN:   returned: -1
2374KERN:   trying: file_systems/nfs4/v1
2375KERN:   returned: -1
2376KERN:   trying: file_systems/nfs/v1
2377KERN:   returned: -1
2378KERN:   trying: file_systems/cdda/v1
2379KERN: raw_command:
2380KERN: ahci: AHCIPort::ScsiExecuteRequest port 4 unsupported request opcode 0x43
2381KERN:   returned: -1
2382KERN:   trying: file_systems/write_overlay/v1
2383KERN:   returned: -1
2384KERN:   trying: file_systems/udf/v1
2385KERN: udf_recognize: Invalid sequence. status = -1
2386KERN:   returned: -1
2387KERN:   trying: file_systems/ntfs/v1
2388KERN: fs_identify_partition: boot signature NTFS doesn't match
2389KERN:   returned: -1
2390KERN:   trying: file_systems/log_overlay/v1
2391KERN:   returned: -1
2392KERN:   trying: file_systems/iso9660/v1
2393KERN: identify(4, 0xffffffffb1ff1498)
2394KERN:   returned: -1
2395KERN:   trying: file_systems/fat/v1
2396KERN:   returned: -1
2397KERN:   trying: file_systems/ext2/v1
2398KERN: [34mext2:[0m invalid superblock!
2399KERN:   returned: -1
2400KERN:   trying: file_systems/exfat/v1
2401KERN: [34mexfat:[0m invalid superblock!
2402KERN:   returned: -1
2403KERN:   trying: file_systems/btrfs/v1
2404KERN: [34mbtrfs:[0m invalid superblock!
2405KERN:   returned: -1
2406KERN:   trying: file_systems/bindfs/v1
2407KERN:   returned: -1
2408KERN:   trying: file_systems/attribute_overlay/v1
2409KERN:   returned: -1
2410KERN: KDiskDeviceManager::_ScanPartition(/dev/disk/scsi/1/5/0/0)
2411KERN:   trying: partitioning_systems/session/v1
2412KERN:   returned: -1
2413KERN:   trying: file_systems/nfs4/v1
2414KERN:   returned: -1
2415KERN:   trying: file_systems/nfs/v1
2416KERN:   returned: -1
2417KERN:   trying: file_systems/cdda/v1
2418KERN: raw_command:
2419KERN: ahci: AHCIPort::ScsiExecuteRequest port 5 unsupported request opcode 0x43
2420KERN:   returned: -1
2421KERN:   trying: file_systems/write_overlay/v1
2422KERN:   returned: -1
2423KERN:   trying: file_systems/udf/v1
2424KERN: udf_recognize: Invalid sequence. status = -1
2425KERN:   returned: -1
2426KERN:   trying: file_systems/ntfs/v1
2427KERN: fs_identify_partition: boot signature NTFS doesn't match
2428KERN:   returned: -1
2429KERN:   trying: file_systems/log_overlay/v1
2430KERN:   returned: -1
2431KERN:   trying: file_systems/iso9660/v1
2432KERN: identify(4, 0xffffffffb1ff1450)
2433KERN:   returned: -1
2434KERN:   trying: file_systems/fat/v1
2435KERN:   returned: -1
2436KERN:   trying: file_systems/ext2/v1
2437KERN: [34mext2:[0m invalid superblock!
2438KERN:   returned: -1
2439KERN:   trying: file_systems/exfat/v1
2440KERN: [34mexfat:[0m invalid superblock!
2441KERN:   returned: -1
2442KERN:   trying: file_systems/btrfs/v1
2443KERN:   returned: 0.8
2444KERN:   trying: file_systems/bindfs/v1
2445KERN:   returned: -1
2446KERN:   trying: file_systems/attribute_overlay/v1
2447KERN:   returned: -1
2448KERN:   scanning with: file_systems/btrfs/v1
2449KERN: KDiskDeviceManager::_Scan(/dev/disk)
2450KERN: KDiskDeviceManager::_Scan(/dev/disk/scsi)
2451KERN: KDiskDeviceManager::_Scan(/dev/disk/scsi/1)
2452KERN: KDiskDeviceManager::_Scan(/dev/disk/scsi/1/1)
2453KERN: KDiskDeviceManager::_Scan(/dev/disk/scsi/1/1/0)
2454KERN: KDiskDeviceManager::_Scan(/dev/disk/scsi/1/1/0/0)
2455KERN: KDiskDeviceManager::_Scan(/dev/disk/scsi/1/1/0/1)
2456KERN: KDiskDeviceManager::_Scan(/dev/disk/scsi/1/1/0/raw)
2457KERN: KDiskDeviceManager::_Scan(/dev/disk/scsi/1/4)
2458KERN: KDiskDeviceManager::_Scan(/dev/disk/scsi/1/4/0)
2459KERN: KDiskDeviceManager::_Scan(/dev/disk/scsi/1/4/0/raw)
2460KERN: KDiskDeviceManager::_Scan(/dev/disk/scsi/1/5)
2461KERN: KDiskDeviceManager::_Scan(/dev/disk/scsi/1/5/0)
2462KERN: KDiskDeviceManager::_Scan(/dev/disk/scsi/1/5/0/0)
2463KERN: KDiskDeviceManager::_Scan(/dev/disk/scsi/1/5/0/raw)
2464KERN: KDiskDeviceManager::_Scan(/dev/disk/usb)
2465KERN: loaded driver /boot/system/add-ons/kernel/drivers/dev/disk/usb/usb_floppy
2466KERN: loaded driver /boot/system/add-ons/kernel/drivers/dev/disk/usb/usb_disk
2467KERN: KDiskDeviceManager::_Scan(/dev/disk/virtual)
2468KERN: KDiskDeviceManager::_Scan(/dev/disk/virtual/ram)
2469KERN: KDiskDeviceManager::_Scan(/dev/disk/virtual/ram/control)
2470KERN: KDiskDeviceManager::_ScanPartition(/dev/disk/scsi/1/1/0/0)
2471KERN: intel: ep_std_ops(0x1)
2472KERN:   trying: partitioning_systems/intel/extended/v1
2473KERN:   returned: -1
2474KERN: intel: ep_std_ops(0x2)
2475KERN: intel: pm_std_ops(0x1)
2476KERN:   trying: partitioning_systems/intel/map/v1
2477KERN: intel: pm_identify_partition(4, 3: 1048576, 104857600, 512)
2478KERN:   returned: -1
2479KERN: intel: pm_std_ops(0x2)
2480KERN:   trying: partitioning_systems/efi_gpt/v1
2481KERN:   returned: -1
2482KERN:   trying: file_systems/devfs/v1
2483KERN:   returned: -1
2484KERN:   trying: file_systems/rootfs/v1
2485KERN:   returned: -1
2486KERN:   trying: file_systems/packagefs/v1
2487KERN:   returned: -1
2488KERN:   trying: file_systems/bfs/v1
2489KERN:   returned: -1
2490KERN:   trying: partitioning_systems/session/v1
2491KERN:   returned: -1
2492KERN:   trying: file_systems/nfs4/v1
2493KERN:   returned: -1
2494KERN:   trying: file_systems/nfs/v1
2495KERN:   returned: -1
2496KERN:   trying: file_systems/cdda/v1
2497KERN: raw_command:
2498KERN: ahci: AHCIPort::ScsiExecuteRequest port 1 unsupported request opcode 0x43
2499KERN:   returned: -1
2500KERN:   trying: file_systems/write_overlay/v1
2501KERN:   returned: -1
2502KERN:   trying: file_systems/udf/v1
2503KERN: read_pos(pos:536879104, len:512) failed with: 0xffffffffffffffff
2504KERN: udf_recognize: Invalid sequence. status = -1
2505KERN:   returned: -1
2506KERN:   trying: file_systems/ntfs/v1
2507KERN: fs_identify_partition: boot signature NTFS doesn't match
2508KERN:   returned: -1
2509KERN:   trying: file_systems/log_overlay/v1
2510KERN:   returned: -1
2511KERN:   trying: file_systems/iso9660/v1
2512KERN: identify(4, 0xffffffffb1ff13f0)
2513KERN:   returned: -1
2514KERN:   trying: file_systems/fat/v1
2515KERN:   returned: 0.8
2516KERN:   trying: file_systems/ext2/v1
2517KERN: [34mext2:[0m invalid superblock!
2518KERN:   returned: -1
2519KERN:   trying: file_systems/exfat/v1
2520KERN: [34mexfat:[0m invalid superblock!
2521KERN:   returned: -1
2522KERN:   trying: file_systems/btrfs/v1
2523KERN: [34mbtrfs:[0m invalid superblock!
2524KERN:   returned: -1
2525KERN:   trying: file_systems/bindfs/v1
2526KERN:   returned: -1
2527KERN:   trying: file_systems/attribute_overlay/v1
2528KERN:   returned: -1
2529KERN: KDiskDeviceManager::_ScanPartition(/dev/disk/scsi/1/4/0/raw)
2530KERN: intel: ep_std_ops(0x1)
2531KERN:   trying: partitioning_systems/intel/extended/v1
2532KERN:   returned: -1
2533KERN: intel: ep_std_ops(0x2)
2534KERN: intel: pm_std_ops(0x1)
2535KERN:   trying: partitioning_systems/intel/map/v1
2536KERN: intel: pm_identify_partition(4, 1: 0, 750156374016, 512)
2537KERN: intel: Found GPT signature, ignoring.
2538KERN:   returned: -1
2539KERN: intel: pm_std_ops(0x2)
2540KERN:   trying: partitioning_systems/efi_gpt/v1
2541KERN: EFI header: EFI PART
2542KERN: EFI revision: 10000
2543KERN: header size: 92
2544KERN: header CRC: a6464145
2545KERN: absolute block: 1
2546KERN: alternate block: 1465149167
2547KERN: first usable block: 34
2548KERN: last usable block: 1465149134
2549KERN: disk GUID: 99ce833c-ca7d-4988-8b32-a0536bbd3c98
2550KERN: entries block: 2
2551KERN: entry size:  128
2552KERN: entry count: 128
2553KERN: entries CRC: ab54d286
2554KERN: EFI header: EFI PART
2555KERN: EFI revision: 10000
2556KERN: header size: 92
2557KERN: header CRC: 3a46d7f6
2558KERN: absolute block: 1465149167
2559KERN: alternate block: 1
2560KERN: first usable block: 34
2561KERN: last usable block: 1465149134
2562KERN: disk GUID: 99ce833c-ca7d-4988-8b32-a0536bbd3c98
2563KERN: entries block: 1465149135
2564KERN: entry size:  128
2565KERN: entry count: 128
2566KERN: entries CRC: ab54d286
2567KERN:   returned: 0.959
2568KERN:   trying: file_systems/devfs/v1
2569KERN:   returned: -1
2570KERN:   trying: file_systems/rootfs/v1
2571KERN:   returned: -1
2572KERN:   trying: file_systems/packagefs/v1
2573KERN:   returned: -1
2574KERN:   trying: file_systems/bfs/v1
2575KERN:   returned: -1
2576KERN:   trying: partitioning_systems/session/v1
2577KERN:   returned: -1
2578KERN:   trying: file_systems/nfs4/v1
2579KERN:   returned: -1
2580KERN:   trying: file_systems/nfs/v1
2581KERN:   returned: -1
2582KERN:   trying: file_systems/cdda/v1
2583KERN: raw_command:
2584KERN: ahci: AHCIPort::ScsiExecuteRequest port 4 unsupported request opcode 0x43
2585KERN:   returned: -1
2586KERN:   trying: file_systems/write_overlay/v1
2587KERN:   returned: -1
2588KERN:   trying: file_systems/udf/v1
2589KERN: udf_recognize: Invalid sequence. status = -1
2590KERN:   returned: -1
2591KERN:   trying: file_systems/ntfs/v1
2592KERN: fs_identify_partition: boot signature NTFS doesn't match
2593KERN:   returned: -1
2594KERN:   trying: file_systems/log_overlay/v1
2595KERN:   returned: -1
2596KERN:   trying: file_systems/iso9660/v1
2597KERN: identify(4, 0xffffffffb1ff1498)
2598KERN:   returned: -1
2599KERN:   trying: file_systems/fat/v1
2600KERN:   returned: -1
2601KERN:   trying: file_systems/ext2/v1
2602KERN: [34mext2:[0m invalid superblock!
2603KERN:   returned: -1
2604KERN:   trying: file_systems/exfat/v1
2605KERN: usb hub 7: [34mexfat:[0m invalid superblock!
2606KERN: port 1 is not suspended
2607KERN:   returned: -1
2608KERN: usb hub 7: port 1 is not in an over current state
2609KERN:   trying: file_systems/btrfs/v1
2610KERN: usb hub 7: [34mbtrfs:[0m invalid superblock!
2611KERN: port 1 was reset
2612KERN:   returned: -1
2613KERN:   trying: file_systems/bindfs/v1
2614KERN:   returned: -1
2615KERN:   trying: file_systems/attribute_overlay/v1
2616KERN:   returned: -1
2617KERN: KDiskDeviceManager::_ScanPartition(/dev/disk/scsi/1/5/0/0)
2618KERN: intel: ep_std_ops(0x1)
2619KERN:   trying: partitioning_systems/intel/extended/v1
2620KERN:   returned: -1
2621KERN: intel: ep_std_ops(0x2)
2622KERN: intel: pm_std_ops(0x1)
2623KERN:   trying: partitioning_systems/intel/map/v1
2624KERN: intel: pm_identify_partition(4, 5: 1048576, 750154416128, 4096)
2625KERN:   returned: -1
2626KERN: intel: pm_std_ops(0x2)
2627KERN:   trying: partitioning_systems/efi_gpt/v1
2628KERN:   returned: -1
2629KERN:   trying: file_systems/devfs/v1
2630KERN:   returned: -1
2631KERN:   trying: file_systems/rootfs/v1
2632KERN:   returned: -1
2633KERN:   trying: file_systems/packagefs/v1
2634KERN:   returned: -1
2635KERN:   trying: fiKERN: le_systems/bfs/v1
2636KERN:   returned: -1
2637KERN:   trying: partitioning_systems/session/v1
2638KERN:   returned: -1
2639KERN:   trying: file_systems/nfs4/v1
2640KERN:   returned: -1
2641KERN:   trying: file_systems/nfs/v1
2642KERN:   returned: -1
2643KERN:   trying: file_systems/cdda/v1
2644KERN: raw_command:
2645KERN: ahci: AHCIPort::ScsiExecuteRequest port 5 unsupported request opcode 0x43
2646KERN:   returned: -1
2647KERN:   trying: file_systems/write_overlay/v1
2648KERN:   returned: -1
2649KERN:   trying: file_systems/udf/v1
2650KERN: udf_recognize: Invalid sequence. status = -1
2651KERN:   returned: -1
2652KERN:   trying: file_systems/ntfs/v1
2653KERN: fs_identify_partition: boot signature NTFS doesn't match
2654KERN:   returned: -1
2655KERN:   trying: file_systems/log_overlay/v1
2656KERN:   returned: -1
2657KERN:   trying: file_systems/iso9660/v1
2658KERN: identify(4, 0xffffffffb1ff13f0)
2659KERN:   returned: -1
2660KERN:   trying: file_systems/fat/v1
2661KERN:   returned: -1
2662KERN:   trying: file_systems/ext2/v1
2663KERN: [34mext2:[0m invalid superblock!
2664KERN: devfs: reload driver "usb_disk" (-1, -1)
2665KERN:   returned: -1
2666KERN:   trying: file_systems/exfat/v1
2667KERN: [34mexfat:[0m invalid superblock!
2668KERN:   returned: -1
2669KERN:   trying: file_systems/btrfs/v1
2670KERN:   returned: 0.8
2671KERN:   trying: file_systems/bindfs/v1
2672KERN:   returned: -1
2673KERN:   trying: file_systems/attribute_overlay/v1
2674KERN:   returned: -1
2675KERN: allocate_commpage_entry(4, 16) -> 0x0000000000000260
2676KERN: no valid cpufreq module found
2677KERN: no valid cpuidle module found
2678KERN: add_memory_type_range(-1, 0x100000, 0x1c00000, 6)
2679KERN: set MTRRs to:
2680KERN:   mtrr:  0: base: 0x80000000, size: 0x80000000, type: 0
2681KERN: add_memory_type_range(-1, 0x2000000, 0xcc6a3000, 6)
2682KERN: set MTRRs to:
2683KERN:   mtrr:  0: base: 0xce6a3000, size:     0x1000, type: 0
2684KERN:   mtrr:  1: base: 0xce6a8000, size:     0x8000, type: 0
2685KERN:   mtrr:  2: base: 0xce6b0000, size:    0x10000, type: 0
2686KERN:   mtrr:  3: base: 0xd0000000, size: 0x10000000, type: 0
2687KERN:   mtrr:  4: base: 0xe0000000, size: 0x20000000, type: 0
2688KERN: add_memory_type_range(-1, 0xce6bc000, 0xc451000, 6)
2689KERN: set MTRRs to:
2690KERN:   mtrr:  0: base: 0xce6a3000, size:     0x1000, type: 0
2691KERN:   mtrr:  1: base: 0xce6b8000, size:     0x4000, type: 0
2692KERN:   mtrr:  2: base: 0xce6a8000, size:     0x8000, type: 0
2693KERN:   mtrr:  3: base: 0xce6b0000, size:     0x8000, type: 0
2694KERN:   mtrr:  4: base: 0xdb000000, size:  0x1000000, type: 0
2695KERN:   mtrr:  5: base: 0xe0000000, size: 0x20000000, type: 0
2696KERN: add_memory_type_range(-1, 0xdac8e000, 0x106000, 6)
2697KERN: set MTRRs to:
2698KERN:   mtrr:  0: base: 0xce6a3000, size:     0x1000, type: 0
2699KERN:   mtrr:  1: base: 0xce6b8000, size:     0x4000, type: 0
2700KERN:   mtrr:  2: base: 0xce6a8000, size:     0x8000, type: 0
2701KERN:   mtrr:  3: base: 0xce6b0000, size:     0x8000, type: 0
2702KERN:   mtrr:  4: base: 0xdb000000, size:  0x1000000, type: 0
2703KERN:   mtrr:  5: base: 0xe0000000, size: 0x20000000, type: 0
2704KERN: add_memory_type_range(-1, 0xdbeab000, 0x2155000, 6)
2705KERN: set MTRRs to:
2706KERN:   mtrr:  0: base: 0xce6a3000, size:     0x1000, type: 0
2707KERN:   mtrr:  1: base: 0xce6b8000, size:     0x4000, type: 0
2708KERN:   mtrr:  2: base: 0xce6a8000, size:     0x8000, type: 0
2709KERN:   mtrr:  3: base: 0xce6b0000, size:     0x8000, type: 0
2710KERN:   mtrr:  4: base: 0xdb000000, size:   0x800000, type: 0
2711KERN:   mtrr:  5: base: 0xe0000000, size: 0x20000000, type: 0
2712KERN: add_memory_type_range(-1, 0x100000000, 0x71f380000, 6)
2713KERN: set MTRRs to:
2714KERN:   mtrr:  0: base: 0xce6a3000, size:     0x1000, type: 0
2715KERN:   mtrr:  1: base: 0xce6b8000, size:     0x4000, type: 0
2716KERN:   mtrr:  2: base: 0xce6a8000, size:     0x8000, type: 0
2717KERN:   mtrr:  3: base: 0xce6b0000, size:     0x8000, type: 0
2718KERN:   mtrr:  4: base: 0xdb000000, size:   0x800000, type: 0
2719KERN:   mtrr:  5: base: 0xe0000000, size: 0x20000000, type: 0
2720KERN: kernel debugger extension "debugger/run_on_exit/v1": loaded
2721KERN: kernel debugger extension "debugger/usb_keyboard/v1": loaded
2722KERN: kernel debugger extension "debugger/invalidate_on_exit/v1": loaded
2723KERN: kernel debugger extension "debugger/hangman/v1": loaded
2724KERN: add_memory_type_range(99, 0xe0000000, 0x8ca000, 1)
2725KERN: set MTRRs to:
2726KERN:   mtrr:  0: base: 0xce6a3000, size:     0x1000, type: 0
2727KERN:   mtrr:  1: base: 0xce6b8000, size:     0x4000, type: 0
2728KERN:   mtrr:  2: base: 0xce6a8000, size:     0x8000, type: 0
2729KERN:   mtrr:  3: base: 0xce6b0000, size:     0x8000, type: 0
2730KERN:   mtrr:  4: base: 0xdb000000, size:   0x800000, type: 0
2731KERN:   mtrr:  5: base: 0xf0000000, size: 0x10000000, type: 0
2732KERN:   mtrr:  6: base: 0xe0000000, size: 0x20000000, type: 1
2733KERN: publish device: node 0xffffffffb1ba65a8, path random, module bus_managers/random/device_v1
2734KERN: publish device: node 0xffffffffb1ba65a8, path urandom, module bus_managers/random/device_v1
2735KERN: module: Search for bus_managers/ide/controller/driver_v1 failed.
2736KERN: usb hub 7: port 1 is not suspended
2737KERN: usb hub 7: port 1 is not in an over current state
2738KERN: usb hub 7: port 1 was reset
2739KERN: module: Search for bus_managers/ide/controller/driver_v1 failed.
2740KERN: loading dependent module bus_managers/ide/controller/driver_v1 of busses/ata/silicon_image_3112/driver_v1 failed!
2741KERN: module: Search for bus_managers/ide/controller/driver_v1 failed.
2742KERN: loading dependent module bus_managers/ide/controller/driver_v1 of busses/ata/legacy_sata/driver_v1 failed!
2743KERN: module: Search for bus_managers/ide/controller/driver_v1 failed.
2744KERN: loading dependent module bus_managers/ide/controller/driver_v1 of generic/ata_adapter/v1 failed!
2745KERN: loading dependent module generic/ata_adapter/v1 of busses/ata/it8211/driver_v1 failed!
2746KERN: module: Search for bus_managers/ide/controller/driver_v1 failed.
2747KERN: loading dependent module bus_managers/ide/controller/driver_v1 of busses/ata/generic_ide_pci/driver_v1 failed!
2748KERN: module: Search for bus_managers/ide/controller/driver_v1 failed.
2749KERN: loading dependent module bus_managers/ide/controller/driver_v1 of busses/ata/silicon_image_3112/driver_v1 failed!
2750KERN: module: Search for bus_managers/ide/controller/driver_v1 failed.
2751KERN: loading dependent module bus_managers/ide/controller/driver_v1 of busses/ata/legacy_sata/driver_v1 failed!
2752KERN: module: Search for bus_managers/ide/controller/driver_v1 failed.
2753KERN: loading dependent module bus_managers/ide/controller/driver_v1 of generic/ata_adapter/v1 failed!
2754KERN: loading dependent module generic/ata_adapter/v1 of busses/ata/it8211/driver_v1 failed!
2755KERN: module: Search for bus_managers/ide/controller/driver_v1 failed.
2756KERN: loading dependent module bus_managers/ide/controller/driver_v1 of busses/ata/generic_ide_pci/driver_v1 failed!
2757KERN: module: Search for bus_managers/ide/controller/driver_v1 failed.
2758KERN: loading dependent module bus_managers/ide/controller/driver_v1 of busses/ata/silicon_image_3112/driver_v1 failed!
2759KERN: module: Search for bus_managers/ide/controller/driver_v1 failed.
2760KERN: loading dependent module bus_managers/ide/controller/driver_v1 of busses/ata/legacy_sata/driver_v1 failed!
2761KERN: module: Search for bus_managers/ide/controller/driver_v1 failed.
2762KERN: loading dependent module bus_managers/ide/controller/driver_v1 of generic/ata_adapter/v1 failed!
2763KERN: loading dependent module generic/ata_adapter/v1 of busses/ata/it8211/driver_v1 failed!
2764KERN: module: Search for bus_managers/ide/controller/driver_v1 failed.
2765KERN: loading dependent module bus_managers/ide/controller/driver_v1 of busses/ata/generic_ide_pci/driver_v1 failed!
2766KERN: module: Search for bus_managers/ide/controller/driver_v1 failed.
2767KERN: loading dependent module bus_managers/ide/controller/driver_v1 of busses/ata/silicon_image_3112/driver_v1 failed!
2768KERN: module: Search for bus_managers/ide/controller/driver_v1 failed.
2769KERN: loading dependent module bus_managers/ide/controller/driver_v1 of busses/ata/legacy_sata/driver_v1 failed!
2770KERN: module: Search for bus_managers/ide/controller/driver_v1 failed.
2771KERN: loading dependent module bus_managers/ide/controller/driver_v1 of generic/ata_adapter/v1 failed!
2772KERN: loading dependent module generic/ata_adapter/v1 of busses/ata/it8211/driver_v1 failed!
2773KERN: module: Search for bus_managers/ide/controller/driver_v1 failed.
2774KERN: loading dependent module bus_managers/ide/controller/driver_v1 of busses/ata/generic_ide_pci/driver_v1 failed!
2775KERN: publish device: node 0xffffffffb1bb31e8, path power/button/power, module drivers/power/acpi_button/device_v1
2776KERN: publish device: node 0xffffffffb1bb3008, path power/button/power_fixed, module drivers/power/acpi_button/device_v1
2777KERN: register_domain(9, unix)
2778KERN: unregister_domain(0xffffffffb273bd80, 9, unix)
2779KERN: register_domain(5, internet6)
2780KERN: unregister_domain(0xffffffffb273bc00, 5, internet6)
2781KERN: register_domain(1, internet)
2782KERN: unregister_domain(0xffffffffb273b680, 1, internet)
2783KERN: register_domain(5, internet6)
2784KERN: unregister_domain(0xffffffffb2743a80, 5, internet6)
2785KERN: REG: Failed to open shadow passwd DB file "/etc/shadow": No such file or directory
2786KERN: register_domain(5, internet6)
2787KERN: unregister_domain(0xffffffffb27435KERN: 80, 5, internet6)
2788KERN: register_domain(5, internet6)
2789KERN: unregister_domain(0xffffffffb2743580, 5, internet6)
2790KERN: register_domain(5, internet6)
2791KERN: register_domain(4, link)
2792KERN: unregister_domain(0xffffffffb2743180, 4, link)
2793KERN: package_daemon [31863755:   787] root at "/boot" (device: 3, node: 524288) registered
2794KERN: unregister_domain(0xffffffffb273bf00, 5, internet6)
2795KERN: package_daemon [31877105:   787] volume at "/boot/system" registered
2796KERN: package_daemon [31889398:   787] volume at "/boot/home/config" registered
2797KERN: register_domain(9, unix)
2798KERN: unregister_domain(0xffffffffb2743180, 9, unix)
2799KERN: register_domain(5, internet6)
2800KERN: unregister_domain(0xffffffffb2743180, 5, internet6)
2801KERN: register_domain(1, internet)
2802KERN: unregister_domain(0xffffffffb2743180, 1, internet)
2803KERN: register_domain(5, internet6)
2804KERN: unregister_domain(0xffffffffb2743180, 5, internet6)
2805KERN: register_domain(5, internet6)
2806KERN: unregister_domain(0xffffffffb2743180, 5, internet6)
2807KERN: register_domain(5, internet6)
2808KERN: unregister_domain(0xffffffffb2743180, 5, internet6)
2809KERN: register_domain(1, internet)
2810KERN: unregister_domain(0xffffffffb273bf00, 1, internet)
2811KERN: register_domain(9, unix)
2812KERN: unregister_domain(0xffffffffb2743180, 9, unix)
2813KERN: usb hub 7: port 1 is not suspended
2814KERN: usb hub 7: port 1 is not in an over current state
2815KERN: usb hub 7: port 1 was reset
2816KERN: register_domain(5, internet6)
2817KERN: unregister_domain(0xffffffffb2743180, 5, internet6)
2818KERN: register_domain(1, internet)
2819KERN: unregister_domain(0xffffffffb2743180, 1, internet)
2820KERN: register_domain(5, internet6)
2821KERN: unregister_domain(0xffffffffb2743180, 5, internet6)
2822KERN: register_domain(5, internet6)
2823KERN: package_daemon [32009574:   807] unregister_domain(0xffffffffb2743180, 5, internet6)
2824KERN: Failed to open packages activation file: No such file or directory
2825KERN: package_daemon [32026311:   807] Failed to get activated packages info from activated packages file. Assuming all package files in package directory are activated.
2826KERN: register_domain(5, internet6)
2827KERN: package_daemon [32041710:   807] unregister_domain(0xffffffffb2743180, 5, internet6)
2828KERN: latest volume state:
2829KERN: package_daemon [32055899:   807] active package: "giflib-5.1.2-2-x86_64.hpkg"
2830KERN: package_daemon [32063759:   807] active package: "curl-7.52.1-1-x86_64.hpkg"
2831KERN: package_daemon [32071535:   807] active package: "xz_utils-5.2.2-2-x86_64.hpkg"
2832KERN: package_daemon [32079580:   807] active package: "sed-4.2.1-6-x86_64.hpkg"
2833KERN: package_daemon [32087191:   807] active package: "openssh-7.4p1-1-x86_64.hpkg"
2834KERN: package_daemon [32095181:   807] active package: "m4-1.4.17-3-x86_64.hpkg"
2835KERN: register_domain(1, internet)
2836KERN: package_daemon [32102783:   807] active package: "libmodplug-0.8.8.5-4-x86_64.hpkg"
2837KERN: package_daemon [32114431:   807] active package: "haiku-r1~alpha4_pm_hrev51008-1-x86_64.hpkg"
2838KERN: package_daemon [32123697:   807] active package: "git-2.11.0-1-x86_64.hpkg"
2839KERN: package_daemon [32131387:   807] active package: "curl_devel-7.52.1-1-x86_64.hpkg"
2840KERN: package_daemon [32139687:   807] unregister_domain(0xffffffffb273bf00, 1, internet)
2841KERN: active package: "zip-3.0-3-x86_64.hpkg"
2842KERN: package_daemon [32152218:   807] active package: "sharutils-4.15.2-2-x86_64.hpkg"
2843KERN: package_daemon [32160430:   807] active package: "openssl-1.0.2k-1-x86_64.hpkg"
2844KERN: package_daemon [32168467:   807] active package: "make-4.1-1-x86_64.hpkg"
2845KERN: package_daemon [32175994:   807] active package: "libogg-1.3.2-3-x86_64.hpkg"
2846KERN: package_daemon [32183861:   807] active package: "haiku_devel-r1~alpha4_pm_hrev51008-1-x86_64.hpkg"
2847KERN: register_domain(9, unix)
2848KERN: package_daemon [32193660:   807] unregister_domain(0xffffffffb2743180, 9, unix)
2849KERN: active package: "git_arch-2.11.0-1-x86_64.hpkg"
2850KERN: package_daemon [32209315:   807] active package: "cvsps-2.2b1-1-x86_64.hpkg"
2851KERN: package_daemon [32217106:   807] active package: "zlib-1.2.11-2-x86_64.hpkg"
2852KERN: package_daemon [32224885:   807] active package: "speex-1.2~rc2-3-x86_64.hpkg"
2853KERN: package_daemon [32232839:   807] active package: "openssl_devel-1.0.2k-1-x86_64.hpkg"
2854KERN: package_daemon [32241408:   807] register_domain(5, internet6)
2855KERN: active package: "makefile_engine-r1~alpha4_pm_hrev51008-1-any.hpkg"
2856KERN: unregister_domain(0xffffffffb2743180, 5, internet6)
2857KERN: package_daemon [32254528:   807] active package: "libpcap-1.8.1-2-x86_64.hpkg"
2858KERN: package_daemon [32267654:   807] active package: "haiku_loader-r1~alpha4_pm_hrev51008-1-x86_64.hpkg"
2859KERN: register_domain(1, internet)
2860KERN: package_daemon [32277535:   807] unregister_domain(0xffffffffb2743180, 1, internet)
2861KERN: active package: "git_cvs-2.11.0-1-x86_64.hpkg"
2862KERN: package_daemon [32293851:   807] active package: "diffutils-3.5-1-x86_64.hpkg"
2863KERN: package_daemon [32301805:   807] active package: "zlib_devel-1.2.11-2-x86_64.hpkg"
2864KERN: package_daemon [32310111:   807] register_domain(5, internet6)
2865KERN: active package: "speex_devel-1.2~rc2-3-x86_64.hpkg"
2866KERN: unregister_domain(0xffffffffb2743180, 5, internet6)
2867KERN: package_daemon [32321855:   807] active package: "p7zip-9.20.1-6-x86_64.hpkg"
2868KERN: package_daemon [32334912:   807] active package: "man-1.6g-4-x86_64.hpkg"
2869KERN: package_daemon [32342449:   807] active package: "libpcre-8.39-2-x86_64.hpkg"
2870KERN: package_daemon [32350343:   807] active package: "haikuwebkit-1.5.4-1-x86_64.hpkg"
2871KERN: package_daemon [32358667:   807] active package: "git_daemon-2.11.0-1-x86_64.hpkg"
2872KERN: package_daemon [32366980:   807] active package: "expat-2.2.0-2-x86_64.hpkg"
2873KERN: package_daemon [32374778:   807] active package: "autoconf-2.69-6-x86_64.hpkg"
2874KERN: package_daemon [32382747:   807] register_domain(5, internet6)
2875KERN: active package: "sqlite-3.15.2.0-1-x86_64.hpkg"
2876KERN: unregister_domain(0xffffffffb2743180, 5, internet6)
2877KERN: package_daemon [32394139:   807] active package: "mesa-13.0.2-1-x86_64.hpkg"
2878KERN: package_daemon [32407114:   807] active package: "libpng16-1.6.28-1-x86_64.hpkg"
2879KERN: register_domain(5, internet6)
2880KERN: package_daemon [32415266:   807] unregister_domain(0xffffffffb2743180, 5, internet6)
2881KERN: active package: "icu-57.1-1-x86_64.hpkg"
2882KERN: package_daemon [32431249:   807] active package: "git_email-2.11.0-1-x86_64.hpkg"
2883KERN: package_daemon [32439487:   807] active package: "ffmpeg-3.2.2-1-x86_64.hpkg"
2884KERN: package_daemon [32447346:   807] active package: "automake-1.15.0-1-x86_64.hpkg"
2885KERN: package_daemon [32455472:   807] active package: "tar-1.29-2-x86_64.hpkg"
2886KERN: package_daemon [32462985:   807] active package: "mesa_devel-13.0.2-1-x86_64.hpkg"
2887KERN: package_daemon [32471289:   807] active package: "libpng16_devel-1.6.28-1-x86_64.hpkg"
2888KERN: package_daemon [32479962:   807] register_domain(5, internet6)
2889KERN: active package: "jam-2.5_2012_10_12-2-x86_64.hpkg"
2890KERN: package_daemon [32491614:   807] active package: "git_svn-2.11.0-1-x86_64.hpkg"
2891KERN: package_daemon [32499741:   807] active package: "ffmpeg_devel-3.2.2-1-x86_64.hpkg"
2892KERN: package_daemon [32508130:   807] active package: "bash-4.4.012-1-x86_64.hpkg"
2893KERN: package_daemon [32516033:   807] active package: "tcpdump-4.8.1-1-x86_64.hpkg"
2894KERN: unregister_domain(0xffffffffb273bf00, 5, internet6)
2895KERN: package_daemon [32523989:   807] active package: "patch-2.7.5-1-x86_64.hpkg"
2896KERN: package_daemon [32536934:   807] active package: "mkdepend-1.7-4-x86_64.hpkg"
2897KERN: package_daemon [32544795:   807] active package: "libsolv-0.3.0_haiku_2014_12_22-1-x86_64.hpkg"
2898KERN: package_daemon [32554230:   807] active package: "jasper-1.900.5-2-x86_64.hpkg"
2899KERN: package_daemon [32562346:   807] active package: "glu-9.0.0-5-x86_64.hpkg"
2900KERN: package_daemon [32569945:   807] active package: "findutils-4.4.2-4-x86_64.hpkg"
2901KERN: register_domain(9, unix)
2902KERN: package_daemon [32577950:   807] unregister_domain(0xffffffffb2743180, 9, unix)
2903KERN: active package: "binutils-2.26.1_2016_07_22-3-x86_64.hpkg"
2904KERN: package_daemon [32594710:   807] active package: "texinfo-6.1-1-x86_64.hpkg"
2905KERN: package_daemon [32602489:   807] active package: "pe-2.4.5-3-x86_64.hpkg"
2906KERN: package_daemon [32610002:   807] active package: "mpc-1.0.3-2-x86_64.hpkg"
2907KERN: package_daemon [32617620:   807] active package: "libtheora-1.1.1-5-x86_64.hpkg"
2908KERN: package_daemon [32625748:   807] register_domain(5, internet6)
2909KERN: active package: "jpeg-9b-4-x86_64.hpkg"
2910KERN: unregister_domain(0xffffffffb2743180, 5, internet6)
2911KERN: package_daemon [32636428:   807] active package: "glu_devel-9.0.0-5-x86_64.hpkg"
2912KERN: package_daemon [32649722:   807] active package: "flex-2.6.1-2-x86_64.hpkg"
2913KERN: register_domain(1, internet)
2914KERN: package_daemon [32657407:   807] unregister_domain(0xffffffffb2743180, 1, internet)
2915KERN: active package: "bison-3.0.4-3-x86_64.hpkg"
2916KERN: package_daemon [32673454:   807] active package: "tiff4-4.0.7-1-x86_64KERN: .hpkg"
2917KERN: package_daemon [32681231:   807] active package: "perl-5.18.2-2-x86_64.hpkg"
2918KERN: package_daemon [32689007:   807] register_domain(5, internet6)
2919KERN: active package: "mpfr-3.1.4-4-x86_64.hpkg"
2920KERN: unregister_domain(0xffffffffb2743180, 5, internet6)
2921KERN: package_daemon [32699965:   807] active package: "libtool-2.4.2-2-x86_64.hpkg"
2922KERN: package_daemon [32713081:   807] active package: "jpeg_devel-9b-4-x86_64.hpkg"
2923KERN: package_daemon [32721029:   807] active package: "gmp-6.1.2-1-x86_64.hpkg"
2924KERN: package_daemon [32728635:   807] active package: "freetype-2.7.1-1-x86_64.hpkg"
2925KERN: package_daemon [32736692:   807] active package: "bzip2-1.0.6-5-x86_64.hpkg"
2926KERN: package_daemon [32744469:   807] active package: "unzip-6.0-3-x86_64.hpkg"
2927KERN: package_daemon [32752068:   807] active package: "pkgconfig-0.29.1-1-x86_64.hpkg"
2928KERN: package_daemon [32760282:   807] active package: "nano-2.7.2-1-x86_64.hpkg"
2929KERN: package_daemon [32767967:   807] register_domain(5, internet6)
2930KERN: active package: "libtool_libltdl-2.4.2-2-x86_64.hpkg"
2931KERN: unregister_domain(0xffffffffb2743180, 5, internet6)
2932KERN: package_daemon [32779888:   807] active package: "less-481-1-x86_64.hpkg"
2933KERN: package_daemon [32792610:   807] active package: "grep-2.24-1-x86_64.hpkg"
2934KERN: register_domain(5, internet6)
2935KERN: package_daemon [32800369:   807] unregister_domain(0xffffffffb2743180, 5, internet6)
2936KERN: active package: "freetype_devel-2.7.1-1-x86_64.hpkg"
2937KERN: package_daemon [32817537:   807] active package: "bzip2_devel-1.0.6-5-x86_64.hpkg"
2938KERN: package_daemon [32825996:   807] active package: "vision-0.9.8-2-x86_64.hpkg"
2939KERN: package_daemon [32834022:   807] active package: "python-2.7.12-1-x86_64.hpkg"
2940KERN: package_daemon [32842129:   807] active package: "nasm-2.12.01-1-x86_64.hpkg"
2941KERN: package_daemon [32850152:   807] active package: "libvorbis-1.3.5-3-x86_64.hpkg"
2942KERN: package_daemon [32858294:   807] active package: "libedit-2015_03_21_3.1-5-x86_64.hpkg"
2943KERN: register_domain(1, internet)
2944KERN: package_daemon [32867025:   807] active package: "groff-1.20.1-3-x86_64.hpkg"
2945KERN: package_daemon [32878134:   807] active package: "gawk-4.1.0-1-x86_64.hpkg"
2946KERN: package_daemon [32885832:   807] active package: "ca_root_certificates-2015_10_28-1-any.hpkg"
2947KERN: package_daemon [32895120:   807] active package: "webpositive-r1~alpha4_pm_hrev51008-1-x86_64.hpkg"
2948KERN: unregister_domain(0xffffffffb273bf00, 1, internet)
2949KERN: package_daemon [32904900:   807] active package: "qrencode-3.4.4-2-x86_64.hpkg"
2950KERN: package_daemon [32918037:   807] active package: "ncurses6-6.0-2-x86_64.hpkg"
2951KERN: package_daemon [32925898:   807] active package: "libvpx3-1.5.0-1-x86_64.hpkg"
2952KERN: package_daemon [32933848:   807] active package: "libexecinfo-1.1-1-x86_64.hpkg"
2953KERN: package_daemon [32941978:   807] active package: "gcc-5.4.0_2016_06_04-4-x86_64.hpkg"
2954KERN: package_daemon [32950544:   807] register_domain(9, unix)
2955KERN: active package: "cdrtools-3.02~a07-1-x86_64.hpkg"
2956KERN: unregister_domain(0xffffffffb2743180, 9, unix)
2957KERN: package_daemon [32961663:   807] active package: "wget-1.18-2-x86_64.hpkg"
2958KERN: package_daemon [32974005:   807] active package: "readline-7.0-1-x86_64.hpkg"
2959KERN: usb hub 7: package_daemon [32981887:   807] port 1 is not suspended
2960KERN: active package: "netcat-1.10-2-x86_64.hpkg"
2961KERN: usb hub 7: package_daemon [32993797:   807] port 1 is not in an over current state
2962KERN: active package: "libwebp-0.5.2-1-x86_64.hpkg"
2963KERN: register_domain(5, internet6)
2964KERN: package_daemon [33007153:   807] usb hub 7: active package: "libffi-3.2.1-3-x86_64.hpkg"
2965KERN: unregister_domain(0xffffffffb2743180, 5, internet6)
2966KERN: package_daemon [33019633:   807] port 1 was reset
2967KERN: active package: "gcc_syslibs-5.4.0_2016_06_04-4-x86_64.hpkg"
2968KERN: package_daemon [33036195:   807] register_domain(1, internet)
2969KERN: active package: "coreutils-8.24-1-x86_64.hpkg"
2970KERN: unregister_domain(0xffffffffb2743180, 1, internet)
2971KERN: package_daemon [33047384:   807] active package: "which-2.21-3-x86_64.hpkg"
2972KERN: package_daemon [33060152:   807] active package: "readline6-6.3.8-1-x86_64.hpkg"
2973KERN: package_daemon [33068283:   807] active package: "noto-20170202-4-any.hpkg"
2974KERN: register_domain(5, internet6)
2975KERN: package_daemon [33075979:   807] unregister_domain(0xffffffffb2743180, 5, internet6)
2976KERN: active package: "libxml2-2.9.3-4-x86_64.hpkg"
2977KERN: package_daemon [33092356:   807] active package: "libicns-0.8.1-5-x86_64.hpkg"
2978KERN: package_daemon [33100303:   807] active package: "gutenprint-5.2.12-1-x86_64.hpkg"
2979KERN: package_daemon [33108604:   807] active package: "gettext_libintl-0.19.8.1-3-x86_64.hpkg"
2980KERN: package_daemon [33117512:   807] active package: "ctags-5.8-4-x86_64.hpkg"
2981KERN: package_daemon [33125118:   807] active package: "wpa_supplicant-2.0-5-x86_64.hpkg"
2982KERN: package_daemon [33133505:   807] active package: "scons-2.5.1-2-x86_64.hpkg"
2983KERN: package_daemon [33141282:   807] active package: "noto_sans_cjk_jp-1.004-2-any.hpkg"
2984KERN: register_domain(5, internet6)
2985KERN: package_daemon [33149752:   807] unregister_domain(0xffffffffb2743180, 5, internet6)
2986KERN: active package: "libxslt-1.1.28-8-x86_64.hpkg"
2987KERN: package_daemon [33166217:   807] active package: "libiconv-1.13.1-8-x86_64.hpkg"
2988KERN: package_daemon [33174359:   807] register_domain(5, internet6)
2989KERN: active package: "gzip-1.8-1-x86_64.hpkg"
2990KERN: unregister_domain(0xffffffffb2743180, 5, internet6)
2991KERN: package_daemon [33185129:   807] The latest volume state is also the currently active one
2992KERN: package_daemon [33199233:   807] Volume::InitialVerify((nil), (nil))
2993KERN: register_domain(1, internet)
2994KERN: register_domain(5, internet6)
2995KERN: radeon_hd: init_hardware
2996KERN: radeon_hd: init_driver
2997KERN: radeon_hd: init_driver: GPU(0) Radeon RX 470/480, revision = 0xc7
2998KERN: radeon_hd: publish_devices
2999KERN: radeon_hd: find_device
3000KERN: loaded driver /boot/system/add-ons/kernel/drivers/dev/graphics/radeon_hd
3001KERN: Radeon - init_hardware: Version: 5.1.6.0
3002KERN: Radeon - Radeon_CardDetect: no supported devices found
3003KERN: package_daemon [33256960:   807] Volume::InitialVerify(): volume at "/boot/system" is consistent
3004KERN: package_daemon [33266726:   807] Failed to open packages activation file: No such file or directory
3005KERN: package_daemon [33276527:   807] Failed to get activated packages info from activated packages file. Assuming all package files in package directory are activated.
3006KERN: package_daemon [33291905:   807] latest volume state:
3007KERN: package_daemon [33297687:   807] The latest volume state is also the currently active one
3008KERN: package_daemon [33306616:   807] Volume::InitialVerify(0x17316acb6a0, (nil))
3009KERN: intel_extreme: CALLED status_t init_hardware()
3010KERN: package_daemon [33316238:   807] Volume::InitialVerify(): volume at "/boot/home/config" is consistent
3011KERN: devfs: "intel_810" api_version missing
3012KERN: i810: init_hardware() - no supported devices
3013KERN: vesa: init_hardware()
3014KERN: framebuffer: init_hardware()
3015KERN: framebuffer: init_driver()
3016KERN: framebuffer: publish_devices()
3017KERN: framebuffer: find_device()
3018KERN: loaded driver /boot/system/add-ons/kernel/drivers/dev/graphics/framebuffer
3019KERN: slab memory manager: created area 0xffffffffb3001000 (4806)
3020KERN: add_memory_type_range(4808, 0xe0000000, 0x10000000, 0)
3021KERN: set MTRRs to:
3022KERN:   mtrr:  0: base: 0xce6a3000, size:     0x1000, type: 0
3023KERN:   mtrr:  1: base: 0xce6b8000, size:     0x4000, type: 0
3024KERN:   mtrr:  2: base: 0xce6a8000, size:     0x8000, type: 0
3025KERN:   mtrr:  3: base: 0xce6b0000, size:     0x8000, type: 0
3026KERN:   mtrr:  4: base: 0xdb000000, size:   0x800000, type: 0
3027KERN:   mtrr:  5: base: 0xe0000000, size: 0x20000000, type: 0
3028KERN: remove_memory_type_range(99, 0xe0000000, 0x8ca000, 1)
3029KERN: set MTRRs to:
3030KERN:   mtrr:  0: base: 0xce6a3000, size:     0x1000, type: 0
3031KERN:   mtrr:  1: base: 0xce6b8000, size:     0x4000, type: 0
3032KERN:   mtrr:  2: base: 0xce6a8000, size:     0x8000, type: 0
3033KERN:   mtrr:  3: base: 0xce6b0000, size:     0x8000, type: 0
3034KERN:   mtrr:  4: base: 0xdb000000, size:   0x800000, type: 0
3035KERN:   mtrr:  5: base: 0xe0000000, size: 0x20000000, type: 0
3036KERN: add_memory_type_range(4808, 0xe0000000, 0x10000000, 1)
3037KERN: set MTRRs to:
3038KERN:   mtrr:  0: base: 0xce6a3000, size:     0x1000, type: 0
3039KERN:   mtrr:  1: base: 0xce6b8000, size:     0x4000, type: 0
3040KERN:   mtrr:  2: base: 0xce6a8000, size:     0x8000, type: 0
3041KERN:   mtrr:  3: base: 0xce6b0000, size:     0x8000, type: 0
3042KERN:   mtrr:  4: base: 0xdb000000, size:   0x800000, type: 0
3043KERN:   mtrr:  5: base: 0xf0000000, size: 0x10000000, type: 0
3044KERN:   mtrr:  6: base: 0xe0000000, size: 0x20000000, type: 1
3045KERN: framebuffer: framebuffer_init() completed successfully!
3046KERN: framebuffer: acc: framebuffer.accelerant
3047KERN: Test: and [file_exists [/system/bin/FirstBootPrompt], or [not [file_exists [/boot/home/config/settings/Locale setKERN: tings]], readonly ]] -> 0
3048KERN: app_server: Finding best mode for 1024x768 (8, 60 Hz, strict) failed
3049KERN: app_server: Finding best mode for 800x600 (8, 60 Hz) failed
3050KERN: app_server: Use 2592x1242 (8) instead.
3051KERN: loaded driver /boot/system/add-ons/kernel/drivers/dev/net/usb_ecm
3052KERN: [33musb_davicom:[0m00.33.646:init_driver::ver.0.9.5
3053KERN: loaded driver /boot/system/add-ons/kernel/drivers/dev/net/usb_davicom
3054KERN: [33musb_asix:[0m00.33.658:init_driver::ver.0.10.1
3055KERN: loaded driver /boot/system/add-ons/kernel/drivers/dev/net/usb_asix
3056KERN: loaded driver /boot/system/add-ons/kernel/drivers/dev/net/pegasus
3057KERN: etherpci: init_driver KERN: init_driver: etherpci not found
3058KERN: sis19x:00.33.697:init_hardware::SiS19X:init_hardware()
3059KERN: [ipro1000] (em) bus_alloc_resource(3, [16], 0x0, 0xffffffffffffffff, 0x1,0x2)
3060KERN: add_memory_type_range(5647, 0xfe400000, 0x20000, 0)
3061KERN: set MTRRs to:
3062KERN:   mtrr:  0: base: 0xce6a3000, size:     0x1000, type: 0
3063KERN:   mtrr:  1: base: 0xce6b8000, size:     0x4000, type: 0
3064KERN:   mtrr:  2: base: 0xce6a8000, size:     0x8000, type: 0
3065KERN:   mtrr:  3: base: 0xce6b0000, size:     0x8000, type: 0
3066KERN:   mtrr:  4: base: 0xdb000000, size:   0x800000, type: 0
3067KERN:   mtrr:  5: base: 0xf0000000, size: 0x10000000, type: 0
3068KERN:   mtrr:  6: base: 0xe0000000, size: 0x20000000, type: 1
3069KERN: allocate_io_interrupt_vectors: allocated 1 vectors starting from 61
3070KERN: msi_allocate_vectors: allocated 1 vectors starting from 61
3071KERN: [ipro1000] (em) Using an MSI interrupt
3072KERN: [ipro1000] (em) bus_alloc_resource(1, [1], 0x0, 0xffffffffffffffff, 0x1,0x6)
3073KERN: msi enabled: 0x0181
3074KERN: if_initname(0xffffffff80ad9000, em, 61)
3075KERN: [ipro1000] ipro1000: /dev/net/ipro1000/0
3076KERN: ifmedia_add: Adding Entry...
3077KERN:   Type: Ethernet
3078KERN:   SubType: 10baseT/UTP
3079KERN: ifmedia_add: Adding Entry...
3080KERN:   Type: Ethernet
3081KERN:   SubType: 10baseT/UTP
3082KERN:   Shared Option[0]: full-duplex
3083KERN: ifmedia_add: Adding Entry...
3084KERN:   Type: Ethernet
3085KERN:   SubType: 100baseTX
3086KERN: ifmedia_add: Adding Entry...
3087KERN:   Type: Ethernet
3088KERN:   SubType: 100baseTX
3089KERN:   Shared Option[0]: full-duplex
3090KERN: ifmedia_add: Adding Entry...
3091KERN:   Type: Ethernet
3092KERN:   SubType: 1000baseT
3093KERN:   Shared Option[0]: full-duplex
3094KERN: ifmedia_add: Adding Entry...
3095KERN:   Type: Ethernet
3096KERN:   SubType: 1000baseT
3097KERN: ifmedia_add: Adding Entry...
3098KERN:   Type: Ethernet
3099KERN:   SubType: autoselect
3100KERN: ifmedia_set: target KERN:   Type: Ethernet
3101KERN:   SubType: autoselect
3102KERN: ifmedia_set: setting to   Type: Ethernet
3103KERN:   SubType: autoselect
3104KERN: ipro1000: init_driver(0xffffffffb0ed2fd0) at 14
3105KERN: loaded driver /boot/system/add-ons/kernel/drivers/dev/net/ipro1000
3106KERN: loaded driver /boot/system/add-ons/kernel/drivers/dev/input/wacom
3107KERN: usb_hid: no handlers for hid device
3108Last message repeated 1 time
3109KERN: loaded driver /boot/system/add-ons/kernel/drivers/dev/input/usb_hid
3110KERN: usb hub 7: port 1 is not suspended
3111KERN: usb hub 7: port 1 is not in an over current state
3112KERN: usb hub 7: port 1 was reset
3113KERN: ps2_hid: init_hardware
3114KERN: ps2_hid: init_driver
3115KERN: ps2_hid: publish_devices
3116KERN: ps2_hid: uninit_driver
3117KERN: loaded driver /boot/system/add-ons/kernel/drivers/dev/input/ps2_hid
3118KERN: Running first login script /boot/system/boot/first-login/default_deskbar_items.sh ...
3119KERN: ps2: reset failed
3120KERN: ps2: devfs_publish_device input/mouse/ps2/0, status = 0xffffffff
3121KERN: ps2: devfs_publish_device input/keyboard/at/0, status = 0x00000000
3122KERN: [net/ipro1000/0] compat_open(0x2)
3123KERN: ps2: keyboard reset failed, status 0x80000001, data 0xff
3124KERN: ifmedia_ioctl: switching em to KERN: ps2: keyboard probing failed
3125KERN:   Type: Ethernet
3126KERN: ps2: devfs_unpublish_device input/keyboard/at/0, status = 0x00000000
3127KERN: KeyboardDevice: error when opening /dev/input/keyboard/at/0: No error
3128KERN:   SubType: autoselect
3129KERN: usb_hid: keyboard device unhandled control 0x00002710
3130KERN: /dev/net/ipro1000/0: media change, media 0x20 quality 1000 speed 1000000000
3131KERN: bfs: bfs_create_index:2135: File or Directory already exists
3132Last message repeated 1 time
3133KERN: module: Search for bus_managers/ide/controller/driver_v1 failed.
3134KERN: loading dependent module bus_managers/ide/controller/driver_v1 of busses/ata/silicon_image_3112/driver_v1 failed!
3135KERN: module: Search for bus_managers/ide/controller/driver_v1 failed.
3136KERN: loading dependent module bus_managers/ide/controller/driver_v1 of busses/ata/legacy_sata/driver_v1 failed!
3137KERN: module: Search for bus_managers/ide/controller/driver_v1 failed.
3138KERN: loading dependent module bus_managers/ide/controller/driver_v1 of generic/ata_adapter/v1 failed!
3139KERN: loading dependent module generic/ata_adapter/v1 of busses/ata/it8211/driver_v1 failed!
3140KERN: module: Search for bus_managers/ide/controller/driver_v1 failed.
3141KERN: loading dependent module bus_managers/ide/controller/driver_v1 of busses/ata/generic_ide_pci/driver_v1 failed!
3142KERN: module: Search for bus_managers/ide/controller/driver_v1 failed.
3143KERN: loading dependent module bus_managers/ide/controller/driver_v1 of busses/ata/silicon_image_3112/driver_v1 failed!
3144KERN: module: Search for bus_managers/ide/controller/driver_v1 failed.
3145KERN: loading dependent module bus_managers/ide/controller/driver_v1 of busses/ata/legacy_sata/driver_v1 failed!
3146KERN: module: Search for bus_managers/ide/controller/driver_v1 failed.
3147KERN: loading dependent module bus_managers/ide/controller/driver_v1 of generic/ata_adapter/v1 failed!
3148KERN: loading dependent module generic/ata_adapter/v1 of busses/ata/it8211/driver_v1 failed!
3149KERN: module: Search for bus_managers/ide/controller/driver_v1 failed.
3150KERN: usb hub 7: KERN: loading dependent module bus_managers/ide/controller/driver_v1 of busses/ata/generic_ide_pci/driver_v1 failed!
3151KERN: port 1 is not suspended
3152KERN: usb hub 7: KERN: port 1 is not in an over current state
3153KERN: usb hub 7: KERN: port 1 was reset
3154KERN: slab memory manager: created area 0xffffffffc3801000 (7363)
3155KERN: loaded driver /boot/system/add-ons/kernel/drivers/dev/bus/usb_raw
3156KERN: sis7018:init_hardware:ver:2.0.2
3157KERN: pci_reserve_device(40, 0, 1, hda)
3158KERN: HDA: Detected controller @ PCI:40:0:1, IRQ:55, type 1002/aaf0 (1682/aaf0)
3159KERN: pci_reserve_device(42, 0, 3, hda)
3160KERN: HDA: Detected controller @ PCI:42:0:3, IRQ:43, type 1022/1457 (1043/8733)
3161KERN: loaded driver /boot/system/add-ons/kernel/drivers/dev/audio/hmulti/hda
3162KERN: emuxki: init_hardware()
3163KERN: echo3g: init_hardware()
3164KERN: echo3g: no card found
3165KERN: auvia: init_hardware()
3166KERN: auich: init_hardware()
3167KERN: add_memory_type_range(7585, 0xfe860000, 0x4000, 0)
3168KERN: set MTRRs to:
3169KERN:   mtrr:  0: base: 0xce6a3000, size:     0x1000, type: 0
3170KERN:   mtrr:  1: base: 0xce6b8000, size:     0x4000, type: 0
3171KERN:   mtrr:  2: base: 0xce6a8000, size:     0x8000, type: 0
3172KERN:   mtrr:  3: base: 0xce6b0000, size:     0x8000, type: 0
3173KERN:   mtrr:  4: base: 0xdb000000, size:   0x800000, type: 0
3174KERN:   mtrr:  5: base: 0xf0000000, size: 0x10000000, type: 0
3175KERN:   mtrr:  6: base: 0xe0000000, size: 0x20000000, type: 1
3176KERN: allocate_io_interrupt_vectors: allocated 1 vectors starting from 62
3177KERN: msi_allocate_vectors: allocated 1 vectors starting from 62
3178KERN: msi enabled: 0x0081
3179KERN: hda: using MSI vector 62
3180KERN: hda: DMA snooping: no
3181KERN: hda: HDA v1.0, O:6/I:0/B:0, #SDO:1, 64bit:yes
3182KERN: add_memory_type_range(7586, 0x10c26000, 0x1000, 0)
3183KERN: set MTRRs to:
3184KERN:   mtrr:  0: base: 0x10c26000, size:     0x1000, type: 0
3185KERN:   mtrr:  1: base: 0xce6a3000, size:     0x1000, type: 0
3186KERN:   mtrr:  2: base: 0xce6b8000, size:     0x4000, type: 0
3187KERN:   mtrr:  3: base: 0xce6a8000, size:     0x8000, type: 0
3188KERN:   mtrr:  4: base: 0xce6b0000, size:     0x8000, type: 0
3189KERN:   mtrr:  5: base: 0xdb000000, size:   0x800000, type: 0
3190KERN:   mtrr:  6: base: 0xf0000000, size: 0x10000000, type: 0
3191KERN:   mtrr:  7: base: 0xe0000000, size: 0x20000000, type: 1
3192KERN: hda: Codec 0 Vendor: 1002 Product: aa01, Revision: 1.0.7.0 Quirks: 0700
3193KERN: hda: Audio Group: Output delay: 0 samples, Input delay: 0 samples, Beep Generator: no
3194KERN: hda:   #GPIO: 0, #GPO: 0, #GPI: 0, unsol: no, wake: no
3195KERN: hda:  Supported formats: 16bits
3196KERN: hda:  Supported rates: 32khz 44khz 48khz
3197KERN: hda:   widget start 2, count 14
3198KERN: hda: 2: Audio output
3199KERN: hda:  Supported formats: 16bits
3200KERN: hda:  Supported rates: 32khz 44khz 48khz
3201KERN: hda:  Supported power states:
3202KERN: hda:  [Digital] [Stripe] [Stereo]
3203KERN: hda: 3: Pin complex
3204KERN: hda:  [Output]
3205KERN: hda:  Jack, HDMI Digital other out, Other digital, N/A, Association:15
3206KERN: hda:  Supported power states:
3207KERN: hda:  [Digital] [Conn. list] [Unsol. responses] [Stereo]
3208KERN: hda:  Inputs: <2>
3209KERN: hda: 4: Audio output
3210KERN: hda:  Supported formats: 16bits
3211KERN: hda:  Supported rates: 32khz 44khz 48khz
3212KERN: hda:  Supported power states:
3213KERN: hda:  [Digital] [Stripe] [Stereo]
3214KERN: hda: 5: Pin complex
3215KERN: hda:  [Output]
3216KERN: hda:  Jack, HDMI Digital other out, Other digital, N/A, Association:15
3217KERN: hda:  Supported power states:
3218KERN: hda:  [Digital] [Conn. list] [Unsol. responses] [Stereo]
3219KERN: hda:  Inputs: <4>
3220KERN: hda: 6: Audio output
3221KERN: hda:  Supported formats: 16bits
3222KERN: hda:  Supported rates: 32khz 44khz 48khz
3223KERN: hda:  Supported power states:
3224KERN: hda:  [Digital] [Stripe] [Stereo]
3225KERN: hda: 7: Pin complex
3226KERN: hda:  [Output]
3227KERN: hda:  Jack, HDMI Digital other out, Other digital, N/A, Association:15
3228KERN: hda:  Supported power states:
3229KERN: hda:  [Digital] [Conn. list] [Unsol. responses] [Stereo]
3230KERN: hda:  Inputs: <6>
3231KERN: hda: 8: Audio output
3232KERN: hda:  Supported formats: 16bits
3233KERN: hda:  Supported rates: 32khz 44khz 48khz
3234KERN: hda:  Supported power states:
3235KERN: hda:  [Digital] [Stripe] [Stereo]
3236KERN: hda: 9: Pin complex
3237KERN: hda:  [Output]
3238KERN: hda:  Jack, HDMI Digital other out, Other digital, N/A, Association:15
3239KERN: hda:  Supported power states:
3240KERN: hda:  [Digital] [Conn. list] [Unsol. responses] [Stereo]
3241KERN: hda:  Inputs: <8>
3242KERN: hda: 10: Audio output
3243KERN: hda:  Supported formats: 16bits
3244KERN: hda:  Supported rates: 32khz 44khz 48khz
3245KERN: hda:  Supported power states:
3246KERN: hda:  [Digital] [Stripe] [Stereo]
3247KERN: hda: 11: Pin complex
3248KERN: hda:  [Output]
3249KERN: hda:  Jack, HDMI Digital other out, Other digital, N/A, Association:15
3250KERN: hda:  Supported power states:
3251KERN: hda:  [Digital] [Conn. list] [Unsol. responses] [Stereo]
3252KERN: hda:  Inputs: <10>
3253KERN: hda: 12: Audio output
3254KERN: hda:  Supported formats: 16bits
3255KERN: hda:  Supported rates: 32khz 44khz 48khz
3256KERN: hda:  Supported power states:
3257KERN: hda:  [Digital] [Stripe] [Stereo]
3258KERN: hda: 13: Pin complex
3259KERN: hda:  [Output]
3260KERN: hda:  Jack, HDMI Digital other out, Other digital, N/A, Association:15
3261KERN: hda:  Supported power states:
3262KERN: hda:  [Digital] [Conn. list] [Unsol. responses] [Stereo]
3263KERN: hda:  Inputs: <12>
3264KERN: hda: 14: Audio output
3265KERN: hda:  Supported formats: 16bits
3266KERN: hda:  Supported rates: 32khz 44khz 48khz
3267KERN: hda:  Supported power states:
3268KERN: hda:  [Digital] [Stripe] [Stereo]
3269KERN: hda: 15: Pin complex
3270KERN: hda:  [Output]
3271KERN: hda:  None, HDMI Digital other out, Other digital, N/A, Association:15
3272KERN: hda:  Supported power states:
3273KERN: hda:  [Digital] [Conn. list] [Unsol. responses] [Stereo]
3274KERN: hda:  Inputs: <14>
3275KERN: hda: build output tree: use mixer
3276KERN: hda:   look at pin widget 3 (1 inputs)
3277KERN: hda:     try widget 2: 0xffffffffb28ddc08
3278KERN: hda:   look at pin widget 5 (1 inputs)
3279KERN: hda:     try widget 4: 0xffffffffb28ddd60
3280KERN: hda:   look at pin widget 7 (1 inputs)
3281KERN: hda:     try widget 6: 0xffffffffb28ddeb8
3282KERN: hda:   look at pin widget 9 (1 inputs)
3283KERN: hda:     try widget 8: 0xffffffffb28de010
3284KERN: hda:   look at pin widget 11 (1 inputs)
3285KERN: hda:     try widget 10: 0xffffffffb28de168
3286KERN: hda:   look at pin widget 13 (1 inputs)
3287KERN: hda:     try widget 12: 0xffffffffb28de2c0
3288KERN: hda:   look at pin widget 15 (1 inputs)
3289KERN: hda:     try widget 14: 0xffffffffb28de418
3290KERN: hda: try without mixer!
3291KERN: hda: build output tree: don't use mixer
3292KERN: hda:   look at pin widget 3 (1 inputs)
3293KERN: hda:     try widget 2: 0xffffffffb28ddc08
3294KERN: hda:     widget 2 is candidate
3295KERN: hda:       output: added output widget 2
3296KERN: hda:     add pin widget 3
3297KERN: hda:   look at pin widget 5 (1 inputs)
3298KERN: hda:     try widget 4: 0xffffffffb28ddd60
3299KERN: hda:     widget 4 is candidate
3300KERN: hda:       output: added output widget 4
3301KERN: hda:     add pin widget 5
3302KERN: hda:   look at pin widget 7 (1 inputs)
3303KERN: hda:     try widget 6: 0xffffffffb28ddeb8
3304KERN: hda:     widget 6 is candidate
3305KERN: hda:       output: added output widget 6
3306KERN: hda:     add pin widget 7
3307KERN: hda:   look at pin widget 9 (1 inputs)
3308KERN: hda:     try widget 8: 0xffffffffb28de010
3309KERN: hda:     widget 8 is candidate
3310KERN: hda:       output: added output widget 8
3311KERN: hda:     add pin widget 9
3312KERN: hda:   look at pin widget 11 (1 inputs)
3313KERN: hda:     try widget 10: 0xffffffffb28de168
3314KERN: hda:     widget 10 is candidate
3315KERN: hda:       output: added output widget 10
3316KERN: hda:     add pin widget 11
3317KERN: hda:   look at pin widget 13 (1 inputs)
3318KERN: hda:     try widget 12: 0xffffffffb28de2c0
3319KERN: hda:     widget 12 is candidate
3320KERN: hda:       output: added output widget 12
3321KERN: hda:     add pin widget 13
3322KERN: hda:   look at pin widget 15 (1 inputs)
3323KERN: hda:     try widget 14: 0xffffffffb28de418
3324KERN: hda:     widget 14 is candidate
3325KERN: hda:       output: added output widget 14
3326KERN: hda:     add pin widget 15
3327KERN: hda: build input tree
3328KERN: hda: build input tree failed
3329KERN: hda: build tree!
3330KERN: hda:  Audiogroup:
3331KERN: hda: 2: Audio output
3332KERN: hda:  Supported power states:
3333KERN: hda:  [Digital] [Stripe] [Stereo]
3334KERN: hda: 3: Pin complex
3335KERN: hda:  [Pres Detect][Output]
3336KERN: hda:  Supported power states:
3337KERN: hda:  [Digital] [Conn. list] [Unsol. responses] [Stereo]
3338KERN: hda:  Inputs: <2>
3339KERN: hda: 4: Audio output
3340KERN: hda:  Supported power states:
3341KERN: hda:  [Digital] [Stripe] [Stereo]
3342KERN: hda: 5: Pin complex
3343KERN: hda:  [Pres Detect][Output]
3344KERN: hda:  Supported power states:
3345KERN: hda:  [Digital] [Conn. list] [Unsol. responses] [Stereo]
3346KERN: hda:  Inputs: <4>
3347KERN: hda: 6: Audio output
3348KERN: hda:  Supported power states:
3349KERN: hda:  [Digital] [Stripe] [Stereo]
3350KERN: hda: 7: Pin complex
3351KERN: hda:  [Pres Detect][Output]
3352KERN: hda:  Supported power states:
3353KERN: hda:  [Digital] [Conn. list] [Unsol. responses] [Stereo]
3354KERN: hda:  Inputs: <6>
3355KERN: hda: 8: Audio output
3356KERN: hda:  Supported power states:
3357KERN: hda:  [Digital] [Stripe] [Stereo]
3358KERN: hda: 9: Pin complex
3359KERN: hda:  [Pres Detect][Output]
3360KERN: hda:  Supported power states:
3361KERN: hda:  [Digital] [Conn. list] [Unsol. responses] [Stereo]
3362KERN: hda:  Inputs: <8>
3363KERN: hda: 10: Audio output
3364KERN: hda:  Supported power states:
3365KERN: hda:  [Digital] [Stripe] [Stereo]
3366KERN: hda: 11: Pin complex
3367KERN: hda:  [Pres Detect][Output]
3368KERN: hda:  Supported power states:
3369KERN: hda:  [Digital] [Conn. list] [Unsol. responses] [Stereo]
3370KERN: hda:  Inputs: <10>
3371KERN: hda: 12: Audio output
3372KERN: hda:  Supported power states:
3373KERN: hda:  [Digital] [Stripe] [Stereo]
3374KERN: hda: 13: Pin complex
3375KERN: hda:  [Pres Detect][Output]
3376KERN: hda:  Supported power states:
3377KERN: hda:  [Digital] [Conn. list] [Unsol. responses] [Stereo]
3378KERN: hda:  Inputs: <12>
3379KERN: hda: 14: Audio output
3380KERN: hda:  Supported power states:
3381KERN: hda:  [Digital] [Stripe] [Stereo]
3382KERN: hda: 15: Pin complex
3383KERN: hda:  [Pres Detect][Output]
3384KERN: hda:  Supported power states:
3385KERN: hda:  [Digital] [Conn. list] [Unsol. responses] [Stereo]
3386KERN: hda:  Inputs: <14>
3387KERN: hda: Enabled unsolicited responses on widget 3
3388KERN: hda: Enabled unsolicited responses on widget 5
3389KERN: hda: Enabled unsolicited responses on widget 7
3390KERN: hda: Enabled unsolicited responses on widget 9
3391KERN: hda: Enabled unsolicited responses on widget 11
3392KERN: hda: Enabled unsolicited responses on widget 13
3393KERN: hda: Enabled unsolicited responses on widget 15
3394KERN: hda: ENABLE pin widget 3
3395KERN: hda: ENABLE pin widget 5
3396KERN: hda: ENABLE pin widget 7
3397KERN: hda: ENABLE pin widget 9
3398KERN: hda: ENABLE pin widget 11
3399KERN: hda: ENABLE pin widget 13
3400KERN: hda: ENABLE pin widget 15
3401KERN: hda: hda_audio_group_get_widgets failed for  playback stream
3402KERN: hda: hda_audio_group_get_widgets failed for record stream
3403KERN: hda: streams playback 0x0000000000000000, record 0x0000000000000000
3404KERN: hda: Failed to setup new audio function group (No such device)!
3405KERN: hda: no active codec
3406KERN: remove_memory_type_range(7585, 0xfe860000, 0x4000, 0)
3407KERN: set MTRRs to:
3408KERN:   mtrr:  0: base: 0x10c26000, size:     0x1000, type: 0
3409KERN:   mtrr:  1: base: 0xce6a3000, size:     0x1000, type: 0
3410KERN:   mtrr:  2: base: 0xce6b8000, size:     0x4000, type: 0
3411KERN:   mtrr:  3: base: 0xce6a8000, size:     0x8000, type: 0
3412KERN:   mtrr:  4: base: 0xce6b0000, size:     0x8000, type: 0
3413KERN:   mtrr:  5: base: 0xdb000000, size:   0x800000, type: 0
3414KERN:   mtrr:  6: base: 0xf0000000, size: 0x10000000, type: 0
3415KERN:   mtrr:  7: base: 0xe0000000, size: 0x20000000, type: 1
3416KERN: hda: ERROR: No such device(2147512327)
3417KERN: add_memory_type_range(7587, 0xfe700000, 0x8000, 0)
3418KERN: set MTRRs to:
3419KERN:   mtrr:  0: base: 0x10c26000, size:     0x1000, type: 0
3420KERN:   mtrr:  1: base: 0xce6a3000, size:     0x1000, type: 0
3421KERN:   mtrr:  2: base: 0xce6b8000, size:     0x4000, type: 0
3422KERN:   mtrr:  3: base: 0xce6a8000, size:     0x8000, type: 0
3423KERN:   mtrr:  4: base: 0xce6b0000, size:     0x8000, type: 0
3424KERN:   mtrr:  5: base: 0xdb000000, size:   0x800000, type: 0
3425KERN:   mtrr:  6: base: 0xf0000000, size: 0x10000000, type: 0
3426KERN:   mtrr:  7: base: 0xe0000000, size: 0x20000000, type: 1
3427KERN: hda: enabling PCI bus mastering
3428KERN: hda: enabling PCI memory access
3429KERN: allocate_io_interrupt_vectors: allocated 1 vectors starting from 63
3430KERN: msi_allocate_vectors: allocated 1 vectors starting from 63
3431KERN: msi enabled: 0x0081
3432KERN: hda: using MSI vector 63
3433KERN: hda: DMA snooping: no
3434KERN: hda: HDA v1.0, O:4/I:4/B:0, #SDO:1, 64bit:yes
3435KERN: add_memory_type_range(7588, 0x121f3000, 0x1000, 0)
3436KERN: set MTRRs to:
3437KERN:   mtrr:  0: base: 0xce6b8000, size:     0x4000, type: 0
3438KERN: usb hub 7: KERN:   mtrr:  1: base: 0xce6a8000, size:     0x8000, type: 0
3439KERN: port 1 is not suspended
3440KERN:   mtrr:  2: base: 0xce6b0000, size:     0x8000, type: 0
3441KERN: usb hub 7: KERN:   mtrr:  3: base: 0xf0000000, size: 0x10000000, type: 0
3442KERN: port 1 is not in an over current state
3443KERN:   mtrr:  4: base: 0xe0000000, size: 0x20000000, type: 1
3444KERN: usb hub 7: KERN: update_mtrrs(): Succeeded setting MTRRs after ignoring uncacheable ranges up to size 0x1000.
3445KERN: port 1 was reset
3446KERN: hda: Codec 0 Vendor: 10ec Product: 1168, Revision: 1.0.0.3 Quirks: 0700
3447KERN: hda: Audio Group: Output delay: 15 samples, Input delay: 15 samples, Beep Generator: yes
3448KERN: hda:   #GPIO: 8, #GPO: 0, #GPI: 0, unsol: yes, wake: no
3449KERN: hda:  Supported formats: 16bits 20bits 24bits
3450KERN: hda:  Supported rates: 32khz 44khz 48khz 88khz 96khz 192khz
3451KERN: hda:   widget start 2, count 37
3452KERN: hda: 2: Audio output
3453KERN: hda:  Supported formats: 16bits 20bits 24bits 32bits
3454KERN: hda:  Supported rates: 44khz 48khz 88khz 96khz 176khz 192khz
3455KERN: hda:  Supported power states: D0 D1 D2 D3
3456KERN: hda:  [Power] [Format override] [Amplifier override] [Out amplifier] [Stereo]
3457KERN: hda:  Out Amp: step size: 0.75 dB, # steps: 87, offset to 0 dB: 87
3458KERN: hda: 3: Audio output
3459KERN: hda:  Supported formats: 16bits 20bits 24bits 32bits
3460KERN: hda:  Supported rates: 44khz 48khz 88khz 96khz 176khz 192khz
3461KERN: hda:  Supported power states: D0 D1 D2 D3
3462KERN: hda:  [Power] [Format override] [Amplifier override] [Out amplifier] [Stereo]
3463KERN: hda:  Out Amp: step size: 0.75 dB, # steps: 87, offset to 0 dB: 87
3464KERN: hda: 4: Audio output
3465KERN: hda:  Supported formats: 16bits 20bits 24bits 32bits
3466KERN: hda:  Supported rates: 44khz 48khz 88khz 96khz 176khz 192khz
3467KERN: hda:  Supported power states: D0 D1 D2 D3
3468KERN: hda:  [Power] [Format override] [Amplifier override] [Out amplifier] [Stereo]
3469KERN: hda:  Out Amp: step size: 0.75 dB, # steps: 87, offset to 0 dB: 87
3470KERN: hda: 5: Audio output
3471KERN: hda:  Supported formats: 16bits 20bits 24bits 32bits
3472KERN: hda:  Supported rates: 44khz 48khz 88khz 96khz 176khz 192khz
3473KERN: hda:  Supported power states: D0 D1 D2 D3
3474KERN: hda:  [Power] [Format override] [Amplifier override] [Out amplifier] [Stereo]
3475KERN: hda:  Out Amp: step size: 0.75 dB, # steps: 87, offset to 0 dB: 87
3476KERN: hda: 6: Audio output
3477KERN: hda:  Supported formats: 16bits 20bits 24bits
3478KERN: hda:  Supported rates: 32khz 44khz 48khz 88khz 96khz 192khz
3479KERN: hda:  Supported power states: D0 D1 D2 D3
3480KERN: hda:  [Power] [Digital] [Format override] [Stereo]
3481KERN: hda: 7: Vendor defined
3482KERN: hda:  Supported power states: D0
3483KERN: hda: 8: Audio input
3484KERN: hda:  Supported formats: 16bits 20bits 24bits
3485KERN: hda:  Supported rates: 44khz 48khz 88khz 96khz 176khz 192khz
3486KERN: hda:  Supported power states: D0 D1 D2 D3
3487KERN: hda:  [Power] [Conn. list] [Format override] [Amplifier override] [In amplifier] [Stereo]
3488KERN: hda:  In Amp: supports mute, step size: 0.75 dB, # steps: 63, offset to 0 dB: 23
3489KERN: hda:  Inputs: <35>
3490KERN: hda: 9: Audio input
3491KERN: hda:  Supported formats: 16bits 20bits 24bits 32bits
3492KERN: hda:  Supported rates: 44khz 48khz 88khz 96khz 176khz 192khz
3493KERN: hda:  Supported power states: D0 D1 D2 D3
3494KERN: hda:  [Power] [Conn. list] [Format override] [Amplifier override] [In amplifier] [Stereo]
3495KERN: hda:  In Amp: supports mute, step size: 0.75 dB, # steps: 63, offset to 0 dB: 23
3496KERN: hda:  Inputs: <34>
3497KERN: hda: 10: Vendor defined
3498KERN: hda:  Supported power states: D0
3499KERN: hda: 11: Audio mixer
3500KERN: hda:  Supported power states: D0
3501KERN: hda:  [Conn. list] [Amplifier override] [In amplifier] [Stereo]
3502KERN: hda:  In Amp: supports mute, step size: 1.5 dB, # steps: 31, offset to 0 dB: 23
3503KERN: hda:  Inputs: 24 25 26 27 29 21 22 23
3504KERN: hda: 12: Audio mixer
3505KERN: hda:  Supported power states: D0
3506KERN: hda:  [Conn. list] [Amplifier override] [In amplifier] [Stereo]
3507KERN: hda:  In Amp: supports mute, step size: 0.25 dB, # steps: 0, offset to 0 dB: 0
3508KERN: hda:  Inputs: 2 11
3509KERN: hda: 13: Audio mixer
3510KERN: hda:  Supported power states: D0
3511KERN: hda:  [Conn. list] [Amplifier override] [In amplifier] [Stereo]
3512KERN: hda:  In Amp: supports mute, step size: 0.25 dB, # steps: 0, offset to 0 dB: 0
3513KERN: hda:  Inputs: 3 11
3514KERN: hda: 14: Audio mixer
3515KERN: hda:  Supported power states: D0
3516KERN: hda:  [Conn. list] [Amplifier override] [In amplifier] [Stereo]
3517KERN: hda:  In Amp: supports mute, step size: 0.25 dB, # steps: 0, offset to 0 dB: 0
3518KERN: hda:  Inputs: 4 11
3519KERN: hda: 15: Audio mixer
3520KERN: hda:  Supported power states: D0
3521KERN: hda:  [Conn. list] [Amplifier override] [In amplifier] [Stereo]
3522KERN: hda:  In Amp: supports mute, step size: 0.25 dB, # steps: 0, offset to 0 dB: 0
3523KERN: hda:  Inputs: 5 11
3524KERN: hda: 16: Vendor defined
3525KERN: hda:  Supported power states: D0
3526KERN: hda: 17: Vendor defined
3527KERN: hda:  Supported power states: D0
3528KERN: hda: 18: Pin complex
3529KERN: hda:  [Input]
3530KERN: hda:  None, Speaker, 1/8", Black, Association:15
3531KERN: hda:  Supported power states: D0 D1 D2 D3
3532KERN: hda:  [Power] [Amplifier override] [In amplifier] [Stereo]
3533KERN: hda:  In Amp: step size: 10 dB, # steps: 3, offset to 0 dB: 0
3534KERN: hda: 19: Vendor defined
3535KERN: hda:  Supported power states: D0
3536KERN: hda: 20: Pin complex
3537KERN: hda:  [Output]
3538KERN: hda:  Jack, Line out, 1/8", Green, Association:1
3539KERN: hda:  Supported power states: D0 D1 D2 D3
3540KERN: hda:  [Power] [Conn. list] [Unsol. responses] [Amplifier override] [Out amplifier] [Stereo]
3541KERN: hda:  Out Amp: supports mute, step size: 0.25 dB, # steps: 0, offset to 0 dB: 0
3542KERN: hda:  Inputs: <12>
3543KERN: hda: 21: Pin complex
3544KERN: hda:  [Input] [Output]
3545KERN: hda:  Jack, Line out, 1/8", Black, Association:1
3546KERN: hda:  Supported power states: D0 D1 D2 D3
3547KERN: hda:  [Power] [Conn. list] [Unsol. responses] [Amplifier override] [Out amplifier] [Stereo]
3548KERN: hda:  Out Amp: supports mute, step size: 0.25 dB, # steps: 0, offset to 0 dB: 0
3549KERN: hda:  Inputs: <13>
3550KERN: hda: 22: Pin complex
3551KERN: hda:  [Input] [Output]
3552KERN: hda:  Jack, Line out, 1/8", Orange, Association:1
3553KERN: hda:  Supported power states: D0 D1 D2 D3
3554KERN: hda:  [Power] [Conn. list] [Unsol. responses] [Amplifier override] [Out amplifier] [Stereo]
3555KERN: hda:  Out Amp: supports mute, step size: 0.25 dB, # steps: 0, offset to 0 dB: 0
3556KERN: hda:  Inputs: <14>
3557KERN: hda: 23: Pin complex
3558KERN: hda:  [Input] [Output]
3559KERN: hda:  None, CD, Other analog, N/A, Association:0
3560KERN: hda:  Supported power states: D0 D1 D2 D3
3561KERN: hda:  [Power] [Conn. list] [Unsol. responses] [Amplifier override] [Out amplifier] [Stereo]
3562KERN: hda:  Out Amp: supports mute, step size: 0.25 dB, # steps: 0, offset to 0 dB: 0
3563KERN: hda:  Inputs: <15>
3564KERN: hda: 24: Pin complex
3565KERN: hda:  [Input] [Output]
3566KERN: hda:  Jack, Mic in, 1/8", Pink, Association:4
3567KERN: hda:  Supported power states: D0 D1 D2 D3
3568KERN: hda:  [Power] [Conn. list] [Unsol. responses] [Amplifier override] [Out amplifier] [In amplifier] [Stereo]
3569KERN: hda:  In Amp: step size: 10 dB, # steps: 3, offset to 0 dB: 0
3570KERN: hda:  Out Amp: supports mute, step size: 0.25 dB, # steps: 0, offset to 0 dB: 0
3571KERN: hda:  Inputs: 12 13 14 15 38
3572KERN: hda: 25: Pin complex
3573KERN: hda:  [Input] [Output]
3574KERN: hda:  Jack, Front Mic in, 1/8", Pink, Association:5
3575KERN: hda:  Supported power states: D0 D1 D2 D3
3576KERN: hda:  [Power] [Conn. list] [Unsol. responses] [Amplifier override] [Out amplifier] [In amplifier] [Stereo]
3577KERN: hda:  In Amp: step size: 10 dB, # steps: 3, offset to 0 dB: 0
3578KERN: hda:  Out Amp: supports mute, step size: 0.25 dB, # steps: 0, offset to 0 dB: 0
3579KERN: hda:  Inputs: 12 13 14 15 38
3580KERN: hda: 26: Pin complex
3581KERN: hda:  [Input] [Output]
3582KERN: hda:  Jack, Line in, 1/8", Blue, Association:4
3583KERN: hda:  Supported power states: D0 D1 D2 D3
3584KERN: hda:  [Power] [Conn. list] [Unsol. responses] [Amplifier override] [Out amplifier] [In amplifier] [Stereo]
3585KERN: hda:  In Amp: step size: 10 dB, # steps: 3, offset to 0 dB: 0
3586KERN: hda:  Out Amp: supports mute, step size: 0.25 dB, # steps: 0, offset to 0 dB: 0
3587KERN: hda:  Inputs: 12 13 14 15 38
3588KERN: hda: 27: Pin complex
3589KERN: hda:  [Input] [Output]
3590KERN: hda:  Jack, Front HP out, 1/8", Green, Association:2
3591KERN: hda:  Supported power states: D0 D1 D2 D3
3592KERN: hda:  [Power] [Conn. list] [Unsol. responses] [Amplifier override] [Out amplifier] [In amplifier] [Stereo]
3593KERN: hda:  In Amp: step size: 10 dB, # steps: 3, offset to 0 dB: 0
3594KERN: hda:  Out Amp: supports mute, step size: 0.25 dB, # steps: 0, offset to 0 dB: 0
3595KERN: hda:  Inputs: 12 13 14 15 38
3596KERN: hda: 28: Vendor defined
3597KERN: hda:  Supported power states: D0
3598KERN: hda: 29: Pin complex
3599KERN: hda:  [Input]
3600KERN: hda:  None, Reserved, Other analog, White, Association:2
3601KERN: hda:  Supported power states: D0 D1 D2 D3
3602KERN: hda:  [Power]
3603KERN: hda: 30: Pin complex
3604KERN: hda:  [Output]
3605KERN: hda:  Jack, SPDIF out, Optical, Orange, Association:3
3606KERN: hda:  Supported power states: D0 D1 D2 D3
3607KERN: hda:  [Power] [Digital] [Conn. list] [Unsol. responses] [Stereo]
3608KERN: hda:  Inputs: <6>
3609KERN: hda: 31: Vendor defined
3610KERN: hda:  Supported power states: D0
3611KERN: hda: 32: Vendor defined
3612KERN: hda:  Supported power states: D0
3613KERN: hda:  [Proc widget]
3614KERN: hda: 33: Vendor defined
3615KERN: hda:  Supported power states: D0
3616KERN: hda: 34: Audio mixer
3617KERN: hda:  Supported power states: D0
3618KERN: hda:  [Conn. list] [Amplifier override] [In amplifier] [Stereo]
3619KERN: hda:  In Amp: supports mute, step size: 0.25 dB, # steps: 0, offset to 0 dB: 0
3620KERN: hda:  Inputs: 24 25 26 27 29 21 22 23 18 11
3621KERN: hda: 35: Audio mixer
3622KERN: hda:  Supported power states: D0
3623KERN: hda:  [Conn. list] [Amplifier override] [In amplifier] [Stereo]
3624KERN: hda:  In Amp: supports mute, step size: 0.25 dB, # steps: 0, offset to 0 dB: 0
3625KERN: hda:  Inputs: 24 25 26 27 29 21 22 23 18 11
3626KERN: hda: 36: Vendor defined
3627KERN: hda:  Supported power states: D0
3628KERN: hda: 37: Audio output
3629KERN: hda:  Supported formats: 16bits 20bits 24bits 32bits
3630KERN: hda:  Supported rates: 44khz 48khz 88khz 96khz 176khz 192khz
3631KERN: hda:  Supported power states: D0 D1 D2 D3
3632KERN: hda:  [Power] [Format override] [Amplifier override] [Out amplifier] [Stereo]
3633KERN: hda:  Out Amp: step size: 0.75 dB, # steps: 87, offset to 0 dB: 87
3634KERN: hda: 38: Audio mixer
3635KERN: hda:  Supported power states: D0
3636KERN: hda:  [Conn. list] [Amplifier override] [In amplifier] [Stereo]
3637KERN: hda:  In Amp: supports mute, step size: 0.25 dB, # steps: 0, offset to 0 dB: 0
3638KERN: hda:  Inputs: 37 11
3639KERN: hda: build output tree: use mixer
3640KERN: hda:   look at pin widget 20 (1 inputs)
3641KERN: hda:     try widget 12: 0xffffffff829dd6b8
3642KERN: hda:     widget 12 is candidate
3643KERN: hda:         output: added output widget 2
3644KERN: hda:       output: added mixer/selector widget 12
3645KERN: hda:         output: not added mixer/selector widget 11
3646KERN: hda:     add pin widget 20
3647KERN: hda:   look at pin widget 21 (1 inputs)
3648KERN: hda:     try widget 13: 0xffffffff829dd764
3649KERN: hda:     widget 13 is candidate
3650KERN: hda:         output: added output widget 3
3651KERN: hda:       output: added mixer/selector widget 13
3652KERN: hda:         output: not added mixer/selector widget 11
3653KERN: hda:     add pin widget 21
3654KERN: hda:   look at pin widget 22 (1 inputs)
3655KERN: hda:     try widget 14: 0xffffffff829dd810
3656KERN: hda:     widget 14 is candidate
3657KERN: hda:         output: added output widget 4
3658KERN: hda:       output: added mixer/selector widget 14
3659KERN: hda:         output: not added mixer/selector widget 11
3660KERN: hda:     add pin widget 22
3661KERN: hda:   look at pin widget 27 (5 inputs)
3662KERN: hda:     try widget 12: 0xffffffff829dd6b8
3663KERN: hda:     widget 12 is candidate
3664KERN: hda:     add pin widget 27
3665KERN: hda: build input tree
3666KERN: hda:   look at input widget 8 (1 inputs)
3667KERN: hda:     try widget 35: 0xffffffff829de62c
3668KERN: hda:     widget 35 is candidate
3669KERN: hda:         input: added input widget 24
3670KERN: hda:       input: added mixer/selector widget 35
3671KERN: hda:         input: added input widget 25
3672KERN: hda:       input: added mixer/selector widget 35
3673KERN: hda:         input: added input widget 26
3674KERN: hda:       input: added mixer/selector widget 35
3675KERN: hda:         input: added input widget 23
3676KERN: hda:       input: added mixer/selector widget 35
3677KERN: hda:         input: not added mixer/selector widget 11
3678KERN: hda:     add pin widget 8
3679KERN: hda:   look at input widget 9 (1 inputs)
3680KERN: hda:     try widget 34: 0xffffffff829de580
3681KERN: hda:     widget 34 is candidate
3682KERN: hda:         input: not added mixer/selector widget 11
3683KERN: hda:       input: not added mixer/selector widget 34
3684KERN: hda: build tree!
3685KERN: hda:  Audiogroup:
3686KERN: hda: 2: Audio output
3687KERN: hda:  Supported power states: D0 D1 D2 D3
3688KERN: hda:  [Power] [Format override] [Amplifier override] [Out amplifier] [Stereo]
3689KERN: usb hub 7: KERN: hda:     Out Amp: step size: 0.75 dB, # steps: 87, offset to 0 dB: 87
3690KERN: port 1 is not suspended
3691KERN: hda: 3: Audio output
3692KERN: usb hub 7: KERN: hda:     Supported power states: D0 D1 D2 D3
3693KERN: port 1 is not in an over current state
3694KERN: hda:  [Power] [Format override] [Amplifier override] [Out amplifier] [Stereo]
3695KERN: usb hub 7: KERN: hda:     Out Amp: step size: 0.75 dB, # steps: 87, offset to 0 dB: 87
3696KERN: port 1 was reset
3697KERN: hda: 4: Audio output
3698KERN: hda:  Supported power states: D0 D1 D2 D3
3699KERN: hda:  [Power] [Format override] [Amplifier override] [Out amplifier] [Stereo]
3700KERN: hda:  Out Amp: step size: 0.75 dB, # steps: 87, offset to 0 dB: 87
3701KERN: hda: 5: Audio output
3702KERN: hda:  Supported power states: D0 D1 D2 D3
3703KERN: hda:  [Power] [Format override] [Amplifier override] [Out amplifier] [Stereo]
3704KERN: hda:  Out Amp: step size: 0.75 dB, # steps: 87, offset to 0 dB: 87
3705KERN: hda: 6: Audio output
3706KERN: hda:  Supported power states: D0 D1 D2 D3
3707KERN: hda:  [Power] [Digital] [Format override] [Stereo]
3708KERN: hda: 7: Vendor defined
3709KERN: hda:  Supported power states: D0
3710KERN: hda: 8: Audio input
3711KERN: hda:  Supported power states: D0 D1 D2 D3
3712KERN: hda:  [Power] [Conn. list] [Format override] [Amplifier override] [In amplifier] [Stereo]
3713KERN: hda:  In Amp: supports mute, step size: 0.75 dB, # steps: 63, offset to 0 dB: 23
3714KERN: hda:  Inputs: <35>
3715KERN: hda: 9: Audio input
3716KERN: hda:  Supported power states: D0 D1 D2 D3
3717KERN: hda:  [Power] [Conn. list] [Format override] [Amplifier override] [In amplifier] [Stereo]
3718KERN: hda:  In Amp: supports mute, step size: 0.75 dB, # steps: 63, offset to 0 dB: 23
3719KERN: hda:  Inputs: <34>
3720KERN: hda: 10: Vendor defined
3721KERN: hda:  Supported power states: D0
3722KERN: hda: 11: Audio mixer
3723KERN: hda:  Supported power states: D0
3724KERN: hda:  [Conn. list] [Amplifier override] [In amplifier] [Stereo]
3725KERN: hda:  In Amp: supports mute, step size: 1.5 dB, # steps: 31, offset to 0 dB: 23
3726KERN: hda:  Inputs: <24> 25 26 27 29 21 22 23
3727KERN: hda: 12: Audio mixer
3728KERN: hda:  Supported power states: D0
3729KERN: hda:  [Conn. list] [Amplifier override] [In amplifier] [Stereo]
3730KERN: hda:  In Amp: supports mute, step size: 0.25 dB, # steps: 0, offset to 0 dB: 0
3731KERN: hda:  Inputs: <2> 11
3732KERN: hda: 13: Audio mixer
3733KERN: hda:  Supported power states: D0
3734KERN: hda:  [Conn. list] [Amplifier override] [In amplifier] [Stereo]
3735KERN: hda:  In Amp: supports mute, step size: 0.25 dB, # steps: 0, offset to 0 dB: 0
3736KERN: hda:  Inputs: <3> 11
3737KERN: hda: 14: Audio mixer
3738KERN: hda:  Supported power states: D0
3739KERN: hda:  [Conn. list] [Amplifier override] [In amplifier] [Stereo]
3740KERN: hda:  In Amp: supports mute, step size: 0.25 dB, # steps: 0, offset to 0 dB: 0
3741KERN: hda:  Inputs: <4> 11
3742KERN: hda: 15: Audio mixer
3743KERN: hda:  Supported power states: D0
3744KERN: hda:  [Conn. list] [Amplifier override] [In amplifier] [Stereo]
3745KERN: hda:  In Amp: supports mute, step size: 0.25 dB, # steps: 0, offset to 0 dB: 0
3746KERN: hda:  Inputs: <5> 11
3747KERN: hda: 16: Vendor defined
3748KERN: hda:  Supported power states: D0
3749KERN: hda: 17: Vendor defined
3750KERN: hda:  Supported power states: D0
3751KERN: hda: 18: Pin complex
3752KERN: hda:  [Input]
3753KERN: hda:  Supported power states: D0 D1 D2 D3
3754KERN: hda:  [Power] [Amplifier override] [In amplifier] [Stereo]
3755KERN: hda:  In Amp: step size: 10 dB, # steps: 3, offset to 0 dB: 0
3756KERN: hda: 19: Vendor defined
3757KERN: hda:  Supported power states: D0
3758KERN: hda: 20: Pin complex
3759KERN: hda:  [Pres Detect][HP Drive][Output][EAPD]
3760KERN: hda:  Supported power states: D0 D1 D2 D3
3761KERN: hda:  [Power] [Conn. list] [Unsol. responses] [Amplifier override] [Out amplifier] [Stereo]
3762KERN: hda:  Out Amp: supports mute, step size: 0.25 dB, # steps: 0, offset to 0 dB: 0
3763KERN: hda:  Inputs: <12>
3764KERN: hda: 21: Pin complex
3765KERN: hda:  [Pres Detect][Output][Input]
3766KERN: hda:  Supported power states: D0 D1 D2 D3
3767KERN: hda:  [Power] [Conn. list] [Unsol. responses] [Amplifier override] [Out amplifier] [Stereo]
3768KERN: hda:  Out Amp: supports mute, step size: 0.25 dB, # steps: 0, offset to 0 dB: 0
3769KERN: hda:  Inputs: <13>
3770KERN: hda: 22: Pin complex
3771KERN: hda:  [Pres Detect][Output][Input]
3772KERN: hda:  Supported power states: D0 D1 D2 D3
3773KERN: hda:  [Power] [Conn. list] [Unsol. responses] [Amplifier override] [Out amplifier] [Stereo]
3774KERN: hda:  Out Amp: supports mute, step size: 0.25 dB, # steps: 0, offset to 0 dB: 0
3775KERN: hda:  Inputs: <14>
3776KERN: hda: 23: Pin complex
3777KERN: hda:  [Pres Detect][Output][Input]
3778KERN: hda:  Supported power states: D0 D1 D2 D3
3779KERN: hda:  [Power] [Conn. list] [Unsol. responses] [Amplifier override] [Out amplifier] [Stereo]
3780KERN: hda:  Out Amp: supports mute, step size: 0.25 dB, # steps: 0, offset to 0 dB: 0
3781KERN: hda:  Inputs: <15>
3782KERN: hda: 24: Pin complex
3783KERN: hda:  [Pres Detect][Output][Input][VRef HIZ][VRef 50][VRef Gr][VRef 80][VRef 100]
3784KERN: hda:  Supported power states: D0 D1 D2 D3
3785KERN: hda:  [Power] [Conn. list] [Unsol. responses] [Amplifier override] [Out amplifier] [In amplifier] [Stereo]
3786KERN: hda:  In Amp: step size: 10 dB, # steps: 3, offset to 0 dB: 0
3787KERN: hda:  Out Amp: supports mute, step size: 0.25 dB, # steps: 0, offset to 0 dB: 0
3788KERN: hda:  Inputs: <12> 13 14 15 38
3789KERN: hda: 25: Pin complex
3790KERN: hda:  [Pres Detect][HP Drive][Output][Input][VRef HIZ][VRef 50][VRef Gr][VRef 80][VRef 100]
3791KERN: hda:  Supported power states: D0 D1 D2 D3
3792KERN: hda:  [Power] [Conn. list] [Unsol. responses] [Amplifier override] [Out amplifier] [In amplifier] [Stereo]
3793KERN: hda:  In Amp: step size: 10 dB, # steps: 3, offset to 0 dB: 0
3794KERN: hda:  Out Amp: supports mute, step size: 0.25 dB, # steps: 0, offset to 0 dB: 0
3795KERN: [ipro1000] (em) Link is up 1000 Mbps Full Duplex
3796KERN: hda:  Inputs: <12> 13 14 15 38
3797KERN: /dev/net/ipro1000/0: media change, media 0x900030 quality 1000 speed 1000000000
3798KERN: hda: 26: Pin complex
3799KERN: hda:  [Pres Detect][Output][Input][VRef HIZ][VRef 50][VRef Gr][VRef 80][VRef 100]
3800KERN: hda:  Supported power states: D0 D1 D2 D3
3801KERN: register_domain(4, link)
3802KERN: hda:  [Power] [Conn. list] [Unsol. responses] [Amplifier override] [Out amplifier] [In amplifier] [Stereo]
3803KERN: hda:  In Amp: step size: 10 dB, # steps: 3, offset to 0 dB: 0
3804KERN: hda:  Out Amp: supports mute, step size: 0.25 dB, # steps: 0, offset to 0 dB: 0
3805KERN: hda:  Inputs: <12> 13 14 15 38
3806DAEMON 'DHCP': /dev/net/ipro1000/0: Send DHCP_DISCOVER to 255.255.255.255:67
3807KERN: hda: 27: Pin complex
3808KERN: hda:  [Pres Detect][HP Drive][Output][Input][VRef HIZ][VRef 50][VRef Gr][VRef 80][VRef 100][EAPD]
3809KERN: hda:  Supported power states: D0 D1 D2 D3
3810KERN: hda:  [Power] [Conn. list] [Unsol. responses] [Amplifier override] [Out amplifier] [In amplifier] [Stereo]
3811KERN: hda:  In Amp: step size: 10 dB, # steps: 3, offset to 0 dB: 0
3812KERN: hda:  Out Amp: supports mute, step size: 0.25 dB, # steps: 0, offset to 0 dB: 0
3813KERN: hda:  Inputs: <12> 13 14 15 38
3814KERN: hda: 28: Vendor defined
3815KERN: hda:  Supported power states: D0
3816KERN: hda: 29: Pin complex
3817KERN: hda:  [Input]
3818KERN: hda:  Supported power states: D0 D1 D2 D3
3819KERN: hda:  [Power]
3820KERN: hda: 30: Pin complex
3821KERN: hda:  [Output]
3822KERN: hda:  Supported power states: D0 D1 D2 D3
3823KERN: hda:  [Power] [Digital] [Conn. list] [Unsol. responses] [Stereo]
3824KERN: hda:  Inputs: <6>
3825KERN: hda: 31: Vendor defined
3826KERN: hda:  Supported power states: D0
3827KERN: hda: 32: Vendor defined
3828KERN: hda:  Supported power states: D0
3829KERN: hda:  [Proc widget]
3830KERN: hda: 33: Vendor defined
3831KERN: hda:  Supported power states: D0
3832KERN: hda: 34: Audio mixer
3833KERN: hda:  Supported power states: D0
3834KERN: hda:  [Conn. list] [Amplifier override] [In amplifier] [Stereo]
3835KERN: hda:  In Amp: supports mute, step size: 0.25 dB, # steps: 0, offset to 0 dB: 0
3836KERN: hda:  Inputs: <24> 25 26 27 29 21 22 23 18 11
3837KERN: hda: 35: Audio mixer
3838KERN: hda:  Supported power states: D0
3839KERN: hda:  [Conn. list] [Amplifier override] [In amplifier] [Stereo]
3840KERN: hda:  In Amp: supports mute, step size: 0.25 dB, # steps: 0, offset to 0 dB: 0
3841KERN: hda:  Inputs: <24> 25 26 27 29 21 22 23 18 11
3842KERN: hda: 36: Vendor defined
3843KERN: hda:  Supported power states: D0
3844KERN: hda: 37: Audio output
3845KERN: hda:  Supported power states: D0 D1 D2 D3
3846KERN: hda:  [Power] [Format override] [Amplifier override] [Out amplifier] [Stereo]
3847KERN: hda:  Out Amp: step size: 0.75 dB, # steps: 87, offset to 0 dB: 87
3848KERN: hda: 38: Audio mixer
3849KERN: hda:  Supported power states: D0
3850KERN: hda:  [Conn. list] [Amplifier override] [In amplifier] [Stereo]
3851KERN: hda:  In Amp: supports mute, step size: 0.25 dB, # steps: 0, offset to 0 dB: 0
3852KERN: hda:  Inputs: <37> 11
3853KERN: hda: Enabled unsolicited responses on widget 20
3854KERN: hda: Enabled unsolicited responses on widget 21
3855KERN: hda: Enabled unsolicited responses on widget 22
3856KERN: hda: Enabled unsolicited responses on widget 23
3857KERN: hda: Enabled unsolicited responses on widget 24
3858KERN: hda: Enabled unsolicited responses on widget 25
3859KERN: hda: Enabled unsolicited responses on widget 26
3860KERN: hda: Enabled unsolicited responses on widget 27
3861KERN: hda: UNMUTE/SET OUTPUT GAIN widget 2 (offset 87)
3862KERN: hda: UNMUTE/SET OUTPUT GAIN widget 3 (offset 87)
3863KERN: hda: UNMUTE/SET OUTPUT GAIN widget 4 (offset 87)
3864KERN: hda: UNMUTE/SET INPUT GAIN widget 12 (offset 0)
3865KERN: hda: UNMUTE/SET INPUT GAIN widget 13 (offset 0)
3866KERN: hda: UNMUTE/SET INPUT GAIN widget 14 (offset 0)
3867KERN: hda: ENABLE pin widget 20
3868KERN: hda: ENABLE EAPD pin widget 20
3869KERN: hda: UNMUTE/SET OUTPUT GAIN widget 20 (offset 0)
3870KERN: hda: ENABLE pin widget 21
3871KERN: hda: UNMUTE/SET OUTPUT GAIN widget 21 (offset 0)
3872KERN: hda: ENABLE pin widget 22
3873KERN: hda: UNMUTE/SET OUTPUT GAIN widget 22 (offset 0)
3874KERN: hda: ENABLE pin widget 27
3875KERN: hda: ENABLE EAPD pin widget 27
3876KERN: hda: UNMUTE/SET OUTPUT GAIN widget 27 (offset 0)
3877KERN: hda: UNMUTE/SET INPUT GAIN widget 27 (offset 0)
3878KERN: hda: UNMUTE/SET INPUT GAIN widget 8 (offset 23)
3879KERN: hda: ENABLE pin widget 23
3880KERN: hda: UNMUTE/SET OUTPUT GAIN widget 23 (offset 0)
3881KERN: hda: input vref 50 enabled
3882KERN: hda: input vref 80 enabled
3883KERN: hda: input vref 100 enabled
3884KERN: hda: ENABLE pin widget 24
3885KERN: hda: UNMUTE/SET OUTPUT GAIN widget 24 (offset 0)
3886KERN: hda: UNMUTE/SET INPUT GAIN widget 24 (offset 0)
3887KERN: hda: input vref 50 enabled
3888KERN: hda: input vref 80 enabled
3889KERN: hda: input vref 100 enabled
3890KERN: hda: ENABLE pin widget 25
3891KERN: hda: UNMUTE/SET OUTPUT GAIN widget 25 (offset 0)
3892KERN: hda: UNMUTE/SET INPUT GAIN widget 25 (offset 0)
3893KERN: hda: input vref 50 enabled
3894KERN: hda: input vref 80 enabled
3895KERN: hda: input vref 100 enabled
3896KERN: hda: ENABLE pin widget 26
3897KERN: hda: UNMUTE/SET OUTPUT GAIN widget 26 (offset 0)
3898KERN: hda: UNMUTE/SET INPUT GAIN widget 26 (offset 0)
3899KERN: hda: UNMUTE/SET INPUT GAIN widget 35 (offset 0)
3900KERN: hda: streams playback 0xffffffff80f8c790, record 0xffffffff80f8c8d0
3901KERN: hda: sensed pin widget 27, 0
3902KERN: hda: sample size 4, num channels 2, buffer length 10240
3903KERN: hda: hda_stream_setup_buffers: setup stream 1: SR=192000, SF=32 F=0x1841 (0x1000)
3904KERN: add_memory_type_range(7650, 0x21af2000, 0x28000, 0)
3905KERN: set MTRRs to:
3906KERN:   mtrr:  0: base: 0x21af2000, size:     0x2000, type: 0
3907KERN:   mtrr:  1: base: 0x21b18000, size:     0x2000, type: 0
3908KERN:   mtrr:  2: base: 0x21af4000, size:     0x4000, type: 0
3909KERN:   mtrr:  3: base: 0x21af8000, size:     0x8000, type: 0
3910KERN:   mtrr:  4: base: 0x21b10000, size:     0x8000, type: 0
3911KERN:   mtrr:  5: base: 0x21b00000, size:    0x10000, type: 0
3912KERN:   mtrr:  6: base: 0xf0000000, size: 0x10000000, type: 0
3913KERN:   mtrr:  7: base: 0xe0000000, size: 0x20000000, type: 1
3914KERN: update_mtrrs(): Succeeded setting MTRRs after ignoring uncacheable ranges up to size 0xa000.
3915KERN: hda: hda_stream_setup_buffers(Playback): Allocated 163840 bytes for 2 buffers
3916KERN: add_memory_type_range(7651, 0x21aed000, 0x1000, 0)
3917KERN: set MTRRs to:
3918KERN:   mtrr:  0: base: 0x21af2000, size:     0x2000, type: 0
3919KERN:   mtrr:  1: base: 0x21b18000, size:     0x2000, type: 0
3920KERN:   mtrr:  2: base: 0x21af4000, size:     0x4000, type: 0
3921KERN:   mtrr:  3: base: 0x21af8000, size:     0x8000, type: 0
3922KERN:   mtrr:  4: base: 0x21b10000, size:     0x8000, type: 0
3923KERN:   mtrr:  5: base: 0x21b00000, size:    0x10000, type: 0
3924KERN:   mtrr:  6: base: 0xf0000000, size: 0x10000000, type: 0
3925KERN:   mtrr:  7: base: 0xe0000000, size: 0x20000000, type: 1
3926KERN: update_mtrrs(): Succeeded setting MTRRs after ignoring uncacheable ranges up to size 0xa000.
3927KERN: hda: hda_stream_setup_buffers(Playback): Allocated 4096 bytes for 2 BDLEs
3928KERN: hda: stream: 1 fifo size: 1024 num_io_widgets: 3
3929KERN: hda: widgets: KERN: 2 KERN: 3 KERN: 4
3930KERN: hda: sample size 4, num channels 2, buffer length 10240
3931KERN: hda: hda_stream_setup_buffers: setup stream 2: SR=192000, SF=24 F=0x1831 (0x100)
3932KERN: add_memory_type_range(7652, 0x21b2c000, 0x28000, 0)
3933KERN: set MTRRs to:
3934KERN:   mtrr:  0: base: 0xf0000000, size: 0x10000000, type: 0
3935KERN:   mtrr:  1: base: 0xe0000000, size: 0x20000000, type: 1
3936KERN: update_mtrrs(): Succeeded setting MTRRs after ignoring uncacheable ranges up to size 0x28000.
3937KERN: hda: hda_stream_setup_buffers(Recording): Allocated 163840 bytes for 2 buffers
3938KERN: usb hub 7: KERN: add_memory_type_range(7653, 0x21b2a000, 0x1000, 0)
3939KERN: port 1 is not suspended
3940KERN: set MTRRs to:
3941KERN: usb hub 7: KERN:   mtrr:  0: base: 0xf0000000, size: 0x10000000, type: 0
3942KERN: port 1 is not in an over current state
3943KERN:   mtrr:  1: base: 0xe0000000, size: 0x20000000, type: 1
3944KERN: usb hub 7: KERN: update_mtrrs(): Succeeded setting MTRRs after ignoring uncacheable ranges up to size 0x28000.
3945KERN: port 1 was reset
3946KERN: hda: hda_stream_setup_buffers(Recording): Allocated 4096 bytes for 2 BDLEs
3947KERN: hda: stream: 2 fifo size: 256 num_io_widgets: 1
3948KERN: hda: widgets: KERN: 8
3949KERN: hda: couldn't find a string for widget 29 in hda_find_multi_custom_string()
3950KERN: Last message repeated 2 times.
3951KERN: hda_stream_start() offset 80
3952KERN: hda_stream_start() offset 0
3953KERN: usb hub 7: port 1 is not suspended
3954KERN: usb hub 7: KERN: port 1 is not in an over current state
3955KERN: usb hub 7: port 1 was reset
3956KERN: hda: DMA position for stream (id:1) seems to be broken. Switching to using LPIB.
3957KERN: hda: DMA position for stream (id:2) seems to be broken. Switching to using LPIB.
3958KERN: usb hub 7: port 1 is not suspended
3959KERN: usb hub 7: KERN: port 1 is not in an over current state
3960KERN: usb hub 7: port 1 was reset
3961KERN: usb hub 7: port 1 is not suspended
3962KERN: usb hub 7: KERN: port 1 is not in an over current state
3963KERN: usb hub 7: port 1 was reset
3964DAEMON 'DHCP': /dev/net/ipro1000/0: Timeout shift: 8 secs (try 1)
3965DAEMON 'DHCP': /dev/net/ipro1000/0: Send DHCP_DISCOVER to 255.255.255.255:67
3966KERN: usb hub 7: port 1 is not suspended
3967KERN: usb hub 7: KERN: port 1 is not in an over current state
3968KERN: usb hub 7: KERN: port 1 was reset
3969KERN: usb hub 7: port 1 is not suspended
3970KERN: usb hub 7: KERN: port 1 is not in an over current state
3971KERN: usb hub 7: port 1 was reset
3972KERN: usb hub 7: port 1 is not suspended
3973KERN: usb hub 7: KERN: port 1 is not in an over current state
3974KERN: usb hub 7: KERN: port 1 was reset
3975KERN: usb hub 7: port 1 is not suspended
3976KERN: usb hub 7: KERN: port 1 is not in an over current state
3977KERN: usb hub 7: KERN: port 1 was reset
3978KERN: usb hub 7: port 1 is not suspended
3979KERN: usb hub 7: KERN: port 1 is not in an over current state
3980KERN: usb hub 7: port 1 was reset
3981KERN: usb hub 7: port 1 is not suspended
3982KERN: usb hub 7: KERN: port 1 is not in an over current state
3983KERN: usb hub 7: port 1 was reset
3984KERN: usb hub 7: port 1 is not suspended
3985KERN: usb hub 7: KERN: port 1 is not in an over current state
3986KERN: usb hub 7: KERN: port 1 was reset
3987KERN: usb hub 7: port 1 is not suspended
3988KERN: usb hub 7: KERN: port 1 is not in an over current state
3989KERN: usb hub 7: port 1 was reset
3990DAEMON 'DHCP': /dev/net/ipro1000/0: Timeout shift: 16 secs (try 2)
3991DAEMON 'DHCP': /dev/net/ipro1000/0: Send DHCP_DISCOVER to 255.255.255.255:67
3992KERN: usb hub 7: port 1 is not suspended
3993KERN: usb hub 7: KERN: port 1 is not in an over current state
3994KERN: usb hub 7: port 1 was reset
3995KERN: usb hub 7: port 1 is not suspended
3996KERN: usb hub 7: KERN: port 1 is not in an over current state
3997KERN: usb hub 7: KERN: port 1 was reset
3998KERN: usb hub 7: port 1 is not suspended
3999KERN: usb hub 7: KERN: port 1 is not in an over current state
4000KERN: usb hub 7: port 1 was reset
4001KERN: usb hub 7: port 1 is not suspended
4002KERN: usb hub 7: KERN: port 1 is not in an over current state
4003KERN: usb hub 7: KERN: port 1 was reset
4004KERN: usb hub 7: port 1 is not suspended
4005KERN: usb hub 7: KERN: port 1 is not in an over current state
4006KERN: usb hub 7: KERN: port 1 was reset
4007KERN: usb hub 7: port 1 is not suspended
4008KERN: usb hub 7: KERN: port 1 is not in an over current state
4009KERN: usb hub 7: port 1 was reset
4010KERN: usb hub 7: port 1 is not suspended
4011KERN: usb hub 7: KERN: port 1 is not in an over current state
4012KERN: usb hub 7: port 1 was reset
4013KERN: usb hub 7: port 1 is not suspended
4014KERN: usb hub 7: KERN: port 1 is not in an over current state
4015KERN: usb hub 7: port 1 was reset
4016KERN: usb hub 7: port 1 is not suspended
4017KERN: usb hub 7: KERN: port 1 is not in an over current state
4018KERN: usb hub 7: KERN: port 1 was reset
4019KERN: usb hub 7: port 1 is not suspended
4020KERN: usb hub 7: KERN: port 1 is not in an over current state
4021KERN: usb hub 7: port 1 was reset
4022KERN: usb hub 7: port 1 is not suspended
4023KERN: usb hub 7: KERN: port 1 is not in an over current state
4024KERN: usb hub 7: KERN: port 1 was reset
4025KERN: usb hub 7: port 1 is not suspended
4026KERN: usb hub 7: KERN: port 1 is not in an over current state
4027KERN: usb hub 7: port 1 was reset
4028KERN: [ipro1000] (em) Watchdog timeout -- resetting
4029KERN: [ipro1000] (em) Queue(0) tdh = 0, hw tdt = 3
4030KERN: [ipro1000] (em) TX(0) desc avail = 1021,Next TX to Clean = 0
4031KERN: [ipro1000] (em) Link is Down
4032KERN: /dev/net/ipro1000/0: media change, media 0x20 quality 1000 speed 1000000000
4033KERN: usb hub 7: port 1 is not suspended
4034KERN: usb hub 7: KERN: port 1 is not in an over current state
4035KERN: usb hub 7: KERN: port 1 was reset
4036KERN: usb hub 7: port 1 is not suspended
4037KERN: usb hub 7: KERN: port 1 is not in an over current state
4038KERN: usb hub 7: port 1 was reset
4039KERN: usb hub 7: port 1 is not suspended
4040KERN: usb hub 7: KERN: port 1 is not in an over current state
4041KERN: usb hub 7: KERN: port 1 was reset
4042KERN: [ipro1000] (em) Link is up 1000 Mbps Full Duplex
4043KERN: /dev/net/ipro1000/0: media change, media 0x900030 quality 1000 speed 1000000000
4044KERN: usb hub 7: port 1 is not suspended
4045KERN: usb hub 7: KERN: port 1 is not in an over current state
4046KERN: usb hub 7: port 1 was reset
4047KERN: usb hub 7: port 1 is not suspended
4048KERN: usb hub 7: KERN: port 1 is not in an over current state
4049KERN: usb hub 7: port 1 was reset
4050DAEMON 'DHCP': /dev/net/ipro1000/0: Timeout shift: 32 secs (try 3)
4051DAEMON 'DHCP': /dev/net/ipro1000/0: Send DHCP_DISCOVER to 255.255.255.255:67
4052KERN: usb hub 7: port 1 is not suspended
4053KERN: usb hub 7: KERN: port 1 is not in an over current state
4054KERN: usb hub 7: KERN: port 1 was reset
4055KERN: usb hub 7: port 1 is not suspended
4056KERN: usb hub 7: KERN: port 1 is not in an over current state
4057KERN: usb hub 7: port 1 was reset
4058KERN: usb hub 7: port 1 is not suspended
4059KERN: usb hub 7: KERN: port 1 is not in an over current state
4060KERN: usb hub 7: port 1 was reset
4061KERN: usb hub 7: port 1 is not suspended
4062KERN: usb hub 7: KERN: port 1 is not in an over current state
4063KERN: usb hub 7: KERN: port 1 was reset
4064KERN: usb hub 2: port 11: new device connected
4065KERN: usb xhci -1: cancel queued transfers for pipe 0xffffffff801ffe30 (0)
4066KERN: usb hub 7: port 1 is not suspended
4067KERN: usb hub 7: KERN: port 1 is not in an over current state
4068KERN: usb hub 7: port 1 was reset
4069KERN: usb_hid: no handlers for hid device
4070KERN: usb_hid: keyboard device unhandled control 0x00002710
4071Last message repeated 1 time
4072KERN: usb hub 7: KERN: port 1 is not suspended
4073KERN: usb hub 7: KERN: port 1 is not in an over current state
4074KERN: usb hub 7: port 1 was reset
4075KERN: usb hub 7: port 1 is not suspended
4076KERN: usb hub 7: KERN: port 1 is not in an over current state
4077KERN: usb hub 7: KERN: port 1 was reset
4078KERN: usb hub 7: port 1 is not suspended
4079KERN: usb hub 7: KERN: port 1 is not in an over current state
4080KERN: usb hub 7: port 1 was reset
4081KERN: usb hub 7: port 1 is not suspended
4082KERN: usb hub 7: KERN: port 1 is not in an over current state
4083KERN: usb hub 7: port 1 was reset
4084KERN: usb hub 7: port 1 is not suspended
4085KERN: usb hub 7: KERN: port 1 is not in an over current state
4086KERN: usb hub 7: port 1 was reset
4087KERN: usb hub 7: port 1 is not suspended
4088KERN: usb hub 7: KERN: port 1 is not in an over current state
4089KERN: usb hub 7: port 1 was reset
4090KERN: [ipro1000] (em) Watchdog timeout -- resetting
4091KERN: [ipro1000] (em) Queue(0) tdh = 0, hw tdt = 1
4092KERN: [ipro1000] (em) TX(0) desc avail = 1023,Next TX to Clean = 0
4093KERN: [ipro1000] (em) Link is Down
4094KERN: /dev/net/ipro1000/0: media change, media 0x20 quality 1000 speed 1000000000
4095KERN: usb hub 7: port 1 is not suspended
4096KERN: usb hub 7: KERN: port 1 is not in an over current state
4097KERN: usb hub 7: KERN: port 1 was reset
4098KERN: usb hub 7: port 1 is not suspended
4099KERN: usb hub 7: KERN: port 1 is not in an over current state
4100KERN: usb hub 7: port 1 was reset
4101KERN: usb hub 7: port 1 is not suspended
4102KERN: usb hub 7: KERN: port 1 is not in an over current state
4103KERN: usb hub 7: port 1 was reset
4104KERN: usb hub 7: port 1 is not suspended
4105KERN: usb hub 7: KERN: port 1 is not in an over current state
4106KERN: usb hub 7: KERN: port 1 was reset
4107KERN: [ipro1000] (em) Link is up 1000 Mbps Full Duplex
4108KERN: /dev/net/ipro1000/0: media change, media 0x900030 quality 1000 speed 1000000000
4109KERN: usb hub 7: port 1 is not suspended
4110KERN: usb hub 7: KERN: port 1 is not in an over current state
4111KERN: usb hub 7: port 1 was reset
4112KERN: usb hub 7: port 1 is not suspended
4113KERN: usb hub 7: KERN: port 1 is not in an over current state
4114KERN: usb hub 7: port 1 was reset
4115KERN: usb hub 7: port 1 is not suspended
4116KERN: usb hub 7: KERN: port 1 is not in an over current state
4117KERN: usb hub 7: KERN: port 1 was reset
4118KERN: usb hub 7: port 1 is not suspended
4119KERN: usb hub 7: KERN: port 1 is not in an over current state
4120KERN: usb hub 7: port 1 was reset
4121KERN: usb hub 7: port 1 is not suspended
4122KERN: usb hub 7: KERN: port 1 is not in an over current state
4123KERN: usb hub 7: port 1 was reset
4124KERN: usb hub 7: port 1 is not suspended
4125KERN: usb hub 7: KERN: port 1 is not in an over current state
4126KERN: usb hub 7: port 1 was reset
4127KERN: usb hub 7: port 1 is not suspended
4128KERN: usb hub 7: KERN: port 1 is not in an over current state
4129KERN: usb hub 7: port 1 was reset
4130KERN: usb hub 7: port 1 is not suspended
4131KERN: usb hub 7: KERN: port 1 is not in an over current state
4132KERN: usb hub 7: port 1 was reset
4133KERN: usb hub 7: port 1 is not suspended
4134KERN: usb hub 7: KERN: port 1 is not in an over current state
4135KERN: usb hub 7: KERN: port 1 was reset
4136KERN: usb hub 7: port 1 is not suspended
4137KERN: usb hub 7: KERN: port 1 is not in an over current state
4138KERN: usb hub 7: port 1 was reset
4139KERN: usb hub 7: port 1 is not suspended
4140KERN: usb hub 7: KERN: port 1 is not in an over current state
4141KERN: usb hub 7: port 1 was reset
4142KERN: usb hub 7: port 1 is not suspended
4143KERN: usb hub 7: KERN: port 1 is not in an over current state
4144KERN: usb hub 7: KERN: port 1 was reset
4145KERN: usb hub 7: port 1 is not suspended
4146KERN: usb hub 7: KERN: port 1 is not in an over current state
4147KERN: usb hub 7: port 1 was reset
4148KERN: usb hub 7: port 1 is not suspended
4149KERN: usb hub 7: KERN: port 1 is not in an over current state
4150KERN: usb hub 7: port 1 was reset
4151KERN: usb hub 7: port 1 is not suspended
4152KERN: usb hub 7: KERN: port 1 is not in an over current state
4153KERN: usb hub 7: KERN: port 1 was reset
4154KERN: usb hub 7: port 1 is not suspended
4155KERN: usb hub 7: KERN: port 1 is not in an over current state
4156KERN: usb hub 7: port 1 was reset
4157DAEMON 'DHCP': /dev/net/ipro1000/0: Timeout shift: 64 secs (try 4)
4158DAEMON 'DHCP': /dev/net/ipro1000/0: Send DHCP_DISCOVER to 255.255.255.255:67
4159KERN: usb hub 7: port 1 is not suspended
4160KERN: usb hub 7: KERN: port 1 is not in an over current state
4161KERN: usb hub 7: port 1 was reset
4162KERN: usb hub 7: port 1 is not suspended
4163KERN: usb hub 7: KERN: port 1 is not in an over current state
4164KERN: usb hub 7: port 1 was reset
4165KERN: usb hub 7: port 1 is not suspended
4166KERN: usb hub 7: KERN: port 1 is not in an over current state
4167KERN: usb hub 7: port 1 was reset
4168KERN: usb hub 7: port 1 is not suspended
4169KERN: usb hub 7: KERN: port 1 is not in an over current state
4170KERN: usb hub 7: port 1 was reset
4171KERN: usb hub 7: port 1 is not suspended
4172KERN: usb hub 7: KERN: port 1 is not in an over current state
4173KERN: usb hub 7: KERN: port 1 was reset
4174KERN: usb hub 7: port 1 is not suspended
4175KERN: usb hub 7: KERN: port 1 is not in an over current state
4176KERN: usb hub 7: port 1 was reset
4177KERN: usb hub 7: port 1 is not suspended
4178KERN: usb hub 7: KERN: port 1 is not in an over current state
4179KERN: usb hub 7: port 1 was reset
4180KERN: usb hub 7: port 1 is not suspended
4181KERN: usb hub 7: KERN: port 1 is not in an over current state
4182KERN: usb hub 7: port 1 was reset
4183KERN: usb hub 7: port 1 is not suspended
4184KERN: usb hub 7: KERN: port 1 is not in an over current state
4185KERN: usb hub 7: port 1 was reset
4186KERN: usb hub 7: port 1 is not suspended
4187KERN: usb hub 7: KERN: port 1 is not in an over current state
4188KERN: usb hub 7: port 1 was reset
4189KERN: usb hub 7: port 1 is not suspended
4190KERN: usb hub 7: KERN: port 1 is not in an over current state
4191KERN: usb hub 7: KERN: port 1 was reset
4192KERN: [ipro1000] (em) Watchdog timeout -- resetting
4193KERN: [ipro1000] (em) Queue(0) tdh = 0, hw tdt = 1
4194KERN: [ipro1000] (em) TX(0) desc avail = 1023,Next TX to Clean = 0
4195KERN: [ipro1000] (em) Link is Down
4196KERN: /dev/net/ipro1000/0: media change, media 0x20 quality 1000 speed 1000000000
4197KERN: usb hub 7: port 1 is not suspended
4198KERN: usb hub 7: KERN: port 1 is not in an over current state
4199KERN: usb hub 7: port 1 was reset
4200KERN: usb hub 7: port 1 is not suspended
4201KERN: usb hub 7: KERN: port 1 is not in an over current state
4202KERN: usb hub 7: port 1 was reset
4203KERN: usb hub 7: port 1 is not suspended
4204KERN: usb hub 7: KERN: port 1 is not in an over current state
4205KERN: usb hub 7: port 1 was reset
4206KERN: usb hub 7: port 1 is not suspended
4207KERN: usb hub 7: KERN: port 1 is not in an over current state
4208KERN: usb hub 7: port 1 was reset
4209KERN: [ipro1000] (em) Link is up 1000 Mbps Full Duplex
4210KERN: /dev/net/ipro1000/0: media change, media 0x900030 quality 1000 speed 1000000000
4211KERN: usb hub 7: port 1 is not suspended
4212KERN: usb hub 7: KERN: port 1 is not in an over current state
4213KERN: usb hub 7: port 1 was reset
4214KERN: usb hub 7: port 1 is not suspended
4215KERN: usb hub 7: KERN: port 1 is not in an over current state
4216KERN: usb hub 7: KERN: port 1 was reset
4217KERN: usb hub 7: port 1 is not suspended
4218KERN: usb hub 7: KERN: port 1 is not in an over current state
4219KERN: usb hub 7: port 1 was reset
4220KERN: usb hub 7: port 1 is not suspended
4221KERN: usb hub 7: KERN: port 1 is not in an over current state
4222KERN: usb hub 7: port 1 was reset
4223KERN: usb hub 7: port 1 is not suspended
4224KERN: usb hub 7: KERN: port 1 is not in an over current state
4225KERN: usb hub 7: port 1 was reset
4226KERN: usb hub 7: port 1 is not suspended
4227KERN: usb hub 7: KERN: port 1 is not in an over current state
4228KERN: usb hub 7: port 1 was reset
4229KERN: usb hub 7: port 1 is not suspended
4230KERN: usb hub 7: KERN: port 1 is not in an over current state
4231KERN: usb hub 7: port 1 was reset
4232KERN: usb hub 7: port 1 is not suspended
4233KERN: usb hub 7: KERN: port 1 is not in an over current state
4234KERN: usb hub 7: KERN: port 1 was reset
4235KERN: usb hub 7: port 1 is not suspended
4236KERN: usb hub 7: KERN: port 1 is not in an over current state
4237KERN: usb hub 7: port 1 was reset
4238KERN: usb hub 7: port 1 is not suspended
4239KERN: usb hub 7: KERN: port 1 is not in an over current state
4240KERN: usb hub 7: port 1 was reset
4241KERN: usb hub 7: port 1 is not suspended
4242KERN: usb hub 7: KERN: port 1 is not in an over current state
4243KERN: usb hub 7: KERN: port 1 was reset
4244KERN: usb hub 7: port 1 is not suspended
4245KERN: usb hub 7: KERN: port 1 is not in an over current state
4246KERN: usb hub 7: port 1 was reset
4247KERN: usb hub 7: port 1 is not suspended
4248KERN: usb hub 7: KERN: port 1 is not in an over current state
4249KERN: usb hub 7: port 1 was reset
4250KERN: usb hub 7: port 1 is not suspended
4251KERN: usb hub 7: KERN: port 1 is not in an over current state
4252KERN: usb hub 7: KERN: port 1 was reset
4253KERN: usb hub 7: port 1 is not suspended
4254KERN: usb hub 7: KERN: port 1 is not in an over current state
4255KERN: usb hub 7: port 1 was reset
4256KERN: usb hub 7: port 1 is not suspended
4257KERN: usb hub 7: KERN: port 1 is not in an over current state
4258KERN: usb hub 7: port 1 was reset
4259KERN: usb hub 7: port 1 is not suspended
4260KERN: usb hub 7: KERN: port 1 is not in an over current state
4261KERN: usb hub 7: KERN: port 1 was reset
4262KERN: usb hub 7: port 1 is not suspended
4263KERN: usb hub 7: KERN: port 1 is not in an over current state
4264KERN: usb hub 7: port 1 was reset
4265KERN: usb hub 7: port 1 is not suspended
4266KERN: usb hub 7: KERN: port 1 is not in an over current state
4267KERN: usb hub 7: port 1 was reset
4268KERN: usb hub 7: port 1 is not suspended
4269KERN: usb hub 7: KERN: port 1 is not in an over current state
4270KERN: usb hub 7: KERN: port 1 was reset
4271KERN: usb hub 7: port 1 is not suspended
4272KERN: usb hub 7: KERN: port 1 is not in an over current state
4273KERN: usb hub 7: port 1 was reset
4274KERN: usb hub 7: port 1 is not suspended
4275KERN: usb hub 7: KERN: port 1 is not in an over current state
4276KERN: usb hub 7: port 1 was reset
4277KERN: usb hub 7: port 1 is not suspended
4278KERN: usb hub 7: KERN: port 1 is not in an over current state
4279KERN: usb hub 7: KERN: port 1 was reset
4280KERN: usb hub 7: port 1 is not suspended
4281KERN: usb hub 7: KERN: port 1 is not in an over current state
4282KERN: usb hub 7: port 1 was reset
4283KERN: usb hub 7: port 1 is not suspended
4284KERN: usb hub 7: KERN: port 1 is not in an over current state
4285KERN: usb hub 7: port 1 was reset
4286KERN: usb hub 7: port 1 is not suspended
4287KERN: usb hub 7: KERN: port 1 is not in an over current state
4288KERN: usb hub 7: KERN: port 1 was reset
4289KERN: usb hub 7: port 1 is not suspended
4290KERN: usb hub 7: KERN: port 1 is not in an over current state
4291KERN: usb hub 7: port 1 was reset
4292KERN: usb hub 7: port 1 is not suspended
4293KERN: usb hub 7: KERN: port 1 is not in an over current state
4294KERN: usb hub 7: port 1 was reset
4295KERN: usb hub 7: port 1 is not suspended
4296KERN: usb hub 7: KERN: port 1 is not in an over current state
4297KERN: usb hub 7: port 1 was reset
4298KERN: usb hub 7: port 1 is not suspended
4299KERN: usb hub 7: KERN: port 1 is not in an over current state
4300KERN: usb hub 7: KERN: port 1 was reset
4301KERN: usb hub 7: port 1 is not suspended
4302KERN: usb hub 7: KERN: port 1 is not in an over current state
4303KERN: usb hub 7: port 1 was reset
4304KERN: usb hub 7: port 1 is not suspended
4305KERN: usb hub 7: KERN: port 1 is not in an over current state
4306KERN: usb hub 7: KERN: port 1 was reset
4307KERN: usb hub 7: port 1 is not suspended
4308KERN: usb hub 7: KERN: port 1 is not in an over current state
4309KERN: usb hub 7: port 1 was reset
4310KERN: usb hub 7: port 1 is not suspended
4311KERN: usb hub 7: KERN: port 1 is not in an over current state
4312KERN: usb hub 7: port 1 was reset
4313KERN: usb hub 7: port 1 is not suspended
4314KERN: usb hub 7: KERN: port 1 is not in an over current state
4315KERN: usb hub 7: KERN: port 1 was reset
4316KERN: usb hub 7: port 1 is not suspended
4317KERN: usb hub 7: KERN: port 1 is not in an over current state
4318KERN: usb hub 7: port 1 was reset
4319KERN: usb hub 7: port 1 is not suspended
4320KERN: usb hub 7: KERN: port 1 is not in an over current state
4321KERN: usb hub 7: port 1 was reset
4322KERN: usb hub 7: port 1 is not suspended
4323KERN: usb hub 7: KERN: port 1 is not in an over current state
4324KERN: usb hub 7: KERN: port 1 was reset
4325KERN: usb hub 7: port 1 is not suspended
4326KERN: usb hub 7: port 1 is not in an over current state
4327KERN: usb hub 7: port 1 was reset
4328KERN: usb hub 7: port 1 is not suspended
4329KERN: usb hub 7: KERN: port 1 is not in an over current state
4330KERN: usb hub 7: port 1 was reset
4331KERN: usb hub 7: port 1 is not suspended
4332KERN: usb hub 7: port 1 is not in an over current state
4333KERN: usb hub 7: port 1 was reset
4334KERN: usb hub 7: port 1 is not suspended
4335KERN: usb hub 7: port 1 is not in an over current state
4336KERN: usb hub 7: port 1 was reset
4337KERN: usb hub 7: port 1 is not suspended
4338KERN: usb hub 7: port 1 is not in an over current state
4339KERN: usb hub 7: port 1 was reset
4340KERN: usb hub 7: port 1 is not suspended
4341KERN: usb hub 7: KERN: port 1 is not in an over current state
4342KERN: usb hub 7: KERN: port 1 was reset
4343KERN: usb hub 7: port 1 is not suspended
4344KERN: usb hub 7: KERN: port 1 is not in an over current state
4345KERN: usb hub 7: port 1 was reset
4346KERN: usb hub 7: port 1 is not suspended
4347KERN: usb hub 7: KERN: port 1 is not in an over current state
4348KERN: usb hub 7: KERN: port 1 was reset
4349KERN: usb hub 7: port 1 is not suspended
4350KERN: usb hub 7: KERN: port 1 is not in an over current state
4351KERN: usb hub 7: port 1 was reset
4352KERN: usb hub 7: port 1 is not suspended
4353KERN: usb hub 7: KERN: port 1 is not in an over current state
4354KERN: usb hub 7: port 1 was reset
4355KERN: usb hub 7: port 1 is not suspended
4356KERN: usb hub 7: KERN: port 1 is not in an over current state
4357KERN: usb hub 7: port 1 was reset
4358DAEMON 'DHCP': /dev/net/ipro1000/0: Timeout shift: 64 secs (try 5)
4359DAEMON 'DHCP': /dev/net/ipro1000/0: Send DHCP_DISCOVER to 255.255.255.255:67
4360KERN: usb hub 7: port 1 is not suspended
4361KERN: usb hub 7: KERN: port 1 is not in an over current state
4362KERN: usb hub 7: port 1 was reset
4363KERN: usb hub 7: port 1 is not suspended
4364KERN: usb hub 7: KERN: port 1 is not in an over current state
4365KERN: usb hub 7: port 1 was reset
4366KERN: usb hub 7: port 1 is not suspended
4367KERN: usb hub 7: KERN: port 1 is not in an over current state
4368KERN: usb hub 7: port 1 was reset
4369KERN: usb hub 7: port 1 is not suspended
4370KERN: usb hub 7: KERN: port 1 is not in an over current state
4371KERN: usb hub 7: KERN: port 1 was reset