Ticket #15396: syslog_UEFI_with_CSM.txt

File syslog_UEFI_with_CSM.txt, 163.0 KB (added by miqlas, 10 months ago)
Line 
1KERN: st 00000000, pci 00000000, size 00000000, flags 00
2KERN: PCI: base reg 4: host 00000000, pci 00000000, size 00000000, flags 00
3KERN: PCI: base reg 5: host 00000000, pci 00000000, size 00000000, flags 00
4KERN: PCI: Capabilities: vendspec
5KERN: PCI: [dom 0, bus 0] bus 0, device 31, function 2: vendor 8086, device 9c03, revision 04
6KERN: PCI: class_base 01, class_function 06, class_api 01
7KERN: PCI: vendor 8086: Intel Corporation
8KERN: PCI: device 9c03: 8 Series SATA Controller 1 [AHCI mode]
9KERN: PCI: info: Mass storage controller (SATA controller, AHCI 1.0)
10KERN: PCI: line_size 00, latency 00, header_type 00, BIST 00
11KERN: PCI: ROM base host 00000000, pci 00000000, size 00000000
12KERN: PCI: cardbus_CIS 00000000, subsystem_id 220c, subsystem_vendor_id 17aa
13KERN: PCI: interrupt_line ff, interrupt_pin 02, min_grant 00, max_latency 00
14KERN: PCI: base reg 0: host 000030a8, pci 000030a8, size 00000008, flags 01
15KERN: PCI: base reg 1: host 000030b4, pci 000030b4, size 00000004, flags 01
16KERN: PCI: base reg 2: host 00000000, pci 00000000, size 00000000, flags 00
17KERN: PCI: base reg 3: host 000030b0, pci 000030b0, size 00000004, flags 01
18KERN: PCI: base reg 4: host 00003060, pci 00003060, size 00000020, flags 01
19KERN: PCI: base reg 5: host f063c000, pci f063c000, size 00000800, flags 00
20KERN: PCI: Capabilities: MSI, PM, SATA
21KERN: PCI: [dom 0, bus 0] bus 0, device 31, function 3: vendor 8086, device 9c22, revision 04
22KERN: PCI: class_base 0c, class_function 05, class_api 00
23KERN: PCI: vendor 8086: Intel Corporation
24KERN: PCI: device 9c22: 8 Series SMBus Controller
25KERN: PCI: info: Serial bus controller (SMBus)
26KERN: PCI: line_size 00, latency 00, header_type 00, BIST 00
27KERN: PCI: ROM base host 00000000, pci 00000000, size 00000000
28KERN: PCI: cardbus_CIS 00000000, subsystem_id 220c, subsystem_vendor_id 17aa
29KERN: PCI: interrupt_line ff, interrupt_pin 03, min_grant 00, max_latency 00
30KERN: PCI: base reg 0: host f0638000, pci f0638000, size 00000100, flags 04
31KERN: PCI: base reg 1: host 00000000, pci 00000000, size 00000000, flags 00
32KERN: PCI: base reg 2: host 00000000, pci 00000000, size 00000000, flags 00
33KERN: PCI: base reg 3: host 00000000, pci 00000000, size 00000000, flags 00
34KERN: PCI: base reg 4: host 0000efa0, pci 0000efa0, size 00000020, flags 01
35KERN: PCI: base reg 5: host 00000000, pci 00000000, size 00000000, flags 00
36KERN: PCI: Capabilities: (not supported)
37KERN: ACPI: RSDP 0x00000000DCEFE014 000024 (v02 LENOVO)
38KERN: ACPI: XSDT 0x00000000DCEFE170 0000EC (v01 LENOVO TP-GJ 00002510 PTEC 00000002)
39KERN: ACPI: FACP 0x00000000DCEF8000 00010C (v05 LENOVO TP-GJ 00002510 PTEC 00000002)
40KERN: ACPI: DSDT 0x00000000DCEE2000 010FAD (v01 LENOVO TP-GJ 00002510 INTL 20120711)
41KERN: ACPI: FACS 0x00000000DCD7A000 000040
42KERN: ACPI: SLIC 0x00000000DCEFD000 000176 (v01 LENOVO TP-GJ 00002510 PTEC 00000001)
43KERN: ACPI: DBGP 0x00000000DCEFB000 000034 (v01 LENOVO TP-GJ 00002510 PTEC 00000002)
44KERN: ACPI: ECDT 0x00000000DCEFA000 000052 (v01 LENOVO TP-GJ 00002510 PTEC 00000002)
45KERN: ACPI: HPET 0x00000000DCEF7000 000038 (v01 LENOVO TP-GJ 00002510 PTEC 00000002)
46KERN: ACPI: APIC 0x00000000DCEF6000 000098 (v01 LENOVO TP-GJ 00002510 PTEC 00000002)
47KERN: ACPI: MCFG 0x00000000DCEF5000 00003C (v01 LENOVO TP-GJ 00002510 PTEC 00000002)
48KERN: ACPI: SSDT 0x00000000DCEF4000 000033 (v01 LENOVO TP-SSDT1 00000100 INTL 20120711)
49KERN: ACPI: SSDT 0x00000000DCEF3000 000486 (v01 LENOVO TP-SSDT2 00000200 INTL 20120711)
50KERN: ACPI: SSDT 0x00000000DCEE1000 0009CB (v01 LENOVO SataAhci 00001000 INTL 20120711)
51KERN: ACPI: SSDT 0x00000000DCEE0000 000152 (v01 LENOVO Rmv_Batt 00001000 INTL 20120711)
52KERN: ACPI: SSDT 0x00000000DCEDF000 0007F5 (v01 LENOVO Cpu0Ist 00003000 INTL 20120711)
53KERN: ACPI: SSDT 0x00000000DCEDE000 000AD8 (v01 LENOVO CpuPm 00003000 INTL 20120711)
54KERN: ACPI: SSDT 0x00000000DCEDC000 00125C (v01 LENOVO SaSsdt 00003000 INTL 20120711)
55KERN: ACPI: SSDT 0x00000000DCEDB000 000379 (v01 LENOVO CppcTabl 00001000 INTL 20120711)
56KERN: ACPI: PCCT 0x00000000DCEDA000 00006E (v05 LENOVO TP-GJ 00002510 PTEC 00000002)
57KERN: ACPI: SSDT 0x00000000DCED9000 000AC4 (v01 LENOVO Cpc_Tabl 00001000 INTL 20120711)
58KERN: ACPI: TCPA 0x00000000DCED8000 000032 (v02 PTL LENOVO 06040000 LNVO 00000001)
59KERN: ACPI: UEFI 0x00000000DCED7000 000042 (v01 LENOVO TP-GJ 00002510 PTEC 00000002)
60KERN: ACPI: MSDM 0x00000000DCCE2000 000055 (v03 LENOVO TP-GJ 00002510 PTEC 00000002)
61KERN: ACPI: ASF! 0x00000000DCEFC000 0000A5 (v32 LENOVO TP-GJ 00002510 PTEC 00000002)
62KERN: ACPI: BATB 0x00000000DCED6000 000046 (v01 LENOVO TP-GJ 00002510 PTEC 00000002)
63KERN: ACPI: FPDT 0x00000000DCED5000 000064 (v01 LENOVO TP-GJ 00002510 PTEC 00000002)
64KERN: ACPI: UEFI 0x00000000DCED4000 0002F6 (v01 LENOVO TP-GJ 00002510 PTEC 00000002)
65KERN: ACPI: DMAR 0x00000000DCED3000 0000B0 (v01 LENOVO TP-GJ 00002510 PTEC 00000002)
66KERN: ACPI: Forced DSDT copy: length 0x10FAD copied locally, original unmapped
67KERN: ACPI: 10 ACPI AML tables successfully acquired and loaded
68KERN: ACPI Error: No handler for Region [ECOR] (0xffffffff82b13240) [EmbeddedControl] (20181213/evregion-291)
69KERN: ACPI Error: Region EmbeddedControl (ID=3) has no handler (20181213/exfldio-431)
70KERN: ACPI Error: Method parse/execution failed \_SB.PCI0.LPC.EC.AC._PSR, AE_NOT_EXIST (20181213/psparse-689)
71KERN: ACPI Error: Method parse/execution failed \_SB._INI, AE_NOT_EXIST (20181213/psparse-689)
72KERN: ACPI Error: No handler for Region [ECOR] (0xffffffff82b13240) [EmbeddedControl] (20181213/evregion-291)
73KERN: ACPI Error: Region EmbeddedControl (ID=3) has no handler (20181213/exfldio-431)
74KERN: ACPI Error: Method parse/execution failed \_SB.LID._LID, AE_NOT_EXIST (20181213/psparse-689)
75KERN: ACPI Error: Method parse/execution failed \_SB.PCI0.VID._INI, AE_NOT_EXIST (20181213/psparse-689)
76KERN: ACPI Error: No handler for Region [ECOR] (0xffffffff82b13240) [EmbeddedControl] (20181213/evregion-291)
77KERN: ACPI Error: Region EmbeddedControl (ID=3) has no handler (20181213/exfldio-431)
78KERN: ACPI Error: Method parse/execution failed \_SB.PCI0.LPC.EC._INI, AE_NOT_EXIST (20181213/psparse-689)
79KERN: ACPI: Enabled 6 GPEs in block 00 to 7F
80KERN: found io-apic with address 0xfec00000, global interrupt base 0, apic-id 2
81KERN: mapping io-apic 0 at physical address 0xfec00000
82KERN: io-apic 0 has range 0-39, 40 entries, version 0x00270020, apic-id 2
83KERN: setting ACPI interrupt model to APIC
84KERN: IRQ routing table with 13 entries
85KERN: address 0x2ffff; pin 0; GSI 16; pci 0:2 pin 1 func mask 1; bios irq: 11; gsi 16; config 0x06
86KERN: address 0x3ffff; pin 0; GSI 16; pci 0:3 pin 1 func mask 1; bios irq: 255; gsi 16; config 0x06
87KERN: address 0x14ffff; pin 0; GSI 16; pci 0:20 pin 1 func mask 1; bios irq: 255; gsi 16; config 0x06
88KERN: address 0x16ffff; pin 0; GSI 16; pci 0:22 pin 1 func mask 1; bios irq: 255; gsi 16; config 0x06
89KERN: address 0x19ffff; pin 0; GSI 20; pci 0:25 pin 1 func mask 1; bios irq: 255; gsi 20; config 0x06
90KERN: address 0x1bffff; pin 0; GSI 22; pci 0:27 pin 1 func mask 1; bios irq: 255; gsi 22; config 0x06
91KERN: address 0x1cffff; pin 1; GSI 17; pci 0:28 pin 2 func mask 1; bios irq: 255; gsi 17; config 0x06
92KERN: address 0x1cffff; pin 2; GSI 18; pci 0:28 pin 3 func mask 2; bios irq: 255; gsi 18; config 0x06
93KERN: address 0x1dffff; pin 0; GSI 23; pci 0:29 pin 1 func mask 1; bios irq: 255; gsi 23; config 0x06
94KERN: address 0x1fffff; pin 1; GSI 19; pci 0:31 pin 2 func mask 4; bios irq: 255; gsi 19; config 0x06
95KERN: address 0x1fffff; pin 2; GSI 18; pci 0:31 pin 3 func mask 8; bios irq: 255; gsi 18; config 0x06
96KERN: address 0xffff; pin 0; GSI 16; pci 2:0 pin 1 func mask 1; bios irq: 255; gsi 16; config 0x06
97KERN: address 0xffff; pin 0; GSI 17; pci 3:0 pin 1 func mask 1; bios irq: 255; gsi 17; config 0x06
98KERN: found interrupt override for bus 0, source irq 0, global irq 2, flags 0x00000000
99KERN: found interrupt override for bus 0, source irq 9, global irq 9, flags 0x0000000d
100KERN: free_io_interrupt_vectors: freeing 16 vectors starting from 0
101KERN: reserve_io_interrupt_vectors: reserved 40 vectors starting from 0
102KERN: using io-apics for interrupt routing
103KERN: setting up apic for CPU 1: apic id 1, version 17170453
104KERN: setting up apic for CPU 3: apic id 3, version 17170453
105KERN: setting up apic for CPU 2: apic id 2, version 17170453
106KERN: CPU 3: logical apic id: 0x8
107KERN: CPU 2: logical apic id: 0x4
108KERN: x86_init_fpu: CPU has SSE... enabling FXSR and XMM.
109Last message repeated 1 time
110KERN: CPU 1: logical apic id: 0x2
111KERN: x86_init_fpu: CPU has SSE... enabling FXSR and XMM.
112KERN: allocate_commpage_entry(3, 76) -> 0x0000000000000210
113KERN: slab memory manager: created area 0xffffffff80801000 (590)
114KERN: publish device: nodKERN: e 0xffffffff82971500, path acpi/namespace, module bus_managers/acpi/namespace/device_v1
115KERN: registering power button
116KERN: publish device: node 0xffffffff82c5b6f0, path power/embedded_controller/0, module drivers/power/acpi_embedded_controller/device_v1
117KERN: Highpoint-IDE: supports_device()
118KERN: Highpoint-IDE: supports_device(): unsupported device: vendor ID: 8086, deviceID: 9c22
119KERN: usb xhci -1: interface version: 0x0100
120KERN: usb xhci -1: structural parameters: 1:0x0d000820 2:0x84000054 3:0x0200000a
121KERN: usb xhci -1: capability params: 0x200077c1
122KERN: allocate_io_interrupt_vectors: allocated 1 vectors starting from 40
123KERN: msi_allocate_vectors: allocated 1 vectors starting from 40
124KERN: msi enabled: 0x0087
125KERN: usb xhci -1: using message signaled interrupts
126KERN: usb xhci -1: starting XHCI host controller
127KERN: usb xhci -1: successfully started the controller
128KERN: usb uhci: no devices found
129KERN: usb ohci: no devices found
130KERN: sitd entry size 128, itd entry size 128
131KERN: usb ehci -1: successfully started the controller
132KERN: usb hub 2: port 2: new device connected
133KERN: usb hub 2: port 3: new device connected
134KERN: usb xhci 0: transfer error on slot 2 endpoint 1: USB transaction
135KERN: usb error xhci 0: error while getting the device descriptor: Device check-sum error
136KERN: usb hub 2: port 6: new device connected
137KERN: usb hub 2: port 7: new device connected
138KERN: usb hub 2: port 9 was warm reset
139KERN: usb hub 2: port 10 was warm reset
140KERN: usb hub 2: port 11 was warm reset
141KERN: usb hub 2: port 12 was warm reset
142KERN: usb hub 7: port 0: new device connected
143KERN: usb hub 110: port 4: new device connected
144KERN: get_boot_partitions(): boot volume message:
145KERN: KMessage: buffer: 0xffffffff82716338 (size/capacity: 299/299), flags: 0xa
146KERN: field: "partition offset" (LLNG): 209735680 (0xc805000)
147KERN: field: "packaged" (BOOL): true
148KERN: field: "boot method" (LONG): 0 (0x0)
149KERN: field: "booted from image" (BOOL): false
150KERN: field: "disk identifier" (RAWT): data at 0xffffffff82716414, 79 bytes
151KERN: get_boot_partitions(): boot method type: 0
152KERN: partitioning system: partitioning_systems/intel/extended/v1
153KERN: KDiskDeviceManager::_AddDiskSystem(partitioning_systems/intel/extended/v1)
154KERN: intel: ep_std_ops(0x1)
155KERN: intel: ep_std_ops(0x2)
156KERN: KDiskDeviceManager::_AddDiskSystem() done: No error
157KERN: partitioning system: partitioning_systems/session/v1
158KERN: KDiskDeviceManager::_AddDiskSystem(partitioning_systems/session/v1)
159KERN: KDiskDeviceManager::_AddDiskSystem() done: No error
160KERN: partitioning system: partitioning_systems/intel/map/v1
161KERN: KDiskDeviceManager::_AddDiskSystem(partitioning_systems/intel/map/v1)
162KERN: intel: pm_std_ops(0x1)
163KERN: intel: pm_std_ops(0x2)
164KERN: KDiskDeviceManager::_AddDiskSystem() done: No error
165KERN: partitioning system: partitioning_systems/efi_gpt/v1
166KERN: KDiskDeviceManager::_AddDiskSystem(partitioning_systems/efi_gpt/v1)
167KERN: KDiskDeviceManager::_AddDiskSystem() done: No error
168KERN: file system: file_systems/btrfs/v1
169KERN: KDiskDeviceManager::_AddDiskSystem(file_systems/btrfs/v1)
170KERN: KDiskDeviceManager::_AddDiskSystem() done: No error
171KERN: file system: file_systems/exfat/v1
172KERN: KDiskDeviceManager::_AddDiskSystem(file_systems/exfat/v1)
173KERN: KDiskDeviceManager::_AddDiskSystem() done: No error
174KERN: file system: file_systems/attribute_overlay/v1
175KERN: KDiskDeviceManager::_AddDiskSystem(file_systems/attribute_overlay/v1)
176KERN: KDiskDeviceManager::_AddDiskSystem() done: No error
177KERN: file system: file_systems/devfs/v1
178KERN: KDiskDeviceManager::_AddDiskSystem(file_systems/devfs/v1)
179KERN: KDiskDeviceManager::_AddDiskSystem() done: No error
180KERN: file system: file_systems/packagefs/v1
181KERN: KDiskDeviceManager::_AddDiskSystem(file_systems/packagefs/v1)
182KERN: KDiskDeviceManager::_AddDiskSystem() done: No error
183KERN: file system: file_systems/bindfs/v1
184KERN: KDiskDeviceManager::_AddDiskSystem(file_systems/bindfs/v1)
185KERN: KDiskDeviceManager::_AddDiskSystem() done: No error
186KERN: file system: file_systems/rootfs/v1
187KERN: KDiskDeviceManager::_AddDiskSystem(file_systems/rootfs/v1)
188KERN: KDiskDeviceManager::_AddDiskSystem() done: No error
189KERN: file system: file_systems/ext2/v1
190KERN: KDiskDeviceManager::_AddDiskSystem(file_systems/ext2/v1)
191KERN: KDiskDeviceManager::_AddDiskSystem() done: No error
192KERN: file system: file_systems/cdda/v1
193KERN: KDiskDeviceManager::_AddDiskSystem(file_systems/cdda/v1)
194KERN: KDiskDeviceManager::_AddDiskSystem() done: No error
195KERN: file system: file_systems/log_overlay/v1
196KERN: KDiskDeviceManager::_AddDiskSystem(file_systems/log_overlay/v1)
197KERN: KDiskDeviceManager::_AddDiskSystem() done: No error
198KERN: file system: file_systems/nfs4/v1
199KERN: KDiskDeviceManager::_AddDiskSystem(file_systems/nfs4/v1)
200KERN: KDiskDeviceManager::_AddDiskSystem() done: No error
201KERN: file system: file_systems/ntfs/v1
202KERN: KDiskDeviceManager::_AddDiskSystem(file_systems/ntfs/v1)
203KERN: KDiskDeviceManager::_AddDiskSystem() done: No error
204KERN: file system: file_systems/iso9660/v1
205KERN: KDiskDeviceManager::_AddDiskSystem(file_systems/iso9660/v1)
206KERN: KDiskDeviceManager::_AddDiskSystem() done: No error
207KERN: file system: file_systems/write_overlay/v1
208KERN: KDiskDeviceManager::_AddDiskSystem(file_systems/write_overlay/v1)
209KERN: KDiskDeviceManager::_AddDiskSystem() done: No error
210KERN: file system: file_systems/reiserfs/v1
211KERN: KDiskDeviceManager::_AddDiskSystem(file_systems/reiserfs/v1)
212KERN: KDiskDeviceManager::_AddDiskSystem() done: No error
213KERN: file system: file_systems/bfs/v1
214KERN: KDiskDeviceManager::_AddDiskSystem(file_systems/bfs/v1)
215KERN: KDiskDeviceManager::_AddDiskSystem() done: No error
216KERN: file system: file_systems/fat/v1
217KERN: KDiskDeviceManager::_AddDiskSystem(file_systems/fat/v1)
218KERN: dos_std_ops()
219Last message repeated 1 time
220KERN: KDiskDeviceManager::_AddDiskSystem() done: No error
221KERN: file system: file_systems/nfs/v1
222KERN: KDiskDeviceManager::_AddDiskSystem(file_systems/nfs/v1)
223KERN: KDiskDeviceManager::_AddDiskSystem() done: No error
224KERN: file system: file_systems/udf/v1
225KERN: KDiskDeviceManager::_AddDiskSystem(file_systems/udf/v1)
226KERN: KDiskDeviceManager::_AddDiskSystem() done: No error
227KERN: number of disk systems: 23
228KERN: KDiskDeviceManager::_Scan(/dev/disk)
229KERN: Highpoint-IDE: supports_device()
230KERN: Highpoint-IDE: supports_device(): unsupported device: vendor ID: 8086, deviceID: 9c03
231KERN: ahci: generic AHCI controller found! vendor 0x8086, device 0x9c03
232KERN: ahci: ahci_register_device
233KERN: ahci: ahci_init_driver
234KERN: ahci: ahci_sim_init_bus
235KERN: ahci: ahci_sim_init_bus: pciDevice 0xffffffff82d3b550
236KERN: ahci: AHCIController::Init 0:31:2 vendor 8086, device 9c03
237KERN: ahci: PCI SATA capability found at offset 0xa8
238KERN: ahci: satacr0 = 0x00100012, satacr1 = 0x00000048
239KERN: ahci: pcicmd old 0x0007
240KERN: ahci: pcicmd new 0x0006
241KERN: allocate_io_interrupt_vectors: allocated 1 vectors starting from 41
242KERN: msi_allocate_vectors: allocated 1 vectors starting from 41
243KERN: msi enabled: 0x0001
244KERN: ahci: using MSI vector 41
245KERN: ahci: registers at 0xf063c000, size 0x800
246KERN: ahci: mapping physical address 0xf063c000 with 2048 bytes for AHCI HBA regs
247KERN: ahci: physical = 0xf063c000, virtual = 0xffffffff827fa000, offset = 0, phyadr = 0xf063c000, mapadr = 0xffffffff827fa000, size = 4096, area = 0x00000458
248KERN: ahci: cap: Interface Speed Support: generation 3
249KERN: ahci: cap: Number of Command Slots: 32 (raw 0x1f)
250KERN: ahci: cap: Number of Ports: 3 (raw 0x2)
251KERN: ahci: cap: Supports Port Multiplier: no
252KERN: ahci: cap: Supports External SATA: no
253KERN: ahci: cap: Enclosure Management Supported: no
254KERN: ahci: cap: FIS-based Switching Control: no
255KERN: ahci: cap: Supports Command List Override: yes
256KERN: ahci: cap: Supports Staggered Spin-up: no
257KERN: ahci: cap: Supports Mechanical Presence Switch: no
258KERN: ahci: cap: Supports 64-bit Addressing: yes
259KERN: ahci: cap: Supports Native Command Queuing: yes
260KERN: ahci: cap: Supports SNotification Register: no
261KERN: ahci: cap: Supports Command List Override: yes
262KERN: ahci: cap: Supports AHCI mode only: yes
263KERN: ahci: cap2: DevSleep Entrance from Slumber Only: yes
264KERN: ahci: cap2: Supports Aggressive Device Sleep Management: yes
265KERN: ahci: cap2: Supports Device Sleep: yes
266KERN: ahci: cap2: Automatic Partial to Slumber Transitions: yes
267KERN: ahci: cap2: NVMHCI Present: no
268KERN: ahci: cap2: BIOS/OS Handoff: no
269KERN: ahci: ghc: AHCI Enable: yes
270KERN: ahci: Ports Implemented Mask: 0x000001 Number of Available Ports: 1
271KERN: ahci: AHCI Version 0001.03.00 Interrupt 41
272KERN: ahci: allocating 4096 bytes for AHCI port 0
273KERN: ahci: area = 1113, size = 4096, virt = 0xffffffff827fb000, phy = 0x1206000
274KERN: ahci: Probe: port 0 link speed 6.0Gb/s
275KERN: ahci: cookie = 0xffffffff82a5a780
276KERN: ahci: ahci_path_inquiry, cookie 0xffffffff82a5a780
277Last message repeated 1 time
278KERN: ahci: ahci_scan_bus, cookie 0xffffffff82a5a780
279KERN: ahci: sg_memcpy phyAddr 0x48b0f0, size 96
280KERN: ahci: ahci_get_restrictions, cookie 0xffffffff82a5a780
281KERN: publish device: node 0xffffffff82d411e0, path disk/scsi/0KERN: /0/0/raw, module drivers/disk/scsi/scsi_disk/device_v1
282KERN: Highpoint-IDE: supports_device()
283Last message repeated 1 time
284KERN: KDiskDeviceManager::_Scan(/dev/disk/scsi)
285KERN: KDiskDeviceManager::_Scan(/dev/disk/scsi/0)
286KERN: KDiskDeviceManager::_Scan(/dev/disk/scsi/0/0)
287KERN: KDiskDeviceManager::_Scan(/dev/disk/scsi/0/0/0)
288KERN: KDiskDeviceManager::_Scan(/dev/disk/scsi/0/0/0/raw)
289KERN: found device: /dev/disk/scsi/0/0/0/raw
290KERN: ahci: sg_memcpy phyAddr 0x48b24c, size 8
291KERN: DMAResource@0xffffffff82d41140: low/high 0/100000000, max segment count 32, align 2, boundary 65536, max transfer 130560, max segment size 33554432
292KERN: ahci: sg_memcpy phyAddr 0x48b29c, size 8
293KERN: ahci: ahci_ioctl, cookie 0xffffffff82a5a780
294KERN: KDiskDeviceManager::_ScanPartition(/dev/disk/scsi/0/0/0/raw)
295KERN: intel: ep_std_ops(0x1)
296KERN: trying: partitioning_systems/intel/extended/v1
297KERN: returned: -1
298KERN: intel: ep_std_ops(0x2)
299KERN: trying: partitioning_systems/session/v1
300KERN: returned: -1
301KERN: intel: pm_std_ops(0x1)
302KERN: trying: partitioning_systems/intel/map/v1
303KERN: intel: pm_identify_partition(0, 0: 0, 250059350016, 512)
304KERN: intel: Found GPT signature, ignoring.
305KERN: returned: -1
306KERN: intel: pm_std_ops(0x2)
307KERN: trying: partitioning_systems/efi_gpt/v1
308KERN: EFI header: EFI PART
309KERN: EFI revision: 10000
310KERN: header size: 92
311KERN: header CRC: 9128b1de
312KERN: absolute block: 1
313KERN: alternate block: 488397167
314KERN: first usable block: 34
315KERN: last usable block: 488397134
316KERN: disk GUID: df53e92f-28bf-f849-a259-5b93acedc09b
317KERN: entries block: 2
318KERN: entry size: 128
319KERN: entry count: 128
320KERN: entries CRC: 7ff87d05
321KERN: EFI header: EFI PART
322KERN: EFI revision: 10000
323KERN: header size: 92
324KERN: header CRC: 4e05439e
325KERN: absolute block: 488397167
326KERN: alternate block: 1
327KERN: first usable block: 34
328KERN: last usable block: 488397134
329KERN: disk GUID: df53e92f-28bf-f849-a259-5b93acedc09b
330KERN: entries block: 488397135
331KERN: entry size: 128
332KERN: entry count: 128
333KERN: entries CRC: 7ff87d05
334KERN: [ 0] partition type: c12a7328-f81f-11d2-ba4b-00a0c93ec93b
335KERN: unique id: f8979391-0dd0-9240-adaa-5f39d04bcfa5
336KERN: start block: 40
337KERN: end block: 409639
338KERN: size: 199.999 MB
339KERN: attributes: 0
340KERN: name: EFI
341KERN: [ 1] partition type: 42465331-3ba3-10f1-802a-4861696b7521
342KERN: unique id: a6360925-f020-bb40-8f2c-d28b8fe73d0d
343KERN: start block: 409640
344KERN: end block: 41369639
345KERN: size: 19999.999 MB
346KERN: attributes: 0
347KERN: name: Haiku
348KERN: [ 2] partition type: 42465331-3ba3-10f1-802a-4861696b7521
349KERN: unique id: c4622372-5c55-c443-89cc-43cae48b9300
350KERN: start block: 41369640
351KERN: end block: 143769639
352KERN: size: 49999.999 MB
353KERN: attributes: 0
354KERN: name: Ports
355KERN: [ 3] partition type: 42465331-3ba3-10f1-802a-4861696b7521
356KERN: unique id: e5fc5ce7-6d2f-cf46-b7c4-d2ae1b17a2d9
357KERN: start block: 143769640
358KERN: end block: 184729639
359KERN: size: 19999.999 MB
360KERN: attributes: 0
361KERN: name: Singularity
362KERN: [ 4] partition type: 42465331-3ba3-10f1-802a-4861696b7521
363KERN: unique id: 52ea44a1-4398-814f-b3de-88ed23b8e571
364KERN: start block: 184729640
365KERN: end block: 461209639
366KERN: size: 134999.999 MB
367KERN: attributes: 0
368KERN: name: Data
369KERN: returned: 0.959
370KERN: trying: file_systems/btrfs/v1
371KERN: [34mbtrfs:[0m invalid superblock!
372KERN: returned: -1
373KERN: trying: file_systems/exfat/v1
374KERN: [34mexfat:[0m invalid superblock!
375KERN: returned: -1
376KERN: trying: file_systems/attribute_overlay/v1
377KERN: returned: -1
378KERN: trying: file_systems/devfs/v1
379KERN: returned: -1
380KERN: trying: file_systems/packagefs/v1
381KERN: returned: -1
382KERN: trying: file_systems/bindfs/v1
383KERN: returned: -1
384KERN: trying: file_systems/rootfs/v1
385KERN: returned: -1
386KERN: trying: file_systems/ext2/v1
387KERN: [34mext2:[0m invalid superblock!
388KERN: returned: -1
389KERN: trying: file_systems/cdda/v1
390KERN: raw_command:
391KERN: ahci: AHCIPort::ScsiExecuteRequest port 0 unsupported request opcode 0x43
392KERN: returned: -1
393KERN: trying: file_systems/log_overlay/v1
394KERN: returned: -1
395KERN: trying: file_systems/nfs4/v1
396KERN: returned: -1
397KERN: trying: file_systems/ntfs/v1
398KERN: fs_identify_partition: boot signature NTFS doesn't match
399KERN: returned: -1
400KERN: trying: file_systems/iso9660/v1
401KERN: identify(0, 0xffffffff82d36140)
402KERN: returned: -1
403KERN: trying: file_systems/write_overlay/v1
404KERN: returned: -1
405KERN: trying: file_systems/reiserfs/v1
406KERN: returned: -1
407KERN: trying: file_systems/bfs/v1
408KERN: returned: -1
409KERN: dos_std_ops()
410KERN: trying: file_systems/fat/v1
411KERN: returned: -1
412KERN: dos_std_ops()
413KERN: trying: file_systems/nfs/v1
414KERN: returned: -1
415KERN: trying: file_systems/udf/v1
416KERN: udf_recognize: Invalid sequence. status = -1
417KERN: returned: -1
418KERN: scanning with: partitioning_systems/efi_gpt/v1
419KERN: efi_gpt_scan_partition(cookie = 0xffffffff8280d8c0)
420KERN: KDiskDeviceManager::_ScanPartition(/dev/disk/scsi/0/0/0/0)
421KERN: intel: ep_std_ops(0x1)
422KERN: trying: partitioning_systems/intel/extended/v1
423KERN: returned: -1
424KERN: intel: ep_std_ops(0x2)
425KERN: trying: partitioning_systems/session/v1
426KERN: returned: -1
427KERN: intel: pm_std_ops(0x1)
428KERN: trying: partitioning_systems/intel/map/v1
429KERN: intel: pm_identify_partition(0, 1: 20480, 209715200, 512)
430KERN: returned: -1
431KERN: intel: pm_std_ops(0x2)
432KERN: trying: partitioning_systems/efi_gpt/v1
433KERN: returned: -1
434KERN: trying: file_systems/btrfs/v1
435KERN: [34mbtrfs:[0m invalid superblock!
436KERN: returned: -1
437KERN: trying: file_systems/exfat/v1
438KERN: [34mexfat:[0m invalid superblock!
439KERN: returned: -1
440KERN: trying: file_systems/attribute_overlay/v1
441KERN: returned: -1
442KERN: trying: file_systems/devfs/v1
443KERN: returned: -1
444KERN: trying: file_systems/packagefs/v1
445KERN: returned: -1
446KERN: trying: file_systems/bindfs/v1
447KERN: returned: -1
448KERN: trying: file_systems/rootfs/v1
449KERN: returned: -1
450KERN: trying: file_systems/ext2/v1
451KERN: [34mext2:[0m invalid superblock!
452KERN: returned: -1
453KERN: trying: file_systems/cdda/v1
454KERN: raw_command:
455KERN: ahci: AHCIPort::ScsiExecuteRequest port 0 unsupported request opcode 0x43
456KERN: returned: -1
457KERN: trying: file_systems/log_overlay/v1
458KERN: returned: -1
459KERN: trying: file_systems/nfs4/v1
460KERN: returned: -1
461KERN: trying: file_systems/ntfs/v1
462KERN: fs_identify_partition: boot signature NTFS doesn't match
463KERN: returned: -1
464KERN: trying: file_systems/iso9660/v1
465KERN: identify(0, 0xffffffff82d36140)
466KERN: returned: -1
467KERN: trying: file_systems/write_overlay/v1
468KERN: returned: -1
469KERN: trying: file_systems/reiserfs/v1
470KERN: returned: -1
471KERN: trying: file_systems/bfs/v1
472KERN: returned: -1
473KERN: dos_std_ops()
474KERN: trying: file_systems/fat/v1
475KERN: slab memory manager: created area 0xffffffff93001000 (1154)
476KERN: returned: 0.8
477KERN: trying: file_systems/nfs/v1
478KERN: returned: -1
479KERN: trying: file_systems/udf/v1
480KERN: udf_recognize: Invalid sequence. status = -1
481KERN: returned: -1
482KERN: scanning with: file_systems/fat/v1
483KERN: KDiskDeviceManager::_ScanPartition(/dev/disk/scsi/0/0/0/1)
484KERN: intel: ep_std_ops(0x1)
485KERN: trying: partitioning_systems/intel/extended/v1
486KERN: intel: ep_identify_partition(0, 209735680, 20971520000, 512)
487KERN: returned: -1
488KERN: intel: ep_std_ops(0x2)
489KERN: trying: partitioning_systems/session/v1
490KERN: returned: -1
491KERN: intel: pm_std_ops(0x1)
492KERN: trying: partitioning_systems/intel/map/v1
493KERN: intel: pm_identify_partition(0, 2: 209735680, 20971520000, 512)
494KERN: returned: -1
495KERN: intel: pm_std_ops(0x2)
496KERN: trying: partitioning_systems/efi_gpt/v1
497KERN: returned: -1
498KERN: trying: file_systems/btrfs/v1
499KERN: [34mbtrfs:[0m invalid superblock!
500KERN: returned: -1
501KERN: trying: file_systems/exfat/v1
502KERN: [34mexfat:[0m invalid superblock!
503KERN: returned: -1
504KERN: trying: file_systems/attribute_overlay/v1
505KERN: returned: -1
506KERN: trying: file_systems/devfs/v1
507KERN: returned: -1
508KERN: trying: file_systems/packagefs/v1
509KERN: returned: -1
510KERN: trying: file_systems/bindfs/v1
511KERN: returned: -1
512KERN: trying: file_systems/rootfs/v1
513KERN: returned: -1
514KERN: trying: file_systems/ext2/v1
515KERN: [34mext2:[0m invalid superblock!
516KERN: returned: -1
517KERN: trying: file_systems/cdda/v1
518KERN: raw_command:
519KERN: ahci: AHCIPort::ScsiExecuteRequest port 0 unsupported request opcode 0x43
520KERN: returned: -1
521KERN: trying: file_systems/log_overlay/v1
522KERN: returned: -1
523KERN: trying: file_systems/nfs4/v1
524KERN: returned: -1
525KERN: trying: file_systems/ntfs/v1
526KERN: fs_identify_partition: boot signature NTFS doesn't match
527KERN: returned: -1
528KERN: trying: file_systems/iso9660/v1
529KERN: identify(0, 0xffffffff82d36140)
530KERN: returned: -1
531KERN: trying: file_systems/write_overlay/v1
532KERN: returned: -1
533KERN: trying: file_systems/reiserfs/v1
534KERN: returned: -1
535KERN: trying: file_systems/bfs/v1
536KERN: returned: 0.85
537KERN: trying: file_systems/fat/v1
538KERN: returned: -1
539KERN: trying: file_systems/nfs/v1
540KERN: returned: -1
541KERN: trying: file_systems/udf/v1
542KERN: read_pos(pos:107384676352, len:512) failed with: 0xffffffffffffffff
543KERN: udf_recognize: Invalid sequence. status = -1
544KERN: returned: -1
545KERN: scanning with: file_systems/bfs/v1
546KERN: KDiskDeviceManager::_ScanPartition(/dev/disk/scsi/0/0/0/2)
547KERN: intel: ep_std_ops(0x1)
548KERN: trying: partitioning_systems/intel/extended/v1
549KERN: intel: ep_identify_partition(0, 21181255680, 524288000KERN: 00, 512)
550KERN: returned: -1
551KERN: intel: ep_std_ops(0x2)
552KERN: trying: partitioning_systems/session/v1
553KERN: returned: -1
554KERN: intel: pm_std_ops(0x1)
555KERN: trying: partitioning_systems/intel/map/v1
556KERN: intel: pm_identify_partition(0, 3: 21181255680, 52428800000, 512)
557KERN: returned: -1
558KERN: intel: pm_std_ops(0x2)
559KERN: trying: partitioning_systems/efi_gpt/v1
560KERN: returned: -1
561KERN: trying: file_systems/btrfs/v1
562KERN: [34mbtrfs:[0m invalid superblock!
563KERN: returned: -1
564KERN: trying: file_systems/exfat/v1
565KERN: [34mexfat:[0m invalid superblock!
566KERN: returned: -1
567KERN: trying: file_systems/attribute_overlay/v1
568KERN: returned: -1
569KERN: trying: file_systems/devfs/v1
570KERN: returned: -1
571KERN: trying: file_systems/packagefs/v1
572KERN: returned: -1
573KERN: trying: file_systems/bindfs/v1
574KERN: returned: -1
575KERN: trying: file_systems/rootfs/v1
576KERN: returned: -1
577KERN: trying: file_systems/ext2/v1
578KERN: [34mext2:[0m invalid superblock!
579KERN: returned: -1
580KERN: trying: file_systems/cdda/v1
581KERN: raw_command:
582KERN: ahci: AHCIPort::ScsiExecuteRequest port 0 unsupported request opcode 0x43
583KERN: returned: -1
584KERN: trying: file_systems/log_overlay/v1
585KERN: returned: -1
586KERN: trying: file_systems/nfs4/v1
587KERN: returned: -1
588KERN: trying: file_systems/ntfs/v1
589KERN: fs_identify_partition: boot signature NTFS doesn't match
590KERN: returned: -1
591KERN: trying: file_systems/iso9660/v1
592KERN: identify(0, 0xffffffff82d36140)
593KERN: returned: -1
594KERN: trying: file_systems/write_overlay/v1
595KERN: returned: -1
596KERN: trying: file_systems/reiserfs/v1
597KERN: returned: -1
598KERN: trying: file_systems/bfs/v1
599KERN: returned: 0.85
600KERN: trying: file_systems/fat/v1
601KERN: returned: -1
602KERN: trying: file_systems/nfs/v1
603KERN: returned: -1
604KERN: trying: file_systems/udf/v1
605KERN: read_pos(pos:10844802916352, len:512) failed with: 0xffffffffffffffff
606KERN: udf_recognize: Invalid sequence. status = -1
607KERN: returned: -1
608KERN: scanning with: file_systems/bfs/v1
609KERN: KDiskDeviceManager::_ScanPartition(/dev/disk/scsi/0/0/0/3)
610KERN: intel: ep_std_ops(0x1)
611KERN: trying: partitioning_systems/intel/extended/v1
612KERN: intel: ep_identify_partition(0, 73610055680, 20971520000, 512)
613KERN: returned: -1
614KERN: intel: ep_std_ops(0x2)
615KERN: trying: partitioning_systems/session/v1
616KERN: returned: -1
617KERN: intel: pm_std_ops(0x1)
618KERN: trying: partitioning_systems/intel/map/v1
619KERN: intel: pm_identify_partition(0, 4: 73610055680, 20971520000, 512)
620KERN: returned: -1
621KERN: intel: pm_std_ops(0x2)
622KERN: trying: partitioning_systems/efi_gpt/v1
623KERN: returned: -1
624KERN: trying: file_systems/btrfs/v1
625KERN: [34mbtrfs:[0m invalid superblock!
626KERN: returned: -1
627KERN: trying: file_systems/exfat/v1
628KERN: [34mexfat:[0m invalid superblock!
629KERN: returned: -1
630KERN: trying: file_systems/attribute_overlay/v1
631KERN: returned: -1
632KERN: trying: file_systems/devfs/v1
633KERN: returned: -1
634KERN: trying: file_systems/packagefs/v1
635KERN: returned: -1
636KERN: trying: file_systems/bindfs/v1
637KERN: returned: -1
638KERN: trying: file_systems/rootfs/v1
639KERN: returned: -1
640KERN: trying: file_systems/ext2/v1
641KERN: [34mext2:[0m invalid superblock!
642KERN: returned: -1
643KERN: trying: file_systems/cdda/v1
644KERN: raw_command:
645KERN: ahci: AHCIPort::ScsiExecuteRequest port 0 unsupported request opcode 0x43
646KERN: returned: -1
647KERN: trying: file_systems/log_overlay/v1
648KERN: returned: -1
649KERN: trying: file_systems/nfs4/v1
650KERN: returned: -1
651KERN: trying: file_systems/ntfs/v1
652KERN: fs_identify_partition: boot signature NTFS doesn't match
653KERN: returned: -1
654KERN: trying: file_systems/iso9660/v1
655KERN: identify(0, 0xffffffff82d36140)
656KERN: returned: -1
657KERN: trying: file_systems/write_overlay/v1
658KERN: returned: -1
659KERN: trying: file_systems/reiserfs/v1
660KERN: returned: -1
661KERN: trying: file_systems/bfs/v1
662KERN: returned: 0.85
663KERN: trying: file_systems/fat/v1
664KERN: returned: -1
665KERN: trying: file_systems/nfs/v1
666KERN: returned: -1
667KERN: trying: file_systems/udf/v1
668KERN: read_pos(pos:37688348516352, len:512) failed with: 0xffffffffffffffff
669KERN: udf_recognize: Invalid sequence. status = -1
670KERN: returned: -1
671KERN: scanning with: file_systems/bfs/v1
672KERN: KDiskDeviceManager::_ScanPartition(/dev/disk/scsi/0/0/0/4)
673KERN: intel: ep_std_ops(0x1)
674KERN: trying: partitioning_systems/intel/extended/v1
675KERN: intel: ep_identify_partition(0, 94581575680, 141557760000, 512)
676KERN: returned: -1
677KERN: intel: ep_std_ops(0x2)
678KERN: trying: partitioning_systems/session/v1
679KERN: returned: -1
680KERN: intel: pm_std_ops(0x1)
681KERN: trying: partitioning_systems/intel/map/v1
682KERN: intel: pm_identify_partition(0, 5: 94581575680, 141557760000, 512)
683KERN: returned: -1
684KERN: intel: pm_std_ops(0x2)
685KERN: trying: partitioning_systems/efi_gpt/v1
686KERN: returned: -1
687KERN: trying: file_systems/btrfs/v1
688KERN: [34mbtrfs:[0m invalid superblock!
689KERN: returned: -1
690KERN: trying: file_systems/exfat/v1
691KERN: [34mexfat:[0m invalid superblock!
692KERN: returned: -1
693KERN: trying: file_systems/attribute_overlay/v1
694KERN: returned: -1
695KERN: trying: file_systems/devfs/v1
696KERN: returned: -1
697KERN: trying: file_systems/packagefs/v1
698KERN: returned: -1
699KERN: trying: file_systems/bindfs/v1
700KERN: returned: -1
701KERN: trying: file_systems/rootfs/v1
702KERN: returned: -1
703KERN: trying: file_systems/ext2/v1
704KERN: [34mext2:[0m invalid superblock!
705KERN: returned: -1
706KERN: trying: file_systems/cdda/v1
707KERN: raw_command:
708KERN: ahci: AHCIPort::ScsiExecuteRequest port 0 unsupported request opcode 0x43
709KERN: returned: -1
710KERN: trying: file_systems/log_overlay/v1
711KERN: returned: -1
712KERN: trying: file_systems/nfs4/v1
713KERN: returned: -1
714KERN: trying: file_systems/ntfs/v1
715KERN: fs_identify_partition: boot signature NTFS doesn't match
716KERN: returned: -1
717KERN: trying: file_systems/iso9660/v1
718KERN: identify(0, 0xffffffff82d36140)
719KERN: returned: -1
720KERN: trying: file_systems/write_overlay/v1
721KERN: returned: -1
722KERN: trying: file_systems/reiserfs/v1
723KERN: returned: -1
724KERN: trying: file_systems/bfs/v1
725KERN: returned: 0.85
726KERN: trying: file_systems/fat/v1
727KERN: returned: -1
728KERN: trying: file_systems/nfs/v1
729KERN: returned: -1
730KERN: trying: file_systems/udf/v1
731KERN: read_pos(pos:48425766756352, len:512) failed with: 0xffffffffffffffff
732KERN: udf_recognize: Invalid sequence. status = -1
733KERN: returned: -1
734KERN: scanning with: file_systems/bfs/v1
735KERN: device 0: /dev/disk/scsi/0/0/0/raw
736KERN: media status: No error
737KERN: device flags: 2
738KERN: offset: 0
739KERN: size: 250059350016 (238475.179 MB)
740KERN: content size: 250059350016
741KERN: block size: 512
742KERN: child count: 5
743KERN: index: -1
744KERN: status: 0
745KERN: flags: 5
746KERN: volume: -1
747KERN: disk system: partitioning_systems/efi_gpt/v1
748KERN: name: Samsung SSD 850 EVO 250G
749KERN: content name: <NULL>
750KERN: type: <NULL>
751KERN: content type: GUID Partition Map
752KERN: params: <NULL>
753KERN: content params: <NULL>
754KERN: partition 1: /dev/disk/scsi/0/0/0/0
755KERN: offset: 20480
756KERN: size: 209715200 (200 MB)
757KERN: content size: 209715200
758KERN: block size: 512
759KERN: child count: 0
760KERN: index: 0
761KERN: status: 0
762KERN: flags: 2
763KERN: volume: -1
764KERN: disk system: file_systems/fat/v1
765KERN: name: EFI
766KERN: content name: efi
767KERN: type: EFI system data
768KERN: content type: FAT32 File System
769KERN: params: <NULL>
770KERN: content params: <NULL>
771KERN: partition 2: /dev/disk/scsi/0/0/0/1
772KERN: offset: 209735680
773KERN: size: 20971520000 (20000 MB)
774KERN: content size: 20971520000
775KERN: block size: 2048
776KERN: child count: 0
777KERN: index: 1
778KERN: status: 0
779KERN: flags: 2
780KERN: volume: -1
781KERN: disk system: file_systems/bfs/v1
782KERN: name: Haiku
783KERN: content name: Haiku
784KERN: type: Be File System
785KERN: content type: Be File System
786KERN: params: <NULL>
787KERN: content params: <NULL>
788KERN: partition 3: /dev/disk/scsi/0/0/0/2
789KERN: offset: 21181255680
790KERN: size: 52428800000 (50000 MB)
791KERN: content size: 52428800000
792KERN: block size: 2048
793KERN: child count: 0
794KERN: index: 2
795KERN: status: 0
796KERN: flags: 2
797KERN: volume: -1
798KERN: disk system: file_systems/bfs/v1
799KERN: name: Ports
800KERN: content name: Ports
801KERN: type: Be File System
802KERN: content type: Be File System
803KERN: params: <NULL>
804KERN: content params: <NULL>
805KERN: partition 4: /dev/disk/scsi/0/0/0/3
806KERN: offset: 73610055680
807KERN: size: 20971520000 (20000 MB)
808KERN: content size: 20971520000
809KERN: block size: 2048
810KERN: child count: 0
811KERN: index: 3
812KERN: status: 0
813KERN: flags: 2
814KERN: volume: -1
815KERN: disk system: file_systems/bfs/v1
816KERN: name: Singularity
817KERN: content name: Singularity
818KERN: type: Be File System
819KERN: content type: Be File SyKERN: stem
820KERN: params: <NULL>
821KERN: content params: <NULL>
822KERN: partition 5: /dev/disk/scsi/0/0/0/4
823KERN: offset: 94581575680
824KERN: size: 141557760000 (135000 MB)
825KERN: content size: 141557760000
826KERN: block size: 2048
827KERN: child count: 0
828KERN: index: 4
829KERN: status: 0
830KERN: flags: 2
831KERN: volume: -1
832KERN: disk system: file_systems/bfs/v1
833KERN: name: Data
834KERN: content name: Data
835KERN: type: Be File System
836KERN: content type: Be File System
837KERN: params: <NULL>
838KERN: content params: <NULL>
839KERN: Identified boot partition by partition offset.
840KERN: ahci: sg_memcpy phyAddr 0x48b50c, size 8
841KERN: ahci: sg_memcpy phyAddr 0x48b48c, size 8
842KERN: bfs: mounted "Haiku" (root node at 524288, device = /dev/disk/scsi/0/0/0/1)
843KERN: Mounted boot partition: /dev/disk/scsi/0/0/0/1
844KERN: unknown [2804235: 18] Adding packages from "/boot/system/packages"
845KERN: slab memory manager: created area 0xffffffff93801000 (1162)
846KERN: slab memory manager: created area 0xffffffff94001000 (1164)
847KERN: slab memory manager: created area 0xffffffff94801000 (1167)
848KERN: slab memory manager: created area 0xffffffff95001000 (1168)
849KERN: slab memory manager: created area 0xffffffff95801000 (1170)
850KERN: slab memory manager: created area 0xffffffff96001000 (1172)
851KERN: slab memory manager: created area 0xffffffff96801000 (1174)
852KERN: slab memory manager: created area 0xffffffff97001000 (1175)
853KERN: slab memory manager: created area 0xffffffff97801000 (1177)
854KERN: slab memory manager: created area 0xffffffff98001000 (1178)
855KERN: slab memory manager: created area 0xffffffff98801000 (1180)
856KERN: slab memory manager: created area 0xffffffff99001000 (1181)
857KERN: unknown [5028768: 18] StringPool usage:
858KERN: unknown [5028938: 18] total unique strings: 113870, 1948205 bytes, overhead: 2619010 bytes
859KERN: unknown [5029322: 18] total strings with dups: 607592, 7615376 bytes
860KERN: unknown [5029613: 18] unshared strings: 5532
861KERN: unknown [5029846: 18] bytes saved: 3048161
862KERN: unknown [5031658: 18] Adding packages from "/boot/home/config/packages"
863KERN: unknown [5032197: 18] Failed to open packages activation file: No such file or directory
864KERN: unknown [5032543: 18] Loading packages from activation file failed. Loading all packages in packages directory.
865KERN: unknown [5043418: 18] StringPool usage:
866KERN: unknown [5043586: 18] total unique strings: 113870, 1948205 bytes, overhead: 2619010 bytes
867KERN: unknown [5043970: 18] total strings with dups: 607603, 7615441 bytes
868KERN: unknown [5044260: 18] unshared strings: 5530
869KERN: unknown [5044491: 18] bytes saved: 3048226
870KERN: module_init_post_boot_device() failed to normalize path of module image 0xffffffff8280f090, "fat"
871KERN: module: Search for file_cache/launch_speedup/v1 failed.
872KERN: KDiskDeviceManager::_ScanPartition(/dev/disk/scsi/0/0/0/0)
873KERN: KDiskDeviceManager::_ScanPartition(/dev/disk/scsi/0/0/0/2)
874KERN: KDiskDeviceManager::_ScanPartition(/dev/disk/scsi/0/0/0/3)
875KERN: KDiskDeviceManager::_ScanPartition(/dev/disk/scsi/0/0/0/4)
876KERN: KDiskDeviceManager::_Scan(/dev/disk)
877KERN: publish device: node 0xffffffff98d1c288, path disk/virtual/ram/control, module drivers/disk/virtual/ram_disk/control/device_v1
878KERN: loaded driver /boot/system/add-ons/kernel/drivers/dev/dprintf
879KERN: loaded driver /boot/system/add-ons/kernel/drivers/dev/zero
880KERN: loaded driver /boot/system/add-ons/kernel/drivers/dev/null
881KERN: con_init: trying module console/frame_buffer/v1
882KERN: loaded driver /boot/system/add-ons/kernel/drivers/dev/console
883KERN: loaded driver /boot/system/add-ons/kernel/drivers/dev/tty
884KERN: usb_modeswitch: init_hardware()
885KERN: usb_modeswitch: init_driver()
886KERN: usb_modeswitch: trying module bus_managers/usb/v3
887KERN: usb_modeswitch: publish_devices()
888KERN: usb_modeswitch: uninit_driver()
889KERN: loaded driver /boot/system/add-ons/kernel/drivers/dev/usb_modeswitch
890KERN: Highpoint-IDE: supports_device()
891KERN: Highpoint-IDE: supports_device(): unsupported device: vendor ID: 8086, deviceID: 9c03
892KERN: Highpoint-IDE: supports_device()
893Last message repeated 1 time
894KERN: KDiskDeviceManager::_Scan(/dev/disk/scsi)
895KERN: KDiskDeviceManager::_Scan(/dev/disk/scsi/0)
896KERN: KDiskDeviceManager::_Scan(/dev/disk/scsi/0/0)
897KERN: KDiskDeviceManager::_Scan(/dev/disk/scsi/0/0/0)
898KERN: KDiskDeviceManager::_Scan(/dev/disk/scsi/0/0/0/0)
899KERN: KDiskDeviceManager::_Scan(/dev/disk/scsi/0/0/0/1)
900KERN: KDiskDeviceManager::_Scan(/dev/disk/scsi/0/0/0/2)
901KERN: KDiskDeviceManager::_Scan(/dev/disk/scsi/0/0/0/3)
902KERN: KDiskDeviceManager::_Scan(/dev/disk/scsi/0/0/0/4)
903KERN: KDiskDeviceManager::_Scan(/dev/disk/scsi/0/0/0/raw)
904KERN: KDiskDeviceManager::_Scan(/dev/disk/usb)
905KERN: loaded driver /boot/system/add-ons/kernel/drivers/dev/disk/usb/usb_disk
906KERN: KDiskDeviceManager::_Scan(/dev/disk/virtual)
907KERN: KDiskDeviceManager::_Scan(/dev/disk/virtual/ram)
908KERN: KDiskDeviceManager::_Scan(/dev/disk/virtual/ram/control)
909KERN: KDiskDeviceManager::_ScanPartition(/dev/disk/scsi/0/0/0/0)
910KERN: intel: ep_std_ops(0x1)
911KERN: trying: partitioning_systems/intel/extended/v1
912KERN: returned: -1
913KERN: intel: ep_std_ops(0x2)
914KERN: trying: partitioning_systems/session/v1
915KERN: returned: -1
916KERN: intel: pm_std_ops(0x1)
917KERN: trying: partitioning_systems/intel/map/v1
918KERN: intel: pm_identify_partition(4, 1: 20480, 209715200, 512)
919KERN: returned: -1
920KERN: intel: pm_std_ops(0x2)
921KERN: trying: partitioning_systems/efi_gpt/v1
922KERN: returned: -1
923KERN: trying: file_systems/btrfs/v1
924KERN: [34mbtrfs:[0m invalid superblock!
925KERN: returned: -1
926KERN: trying: file_systems/exfat/v1
927KERN: [34mexfat:[0m invalid superblock!
928KERN: returned: -1
929KERN: trying: file_systems/attribute_overlay/v1
930KERN: returned: -1
931KERN: trying: file_systems/devfs/v1
932KERN: returned: -1
933KERN: trying: file_systems/packagefs/v1
934KERN: returned: -1
935KERN: trying: file_systems/bindfs/v1
936KERN: returned: -1
937KERN: trying: file_systems/rootfs/v1
938KERN: returned: -1
939KERN: trying: file_systems/ext2/v1
940KERN: [34mext2:[0m invalid superblock!
941KERN: returned: -1
942KERN: trying: file_systems/cdda/v1
943KERN: raw_command:
944KERN: ahci: AHCIPort::ScsiExecuteRequest port 0 unsupported request opcode 0x43
945KERN: returned: -1
946KERN: trying: file_systems/log_overlay/v1
947KERN: returned: -1
948KERN: trying: file_systems/nfs4/v1
949KERN: returned: -1
950KERN: trying: file_systems/ntfs/v1
951KERN: fs_identify_partition: boot signature NTFS doesn't match
952KERN: returned: -1
953KERN: trying: file_systems/iso9660/v1
954KERN: identify(4, 0xffffffff82826d68)
955KERN: returned: -1
956KERN: trying: file_systems/write_overlay/v1
957KERN: returned: -1
958KERN: trying: file_systems/reiserfs/v1
959KERN: returned: -1
960KERN: trying: file_systems/bfs/v1
961KERN: returned: -1
962KERN: trying: file_systems/fat/v1
963KERN: returned: 0.8
964KERN: trying: file_systems/nfs/v1
965KERN: returned: -1
966KERN: trying: file_systems/udf/v1
967KERN: udf_recognize: Invalid sequence. status = -1
968KERN: returned: -1
969KERN: KDiskDeviceManager::_ScanPartition(/dev/disk/scsi/0/0/0/2)
970KERN: intel: ep_std_ops(0x1)
971KERN: trying: partitioning_systems/intel/extended/v1
972KERN: intel: ep_identify_partition(4, 21181255680, 52428800000, 2048)
973KERN: returned: -1
974KERN: intel: ep_std_ops(0x2)
975KERN: trying: partitioning_systems/session/v1
976KERN: returned: -1
977KERN: intel: pm_std_ops(0x1)
978KERN: trying: partitioning_systems/intel/map/v1
979KERN: intel: pm_identify_partition(4, 3: 21181255680, 52428800000, 2048)
980KERN: returned: -1
981KERN: intel: pm_std_ops(0x2)
982KERN: trying: partitioning_systems/efi_gpt/v1
983KERN: returned: -1
984KERN: trying: file_systems/btrfs/v1
985KERN: [34mbtrfs:[0m invalid superblock!
986KERN: returned: -1
987KERN: trying: file_systems/exfat/v1
988KERN: [34mexfat:[0m invalid superblock!
989KERN: returned: -1
990KERN: trying: file_systems/attribute_overlay/v1
991KERN: returned: -1
992KERN: trying: file_systems/devfs/v1
993KERN: returned: -1
994KERN: trying: file_systems/packagefs/v1
995KERN: returned: -1
996KERN: trying: file_systems/bindfs/v1
997KERN: returned: -1
998KERN: trying: file_systems/rootfs/v1
999KERN: returned: -1
1000KERN: trying: file_systems/ext2/v1
1001KERN: [34mext2:[0m invalid superblock!
1002KERN: returned: -1
1003KERN: trying: file_systems/cdda/v1
1004KERN: raw_command:
1005KERN: ahci: AHCIPort::ScsiExecuteRequest port 0 unsupported request opcode 0x43
1006KERN: returned: -1
1007KERN: trying: file_systems/log_overlay/v1
1008KERN: returned: -1
1009KERN: trying: file_systems/nfs4/v1
1010KERN: returned: -1
1011KERN: trying: file_systems/ntfs/v1
1012KERN: fs_identify_partition: boot signature NTFS doesn't match
1013KERN: returned: -1
1014KERN: trying: file_systems/iso9660/v1
1015KERN: identify(4, 0xffffffff82826d68)
1016KERN: returned: -1
1017KERN: trying: file_systems/write_overlay/v1
1018KERN: returned: -1
1019KERN: trying: file_systems/reiserfs/v1
1020KERN: returned: -1
1021KERN: trying: file_systems/bfs/v1
1022KERN: returned: 0.85
1023KERN: trying: file_systems/fat/v1
1024KERN: returned: -1
1025KERN: trying: file_systems/nfs/v1
1026KERN: returned: -1
1027KERN: trying: file_systems/udf/v1
1028KERN: read_pos(pos:43379211665408, leKERN: n:2048) failed with: 0xffffffffffffffff
1029KERN: udf_recognize: Invalid sequence. status = -1
1030KERN: returned: -1
1031KERN: KDiskDeviceManager::_ScanPartition(/dev/disk/scsi/0/0/0/3)
1032KERN: intel: ep_std_ops(0x1)
1033KERN: trying: partitioning_systems/intel/extended/v1
1034KERN: intel: ep_identify_partition(4, 73610055680, 20971520000, 2048)
1035KERN: returned: -1
1036KERN: intel: ep_std_ops(0x2)
1037KERN: trying: partitioning_systems/session/v1
1038KERN: returned: -1
1039KERN: intel: pm_std_ops(0x1)
1040KERN: trying: partitioning_systems/intel/map/v1
1041KERN: intel: pm_identify_partition(4, 4: 73610055680, 20971520000, 2048)
1042KERN: returned: -1
1043KERN: intel: pm_std_ops(0x2)
1044KERN: trying: partitioning_systems/efi_gpt/v1
1045KERN: returned: -1
1046KERN: trying: file_systems/btrfs/v1
1047KERN: [34mbtrfs:[0m invalid superblock!
1048KERN: returned: -1
1049KERN: trying: file_systems/exfat/v1
1050KERN: [34mexfat:[0m invalid superblock!
1051KERN: returned: -1
1052KERN: trying: file_systems/attribute_overlay/v1
1053KERN: returned: -1
1054KERN: trying: file_systems/devfs/v1
1055KERN: returned: -1
1056KERN: trying: file_systems/packagefs/v1
1057KERN: returned: -1
1058KERN: trying: file_systems/bindfs/v1
1059KERN: returned: -1
1060KERN: trying: file_systems/rootfs/v1
1061KERN: returned: -1
1062KERN: trying: file_systems/ext2/v1
1063KERN: [34mext2:[0m invalid superblock!
1064KERN: returned: -1
1065KERN: trying: file_systems/cdda/v1
1066KERN: raw_command:
1067KERN: ahci: AHCIPort::ScsiExecuteRequest port 0 unsupported request opcode 0x43
1068KERN: returned: -1
1069KERN: trying: file_systems/log_overlay/v1
1070KERN: returned: -1
1071KERN: trying: file_systems/nfs4/v1
1072KERN: returned: -1
1073KERN: trying: file_systems/ntfs/v1
1074KERN: fs_identify_partition: boot signature NTFS doesn't match
1075KERN: returned: -1
1076KERN: trying: file_systems/iso9660/v1
1077KERN: identify(4, 0xffffffff82826d68)
1078KERN: returned: -1
1079KERN: trying: file_systems/write_overlay/v1
1080KERN: returned: -1
1081KERN: trying: file_systems/reiserfs/v1
1082KERN: returned: -1
1083KERN: trying: file_systems/bfs/v1
1084KERN: returned: 0.85
1085KERN: trying: file_systems/fat/v1
1086KERN: returned: -1
1087KERN: trying: file_systems/nfs/v1
1088KERN: returned: -1
1089KERN: trying: file_systems/udf/v1
1090KERN: read_pos(pos:150753394065408, len:2048) failed with: 0xffffffffffffffff
1091KERN: udf_recognize: Invalid sequence. status = -1
1092KERN: returned: -1
1093KERN: KDiskDeviceManager::_ScanPartition(/dev/disk/scsi/0/0/0/4)
1094KERN: intel: ep_std_ops(0x1)
1095KERN: trying: partitioning_systems/intel/extended/v1
1096KERN: intel: ep_identify_partition(4, 94581575680, 141557760000, 2048)
1097KERN: returned: -1
1098KERN: intel: ep_std_ops(0x2)
1099KERN: trying: partitioning_systems/session/v1
1100KERN: returned: -1
1101KERN: intel: pm_std_ops(0x1)
1102KERN: trying: partitioning_systems/intel/map/v1
1103KERN: intel: pm_identify_partition(4, 5: 94581575680, 141557760000, 2048)
1104KERN: returned: -1
1105KERN: intel: pm_std_ops(0x2)
1106KERN: trying: partitioning_systems/efi_gpt/v1
1107KERN: returned: -1
1108KERN: trying: file_systems/btrfs/v1
1109KERN: [34mbtrfs:[0m invalid superblock!
1110KERN: returned: -1
1111KERN: trying: file_systems/exfat/v1
1112KERN: [34mexfat:[0m invalid superblock!
1113KERN: returned: -1
1114KERN: trying: file_systems/attribute_overlay/v1
1115KERN: returned: -1
1116KERN: trying: file_systems/devfs/v1
1117KERN: returned: -1
1118KERN: trying: file_systems/packagefs/v1
1119KERN: returned: -1
1120KERN: trying: file_systems/bindfs/v1
1121KERN: returned: -1
1122KERN: trying: file_systems/rootfs/v1
1123KERN: returned: -1
1124KERN: trying: file_systems/ext2/v1
1125KERN: [34mext2:[0m invalid superblock!
1126KERN: returned: -1
1127KERN: trying: file_systems/cdda/v1
1128KERN: raw_command:
1129KERN: ahci: AHCIPort::ScsiExecuteRequest port 0 unsupported request opcode 0x43
1130KERN: returned: -1
1131KERN: trying: file_systems/log_overlay/v1
1132KERN: returned: -1
1133KERN: trying: file_systems/nfs4/v1
1134KERN: returned: -1
1135KERN: trying: file_systems/ntfs/v1
1136KERN: fs_identify_partition: boot signature NTFS doesn't match
1137KERN: returned: -1
1138KERN: trying: file_systems/iso9660/v1
1139KERN: identify(4, 0xffffffff82826d68)
1140KERN: returned: -1
1141KERN: trying: file_systems/write_overlay/v1
1142KERN: returned: -1
1143KERN: trying: file_systems/reiserfs/v1
1144KERN: returned: -1
1145KERN: trying: file_systems/bfs/v1
1146KERN: returned: 0.85
1147KERN: trying: file_systems/fat/v1
1148KERN: returned: -1
1149KERN: trying: file_systems/nfs/v1
1150KERN: returned: -1
1151KERN: trying: file_systems/udf/v1
1152KERN: read_pos(pos:193703067025408, len:2048) failed with: 0xffffffffffffffff
1153KERN: udf_recognize: Invalid sequence. status = -1
1154KERN: returned: -1
1155KERN: allocate_commpage_entry(4, 16) -> 0x0000000000000260
1156KERN: using Intel P-States: min 8, max 27, boost 33
1157KERN: found cpufreq module: power/cpufreq/intel_pstates/v1
1158KERN: using Intel C-States: C0, C1, C2, C3, C4, C5, C6, C7
1159KERN: found cpuidle module: power/cpuidle/intel_cstates/v1
1160KERN: set MTRRs to:
1161KERN: mtrr: 0: base: 0xd0000000, size: 0x10000000, type: 0
1162KERN: mtrr: 1: base: 0xe0000000, size: 0x20000000, type: 0
1163KERN: set MTRRs to:
1164KERN: mtrr: 0: base: 0xdc000000, size: 0x4000000, type: 0
1165KERN: mtrr: 1: base: 0xe0000000, size: 0x20000000, type: 0
1166KERN: set MTRRs to:
1167KERN: mtrr: 0: base: 0xdcc00000, size: 0x200000, type: 0
1168KERN: mtrr: 1: base: 0xdce00000, size: 0x80000, type: 0
1169KERN: mtrr: 2: base: 0xdcec0000, size: 0x20000, type: 0
1170KERN: mtrr: 3: base: 0xdcee0000, size: 0x10000, type: 0
1171KERN: mtrr: 4: base: 0xdcef0000, size: 0x8000, type: 0
1172KERN: mtrr: 5: base: 0xdcefe000, size: 0x1000, type: 0
1173KERN: mtrr: 6: base: 0xe0000000, size: 0x20000000, type: 0
1174KERN: set MTRRs to:
1175KERN: mtrr: 0: base: 0xdcc00000, size: 0x200000, type: 0
1176KERN: mtrr: 1: base: 0xdce00000, size: 0x80000, type: 0
1177KERN: mtrr: 2: base: 0xdcec0000, size: 0x20000, type: 0
1178KERN: mtrr: 3: base: 0xdcee0000, size: 0x10000, type: 0
1179KERN: mtrr: 4: base: 0xdcef0000, size: 0x8000, type: 0
1180KERN: mtrr: 5: base: 0xdcefe000, size: 0x1000, type: 0
1181KERN: mtrr: 6: base: 0xe0000000, size: 0x20000000, type: 0
1182KERN: kernel debugger extension "debugger/run_on_exit/v1": loaded
1183KERN: kernel debugger extension "debugger/hangman/v1": loaded
1184KERN: kernel debugger extension "debugger/disasm/v1": loaded
1185KERN: kernel debugger extension "debugger/invalidate_on_exit/v1": loaded
1186KERN: kernel debugger extension "debugger/usb_keyboard/v1": loaded
1187KERN: set MTRRs to:
1188KERN: mtrr: 0: base: 0xdcc00000, size: 0x200000, type: 0
1189KERN: mtrr: 1: base: 0xdce00000, size: 0x80000, type: 0
1190KERN: mtrr: 2: base: 0xdcec0000, size: 0x20000, type: 0
1191KERN: mtrr: 3: base: 0xdcee0000, size: 0x10000, type: 0
1192KERN: mtrr: 4: base: 0xdcef0000, size: 0x8000, type: 0
1193KERN: mtrr: 5: base: 0xdcefe000, size: 0x1000, type: 0
1194KERN: mtrr: 6: base: 0xf0000000, size: 0x10000000, type: 0
1195KERN: mtrr: 7: base: 0xe0000000, size: 0x20000000, type: 1
1196KERN: publish device: node 0xffffffff8294d148, path random, module bus_managers/random/device_v1
1197KERN: publish device: node 0xffffffff8294d148, path urandom, module bus_managers/random/device_v1
1198KERN: Highpoint-IDE: supports_device()
1199KERN: Highpoint-IDE: supports_device(): unsupported device: vendor ID: 8086, deviceID: 9c22
1200KERN: Highpoint-IDE: supports_device()
1201KERN: Highpoint-IDE: supports_device(): unsupported device: vendor ID: 8086, deviceID: 9c03
1202KERN: publish device: node 0xffffffff82977e70, path power/acpi_battery/0, module drivers/power/acpi_battery/device_v1
1203KERN: publish device: node 0xffffffff82977c90, path power/acpi_battery/1, module drivers/power/acpi_battery/device_v1
1204KERN: publish device: node 0xffffffff82977b50, path power/button/sleep, module drivers/power/acpi_button/device_v1
1205KERN: publish device: node 0xffffffff82977970, path power/button/power_fixed, module drivers/power/acpi_button/device_v1
1206KERN: devfs: reload driver "usb_disk" (-1, -1)
1207KERN: slab memory manager: created area 0xffffffff99801000 (3853)
1208KERN: register_domain(9, unix)
1209KERN: unregister_domain(0xffffffff9904c300, 9, unix)
1210KERN: package_daemon [6728452: 524] root at "/boot" (device: 3, node: 524288) registered
1211KERN: package_daemon [6728831: 524] volume at "/boot/system" registered
1212KERN: package_daemon [6729125: 524] volume at "/boot/home/config" registered
1213KERN: register_domain(5, internet6)
1214KERN: unregister_domain(0xffffffff9905ce80, 5, internet6)
1215KERN: register_domain(5, internet6)
1216KERN: unregister_domain(0xffffffff9905cc80, 5, internet6)
1217KERN: register_domain(1, internet)
1218KERN: unregister_domain(0xffffffff9905cc00, 1, internet)
1219KERN: register_domain(5, internet6)
1220KERN: unregister_domain(0xffffffff9905cb00, 5, internet6)
1221KERN: register_domain(5, internet6)
1222KERN: unregister_domain(0xffffffff9905cb00, 5, internet6)
1223KERN: register_domain(4, link)
1224KERN: unregister_domain(0xffffffff9904c680, 4, link)
1225KERN: register_domain(9, unix)
1226KERN: unregister_domain(0xffffffff9905ca80, 9, unix)
1227KERN: register_domain(5, internet6)
1228KERN: unregister_domain(0xffffffff9905ca80, 5, internet6)
1229KERN: register_domain(5, internet6)
1230KERN: unregister_domain(0xffffffff9905ca80, 5, internet6)
1231KERN: register_domain(1, internet)
1232KERN: unregister_domain(0xffffffff9905ca80, 1, internet)
1233KERN: register_domain(5, internet6)
1234KERN: unregister_domain(0xffffffff9905ca80, 5, internet6)
1235KERN: register_domain(5, internet6)
1236KERN: unregister_domain(0xffffffff9905ca80, 5, internet6)
1237KERN: register_domain(1, internet)
1238KERN: unregister_domKERN: ain(0xffffffff9904c680, 1, internet)
1239KERN: register_domain(9, unix)
1240KERN: unregister_domain(0xffffffff9905ca80, 9, unix)
1241KERN: register_domain(5, internet6)
1242KERN: unregister_domain(0xffffffff9905ca80, 5, internet6)
1243KERN: register_domain(5, internet6)
1244KERN: unregister_domain(0xffffffff9905ca80, 5, internet6)
1245KERN: register_domain(1, internet)
1246KERN: unregister_domain(0xffffffff9905ca80, 1, internet)
1247KERN: register_domain(5, internet6)
1248KERN: unregister_domain(0xffffffff9905ca80, 5, internet6)
1249KERN: register_domain(5, internet6)
1250KERN: unregister_domain(0xffffffff9905ca80, 5, internet6)
1251KERN: register_domain(1, internet)
1252KERN: unregister_domain(0xffffffff9904c680, 1, internet)
1253KERN: register_domain(9, unix)
1254KERN: unregister_domain(0xffffffff9905ca80, 9, unix)
1255KERN: register_domain(5, internet6)
1256KERN: unregister_domain(0xffffffff9905ca80, 5, internet6)
1257KERN: register_domain(5, internet6)
1258KERN: unregister_domain(0xffffffff9905ca80, 5, internet6)
1259KERN: register_domain(1, internet)
1260KERN: unregister_domain(0xffffffff9905ca80, 1, internet)
1261KERN: register_domain(5, internet6)
1262KERN: unregister_domain(0xffffffff9905ca80, 5, internet6)
1263KERN: register_domain(5, internet6)
1264KERN: unregister_domain(0xffffffff9905ca80, 5, internet6)
1265KERN: register_domain(5, internet6)
1266KERN: unregister_domain(0xffffffff9904c680, 5, internet6)
1267KERN: register_domain(9, unix)
1268KERN: unregister_domain(0xffffffff9905ca80, 9, unix)
1269KERN: register_domain(5, internet6)
1270KERN: unregister_domain(0xffffffff9905ca80, 5, internet6)
1271KERN: register_domain(5, internet6)
1272KERN: unregister_domain(0xffffffff9905ca80, 5, internet6)
1273KERN: register_domain(1, internet)
1274KERN: unregister_domain(0xffffffff9905ca80, 1, internet)
1275KERN: register_domain(5, internet6)
1276KERN: unregister_domain(0xffffffff9905ca80, 5, internet6)
1277KERN: register_domain(5, internet6)
1278KERN: unregister_domain(0xffffffff9905ca80, 5, internet6)
1279KERN: register_domain(1, internet)
1280KERN: unregister_domain(0xffffffff9904c680, 1, internet)
1281KERN: register_domain(9, unix)
1282KERN: unregister_domain(0xffffffff9905ca80, 9, unix)
1283KERN: register_domain(5, internet6)
1284KERN: unregister_domain(0xffffffff9905ca80, 5, internet6)
1285KERN: register_domain(5, internet6)
1286KERN: unregister_domain(0xffffffff9905ca80, 5, internet6)
1287KERN: register_domain(1, internet)
1288KERN: unregister_domain(0xffffffff9905ca80, 1, internet)
1289KERN: register_domain(5, internet6)
1290KERN: unregister_domain(0xffffffff9905ca80, 5, internet6)
1291KERN: register_domain(5, internet6)
1292KERN: unregister_domain(0xffffffff9905ca80, 5, internet6)
1293KERN: register_domain(1, internet)
1294KERN: register_domain(5, internet6)
1295KERN: Radeon - init_hardware: Version: 5.1.6.0
1296KERN: Radeon - Radeon_CardDetect: no supported devices found
1297KERN: intel_extreme: CALLED status_t init_hardware()
1298KERN: intel_extreme: CALLED status_t init_driver()
1299KERN: [36mAGP:[0m bus manager init
1300KERN: [36mAGP:[0m found 0 AGP devices
1301KERN: intel_extreme: detect_intel_pch: Found LynxPoint PCH
1302KERN: intel_extreme: (0) Haswell Mobile, revision = 0xb
1303KERN: intel_extreme: CALLED const char** publish_devices()
1304KERN: intel_extreme: CALLED device_hooks* find_device(const char*)
1305KERN: loaded driver /boot/system/add-ons/kernel/drivers/dev/graphics/intel_extreme
1306KERN: vesa: init_hardware()
1307KERN: vesa: init_driver()
1308KERN: vesa: publish_devices()
1309KERN: vesa: find_device()
1310KERN: loaded driver /boot/system/add-ons/kernel/drivers/dev/graphics/vesa
1311KERN: devfs: "intel_810" api_version missing
1312KERN: i810: init_hardware() - no supported devices
1313KERN: radeon_hd: init_hardware
1314KERN: intel_extreme: CALLED status_t device_open(const char*, uint32, void**)
1315KERN: intel_extreme: intel_extreme: CALLED status_t intel_extreme_init(intel_info&)
1316KERN: intel_gart: bus manager init
1317KERN: intel_gart: found intel bridge
1318KERN: set MTRRs to:
1319KERN: mtrr: 0: base: 0xdcc00000, size: 0x200000, type: 0
1320KERN: mtrr: 1: base: 0xdce00000, size: 0x80000, type: 0
1321KERN: mtrr: 2: base: 0xdcec0000, size: 0x20000, type: 0
1322KERN: mtrr: 3: base: 0xdcee0000, size: 0x10000, type: 0
1323KERN: mtrr: 4: base: 0xdcef0000, size: 0x8000, type: 0
1324KERN: mtrr: 5: base: 0xdcefe000, size: 0x1000, type: 0
1325KERN: mtrr: 6: base: 0xf0000000, size: 0x10000000, type: 0
1326KERN: mtrr: 7: base: 0xe0000000, size: 0x20000000, type: 1
1327KERN: intel_gart: frame buffer size 256 MB
1328KERN: intel_gart: GTT base f0200000, size 262144, entries 64, stolen 1044480
1329KERN: set MTRRs to:
1330KERN: mtrr: 0: base: 0xdcc00000, size: 0x200000, type: 0
1331KERN: mtrr: 1: base: 0xdce00000, size: 0x80000, type: 0
1332KERN: mtrr: 2: base: 0xdcec0000, size: 0x20000, type: 0
1333KERN: mtrr: 3: base: 0xdcee0000, size: 0x10000, type: 0
1334KERN: mtrr: 4: base: 0xdcef0000, size: 0x8000, type: 0
1335KERN: mtrr: 5: base: 0xdcefe000, size: 0x1000, type: 0
1336KERN: mtrr: 6: base: 0xf0000000, size: 0x10000000, type: 0
1337KERN: mtrr: 7: base: 0xe0000000, size: 0x20000000, type: 1
1338KERN: intel_gart: detected 1 MB of stolen memory, aperture size 256 MB, GTT size 256 KB
1339KERN: intel_gart: GTT base = 0xf0200000
1340KERN: intel_gart: MMIO base = 0xf0000000
1341KERN: intel_gart: GMR base = 0xe0000000
1342KERN: set MTRRs to:
1343KERN: mtrr: 0: base: 0xdcc00000, size: 0x200000, type: 0
1344KERN: mtrr: 1: base: 0xdce00000, size: 0x80000, type: 0
1345KERN: mtrr: 2: base: 0xdcec0000, size: 0x20000, type: 0
1346KERN: mtrr: 3: base: 0xdcee0000, size: 0x10000, type: 0
1347KERN: mtrr: 4: base: 0xdcef0000, size: 0x8000, type: 0
1348KERN: mtrr: 5: base: 0xdcefe000, size: 0x1000, type: 0
1349KERN: mtrr: 6: base: 0xf0000000, size: 0x10000000, type: 0
1350KERN: mtrr: 7: base: 0xe0000000, size: 0x20000000, type: 1
1351KERN: set MTRRs to:
1352KERN: mtrr: 0: base: 0xdcc00000, size: 0x200000, type: 0
1353KERN: mtrr: 1: base: 0xdce00000, size: 0x80000, type: 0
1354KERN: mtrr: 2: base: 0xdcec0000, size: 0x20000, type: 0
1355KERN: mtrr: 3: base: 0xdcee0000, size: 0x10000, type: 0
1356KERN: mtrr: 4: base: 0xdcef0000, size: 0x8000, type: 0
1357KERN: mtrr: 5: base: 0xdcefe000, size: 0x1000, type: 0
1358KERN: mtrr: 6: base: 0xf0000000, size: 0x10000000, type: 0
1359KERN: mtrr: 7: base: 0xe0000000, size: 0x20000000, type: 1
1360KERN: intel_extreme: Init Intel generation 7 GPU with PCH split.
1361KERN: intel_extreme: REGS_NORTH_SHARED: 0x40000
1362KERN: intel_extreme: REGS_NORTH_PIPE_AND_PORT: 0x60000
1363KERN: intel_extreme: REGS_NORTH_PLANE_CONTROL: 0x70000
1364KERN: intel_extreme: REGS_SOUTH_SHARED: 0xc0000
1365KERN: intel_extreme: REGS_SOUTH_TRANSCODER_PORT: 0xe0000
1366KERN: [36mAGP:[0m create memory 0xffffffff98eda580, base ffffffffa0000000, size 10000, flags 0
1367KERN: [36mAGP:[0m allocation is made of reserved memory
1368KERN: [36mAGP:[0m reserved memory already bound
1369KERN: intel_extreme:CALLED status_t intel_en_gating(intel_info&)
1370KERN: intel_extreme:i965 quirk
1371KERN: intel_extreme:CALLED status_t intel_en_downclock(intel_info&)
1372KERN: intel_extreme:intel_en_downclock: Downclocking not supported on this chipset.
1373KERN: set MTRRs to:
1374KERN: mtrr: 0: base: 0xc0000, size: 0x40000, type: 0
1375KERN: mtrr: 1: base: 0xdcc00000, size: 0x200000, type: 0
1376KERN: mtrr: 2: base: 0xdce00000, size: 0x80000, type: 0
1377KERN: mtrr: 3: base: 0xdcec0000, size: 0x20000, type: 0
1378KERN: mtrr: 4: base: 0xdcee0000, size: 0x10000, type: 0
1379KERN: mtrr: 5: base: 0xdcef0000, size: 0x8000, type: 0
1380KERN: mtrr: 6: base: 0xdcefe000, size: 0x1000, type: 0
1381KERN: mtrr: 7: base: 0xf0000000, size: 0x10000000, type: 0
1382KERN: mtrr: 8: base: 0xe0000000, size: 0x20000000, type: 1
1383KERN: intel_extreme: mapping VBIOS: 0xc0000 -> 0xffffffff82560000
1384KERN: intel_extreme: parsing BDB blocks
1385KERN: set MTRRs to:
1386KERN: mtrr: 0: base: 0xdcc00000, size: 0x200000, type: 0
1387KERN: mtrr: 1: base: 0xdce00000, size: 0x80000, type: 0
1388KERN: mtrr: 2: base: 0xdcec0000, size: 0x20000, type: 0
1389KERN: mtrr: 3: base: 0xdcee0000, size: 0x10000, type: 0
1390KERN: mtrr: 4: base: 0xdcef0000, size: 0x8000, type: 0
1391KERN: mtrr: 5: base: 0xdcefe000, size: 0x1000, type: 0
1392KERN: mtrr: 6: base: 0xf0000000, size: 0x10000000, type: 0
1393KERN: mtrr: 7: base: 0xe0000000, size: 0x20000000, type: 1
1394KERN: [36mAGP:[0m create memory 0xffffffff98eda380, base ffffffffa00ff000, size 1000, flags 2
1395KERN: [36mAGP:[0m allocate 4096 bytes out of 4096
1396KERN: [36mAGP:[0m bind 4096 bytes at ffffffffa00ff000
1397KERN: allocate_io_interrupt_vectors: allocated 1 vectors starting from 42
1398KERN: msi_allocate_vectors: allocated 1 vectors starting from 42
1399KERN: msi enabled: 0x0001
1400KERN: intel_extreme: using message signaled interrupts
1401KERN: intel_extreme: intel_extreme_init: completed successfully!
1402KERN: intel_extreme: accelerant: intel_extreme.accelerant
1403KERN: intel_extreme: CALLED status_t intel_init_accelerant(int)
1404KERN: intel_extreme: Pipe: Pipe A routed through FDI
1405KERN: intel_extreme: Pipe A. Pipe Base: 0x0 Plane Base: 0x0
1406KERN: intel_extreme: Pipe: Pipe B routed through FDI
1407KERN: intel_extreme: Pipe B. Pipe Base: 0x1000 Plane Base: 0x1000
1408KERN: intel_extreme: pipe control for: 0x0 0x0
1409KERN: intel_extreme: adpa: 00000000
1410KERN: intel_extreme: dova: 00000000, dovb: 00000000, dovc: 00000000
1411KERN: intel_extreme: lvds: 00000000
1412KERN: intel_extreme: ProKERN: bing DisplayPort 1intel_extreme: IsConnected: DisplayPort A PortRegister: 0x2004000
1413KERN: intel_extreme: IsConnected: DisplayPort A link not detected
1414KERN: intel_extreme: Probing DisplayPort 2intel_extreme: IsConnected: DisplayPort B PortRegister: 0x5004100
1415KERN: intel_extreme: IsConnected: DisplayPort B link not detected
1416KERN: intel_extreme: Probing DisplayPort 3intel_extreme: IsConnected: DisplayPort C PortRegister: 0x5004200
1417KERN: intel_extreme: IsConnected: DisplayPort C link not detected
1418KERN: intel_extreme: Probing DisplayPort 4intel_extreme: IsConnected: DisplayPort D PortRegister: 0x5004300
1419KERN: intel_extreme: IsConnected: DisplayPort D link not detected
1420KERN: intel_extreme: Probing DDI 1intel_extreme: IsConnected: Digital Display Interface A PortRegister: 0x2004000
1421KERN: intel_extreme: IsConnected: Digital Display Interface A Maximum Lanes: 4
1422KERN: intel_extreme: CALLED virtual status_t Port::GetEDID(edid1_info*, bool)
1423KERN: intel_extreme: Digital Display Interface A: trying to read EDID
1424KERN: intel_extreme: Digital Display Interface A: no DDC register found
1425KERN: intel_extreme: Probing DDI 2intel_extreme: IsConnected: Digital Display Interface B PortRegister: 0x2004100
1426KERN: intel_extreme: IsConnected: Digital Display Interface B link not detected
1427KERN: intel_extreme: Probing DDI 3intel_extreme: IsConnected: Digital Display Interface C PortRegister: 0x2004200
1428KERN: intel_extreme: IsConnected: Digital Display Interface C link not detected
1429KERN: intel_extreme: Probing DDI 4intel_extreme: IsConnected: Digital Display Interface D PortRegister: 0x2004300
1430KERN: intel_extreme: IsConnected: Digital Display Interface D link not detected
1431KERN: intel_extreme: Probing DDI 5intel_extreme: IsConnected: Digital Display Interface E PortRegister: 0x2004400
1432KERN: intel_extreme: IsConnected: Digital Display Interface E link not detected
1433KERN: intel_extreme: Probing eDPintel_extreme: Probing HDMI 2intel_extreme: IsConnected: HDMI B PortRegister: 0x5001140
1434KERN: intel_extreme: Probing HDMI 3intel_extreme: IsConnected: HDMI C PortRegister: 0x5001150
1435KERN: intel_extreme: Probing HDMI 4intel_extreme: IsConnected: HDMI D PortRegister: 0x5001160
1436KERN: intel_extreme: Probing DVIintel_extreme: Probing LVDSintel_extreme: IsConnected: LVDS C PortRegister: 0x5001180
1437KERN: intel_extreme: LVDS: Not detected
1438KERN: intel_extreme: Probing Analogintel_extreme: IsConnected: Analog A PortRegister: 0x5001100
1439KERN: intel_extreme: CALLED virtual status_t Port::GetEDID(edid1_info*, bool)
1440KERN: intel_extreme: Analog A: trying to read EDID
1441KERN: intel_extreme: Analog A: using ddc @ 0x4005010
1442KERN: DDC: ddc2_read: DDC information read failure
1443KERN: Last message repeated 2 times.
1444KERN: [33musb_davicom:[0m00.06.835:init_driver::ver.0.9.5
1445KERN: DDC: ddc2_read: DDC information read failure
1446KERN: loaded driver /boot/system/add-ons/kernel/drivers/dev/net/usb_davicom
1447KERN: intel_extreme: Analog A: no EDID information found.
1448KERN: intel_extreme: Probing complete.intel_extreme: dump_ports: Connected ports: (port_count: 1)
1449KERN: intel_extreme: IsConnected: Digital Display Interface A PortRegister: 0x2004000
1450KERN: intel_extreme: IsConnected: Digital Display Interface A Maximum Lanes: 4
1451KERN: intel_extreme: port 0: Digital Display Interface A connected
1452KERN: intel_extreme: IsConnected: Digital Display Interface A PortRegister: 0x2004000
1453KERN: intel_extreme: IsConnected: Digital Display Interface A Maximum Lanes: 4
1454KERN: intel_extreme: CALLED status_t Port::SetPipe(Pipe*)
1455KERN: intel_extreme: SetPipe: Assigning Digital Display Interface A (0x2004000) to pipe A
1456KERN: intel_extreme: CALLED bool Pipe::IsEnabled()
1457KERN: intel_extreme: CALLED status_t create_mode_list()
1458KERN: intel_extreme: CALLED virtual status_t Port::GetEDID(edid1_info*, bool)
1459KERN: intel_extreme: Digital Display Interface A: no EDID information found.
1460KERN: Test: and [file_exists [/system/bin/FirstBootPrompt], or [not [file_exists [/boot/home/config/settings/Locale settings]], readonly ]] -> 0
1461KERN: sis19x:00.06.873:init_hardware::SiS19X:init_hardware()
1462KERN: intel_extreme: CALLED status_t intel_get_edid_info(void*, size_t, uint32*)
1463KERN: intel_extreme: intel_set_display_mode(1920x1200)
1464KERN: pci_reserve_device(0, 25, 0, ipro1000)
1465KERN: if_initname(0xffffffff97be8800, em, 32)
1466KERN: [ipro1000] ipro1000: /dev/net/ipro1000/0
1467KERN: DRVMEDia[ipro1000] (em) attach_pre capping queues at 1
1468KERN: [ipro1000] (em) bus_alloc_resource(3, [16], 0x0, 0xffffffffffffffff, 0x1,0x2)
1469KERN: set MTRRs to:
1470KERN: mtrr: 0: base: 0xdcc00000, size: 0x200000, type: 0
1471KERN: mtrr: 1: base: 0xdce00000, size: 0x80000, type: 0
1472KERN: mtrr: 2: base: 0xdcec0000, size: 0x20000, type: 0
1473KERN: mtrr: 3: base: 0xdcee0000, size: 0x10000, type: 0
1474KERN: mtrr: 4: base: 0xdcef0000, size: 0x8000, type: 0
1475KERN: mtrr: 5: base: 0xdcefe000, size: 0x1000, type: 0
1476KERN: mtrr: 6: base: 0xf0000000, size: 0x10000000, type: 0
1477KERN: mtrr: 7: base: 0xe0000000, size: 0x20000000, type: 1
1478KERN: [ipro1000] (em) bus_alloc_resource(3, [20], 0x0, 0xffffffffffffffff, 0x1,0x2)
1479KERN: set MTRRs to:
1480KERN: mtrr: 0: base: 0xdcc00000, size: 0x200000, type: 0
1481KERN: mtrr: 1: base: 0xdce00000, size: 0x80000, type: 0
1482KERN: mtrr: 2: base: 0xdcec0000, size: 0x20000, type: 0
1483KERN: mtrr: 3: base: 0xdcee0000, size: 0x10000, type: 0
1484KERN: mtrr: 4: base: 0xdcef0000, size: 0x8000, type: 0
1485KERN: mtrr: 5: base: 0xdcefe000, size: 0x1000, type: 0
1486KERN: mtrr: 6: base: 0xf0000000, size: 0x10000000, type: 0
1487KERN: mtrr: 7: base: 0xe0000000, size: 0x20000000, type: 1
1488KERN: intel_extreme: IsConnected: Digital Display Interface A PortRegister: 0x2004000
1489KERN: intel_extreme: IsConnected: Digital Display Interface A Maximum Lanes: 4
1490KERN: intel_extreme: Power: Digital Display Interface A DDI enabled: false
1491KERN: intel_extreme: CALLED void Pipe::Enable(bool)
1492KERN: [36mAGP:[0m create memory 0xffffffff991eed40, base ffffffffa0100000, size 8ca000, flags 0
1493KERN: [36mAGP:[0m allocate 9216000 bytes out of 9216000
1494KERN: [36mAGP:[0m bind 9216000 bytes at ffffffffa0100000
1495KERN: intel_extreme: IsConnected: Digital Display Interface A PortRegister: 0x2004000
1496KERN: intel_extreme: IsConnected: Digital Display Interface A Maximum Lanes: 4
1497KERN: intel_extreme: SetDisplayMode: Digital Display Interface A 1920x1200
1498KERN: intel_extreme: CALLED status_t FDILink::Train(display_mode*)
1499KERN: intel_extreme: Train: FDI Link Lanes: 3
1500KERN: intel_extreme: CALLED void FDIReceiver::EnablePLL(uint32)
1501KERN: intel_extreme: CALLED void FDIReceiver::SwitchClock(bool)
1502KERN: intel_extreme: CALLED void FDITransmitter::EnablePLL(uint32)
1503KERN: intel_extreme: CALLED status_t FDILink::_AutoTrain(uint32)
1504KERN: intel_extreme: _AutoTrain: FDI auto train failed!
1505KERN: intel_extreme: Train: FDI training fault.
1506KERN: intel_extreme: compute_dpll_g4x: required MHz: 193.156, reference clock: 120
1507KERN: intel_extreme: PLL limits, min: p 5 (p1 1, p2 5), n 3, m 79 (m1 12, m2 5)
1508KERN: intel_extreme: PLL limits, max: p 80 (p1 8, p2 10), n 8, m 118 (m1 22, m2 9)
1509KERN: intel_extreme: compute_dpll_g4x: best MHz: 193.714 (error: 0.558273)
1510KERN: intel_extreme: compute_pll_divisors: found: p = 10 (p1 = 1, p2 = 10), n = 7, m = 113 (m1 = 19, m2 = 6)
1511KERN: intel_extreme: CALLED void Pipe::ConfigureClocks(const pll_divisors&, uint32, uint32)
1512KERN: intel_extreme: CALLED void Pipe::ConfigureTimings(display_mode*)
1513KERN: intel_extreme: ConfigureTimings: fPipeOffset: 0x0
1514KERN: intel_extreme: CALLED void Pipe::_ConfigureTranscoder(display_mode*)
1515KERN: intel_extreme: _ConfigureTranscoder: fPipeOffset: 0x0
1516KERN: intel_extreme: intel_set_display_mode: Port configuration completed successfully!
1517KERN: intel_extreme: IsConnected: Digital Display Interface A PortRegister: 0x2004000
1518KERN: intel_extreme: IsConnected: Digital Display Interface A Maximum Lanes: 4
1519KERN: intel_extreme: Power: Digital Display Interface A DDI enabled: true
1520KERN: intel_extreme: CALLED void Pipe::Enable(bool)
1521KERN: intel_extreme: CALLED status_t intel_get_frame_buffer_config(frame_buffer_config*)
1522KERN: [ipro1000] (em) Using 1024 TX descriptors and 1024 RX descriptors
1523KERN: [ipro1000] (em) msix_init qsets capped at 1
1524KERN: allocate_io_interrupt_vectors: allocated 1 vectors starting from 43
1525KERN: msi_allocate_vectors: allocated 1 vectors starting from 43
1526KERN: [ipro1000] (em) Using an MSI interrupt
1527KERN: [ipro1000] (em) allocated for 1 tx_queues
1528KERN: [ipro1000] (em) allocated for 1 rx_queues
1529KERN: [ipro1000] (em) bus_alloc_resource(1, [1], 0x0, 0xffffffffffffffff, 0x1,0x6)
1530KERN: msi enabled: 0x0081
1531KERN: if_attach 0xffffffff98eedd20
1532KERN: ifmedia_add: Adding Entry...
1533KERN: Type: Ethernet
1534KERN: SubType: 10baseT/UTP
1535KERN: ifmedia_add: Adding Entry...
1536KERN: Type: Ethernet
1537KERN: SubType: 10baseT/UTP
1538KERN: Shared Option[0]: full-duplex
1539KERN: ifmedia_add: Adding Entry...
1540KERN: Type: Ethernet
1541KERN: SubType: 100baseTX
1542KERN: ifmediaKERN: _add: Adding Entry...
1543KERN: Type: Ethernet
1544KERN: SubType: 100baseTX
1545KERN: Shared Option[0]: full-duplex
1546KERN: ifmedia_add: Adding Entry...
1547KERN: Type: Ethernet
1548KERN: SubType: 1000baseT
1549KERN: Shared Option[0]: full-duplex
1550KERN: ifmedia_add: Adding Entry...
1551KERN: Type: Ethernet
1552KERN: SubType: 1000baseT
1553KERN: ifmedia_add: Adding Entry...
1554KERN: Type: Ethernet
1555KERN: SubType: autoselect
1556KERN: ifmedia_set: target Type: Ethernet
1557KERN: SubType: autoselect
1558KERN: ifmedia_set: setting to Type: Ethernet
1559KERN: SubType: autoselect
1560KERN: ahci: sg_memcpy phyAddr 0xedab7bc, size 8
1561KERN: ahci: sg_memcpy phyAddr 0xedab73c, size 8
1562KERN: bfs: mounted "Singularity" (root node at 524288, device = /dev/disk/scsi/0/0/0/3)
1563KERN: ahci: sg_memcpy phyAddr 0xedab7bc, size 8
1564KERN: ahci: sg_memcpy phyAddr 0xedab73c, size 8
1565KERN: bfs: mounted "Ports" (root node at 524288, device = /dev/disk/scsi/0/0/0/2)
1566KERN: ahci: sg_memcpy phyAddr 0xedab7bc, size 8
1567KERN: ahci: sg_memcpy phyAddr 0xedab73c, size 8
1568KERN: bfs: mounted "Data" (root node at 524288, device = /dev/disk/scsi/0/0/0/4)
1569KERN: ipro1000: init_driver(0xffffffff92a782d0)
1570KERN: loaded driver /boot/system/add-ons/kernel/drivers/dev/net/ipro1000
1571KERN: loaded driver /boot/system/add-ons/kernel/drivers/dev/input/usb_hid
1572KERN: ps2_hid: init_hardware
1573KERN: ps2_hid: init_driver
1574KERN: ps2_hid: publish_devices
1575KERN: ps2_hid: uninit_driver
1576KERN: loaded driver /boot/system/add-ons/kernel/drivers/dev/input/ps2_hid
1577KERN: pci_reserve_device(3, 0, 0, idualwifi7260)
1578KERN: [idualwifi7260] (iwm) bus_alloc_resource(3, [16], 0x0, 0xffffffffffffffff, 0x1,0x2)
1579KERN: set MTRRs to:
1580KERN: mtrr: 0: base: 0xdcc00000, size: 0x200000, type: 0
1581KERN: mtrr: 1: base: 0xdce00000, size: 0x80000, type: 0
1582KERN: mtrr: 2: base: 0xdcec0000, size: 0x20000, type: 0
1583KERN: mtrr: 3: base: 0xdcee0000, size: 0x10000, type: 0
1584KERN: mtrr: 4: base: 0xdcef0000, size: 0x8000, type: 0
1585KERN: mtrr: 5: base: 0xdcefe000, size: 0x1000, type: 0
1586KERN: mtrr: 6: base: 0xf0000000, size: 0x10000000, type: 0
1587KERN: mtrr: 7: base: 0xe0000000, size: 0x20000000, type: 1
1588KERN: allocate_io_interrupt_vectors: allocated 1 vectors starting from 44
1589KERN: msi_allocate_vectors: allocated 1 vectors starting from 44
1590KERN: [idualwifi7260] (iwm) bus_alloc_resource(1, [1], 0x0, 0xffffffffffffffff, 0x1,0x2)
1591KERN: msi enabled: 0x0081
1592KERN: slab memory manager: created area 0xffffffff9a001000 (5189)
1593KERN: bfs: bfs_create_index:2174: File or Directory already exists
1594KERN: Last message repeated 59 times.
1595KERN: register_domain(4, link)
1596KERN: ps2: devfs_publish_device input/touchpad/ps2/synaptics_0, status = 0x00000000
1597KERN: ps2: devfs_publish_device input/keyboard/at/0, status = 0x00000000
1598KERN: package_daemon [8188959: 544] KERN: Failed to open packages activation file: No such file or directory
1599KERN: package_daemon [8189341: 544] KERN: Failed to get activated packages info from activated packages file. Assuming all package files in package directory are activated.
1600KERN: package_daemon [8190130: 544] latest volume state:
1601KERN: package_daemon [8190338: 544] active package: "gcc-8.3.0_2019_05_24-7-x86_64.hpkg"
1602KERN: package_daemon [8190651: 544] active package: "rtmpdump-2.4_20161210-4-x86_64.hpkg"
1603KERN: package_daemon [8190969: 544] KERN: active package: "opencl_headers-2.2~20180318-3-x86_64.hpkg"
1604KERN: package_daemon [8191311: 544] KERN: active package: "opus-1.3.1-1-x86_64.hpkg"
1605KERN: package_daemon [8191592: 544] active package: "ilmbase_devel-2.2.1-2-x86_64.hpkg"
1606KERN: package_daemon [8191900: 544] KERN: active package: "libgphoto2_devel-2.5.19-1-x86_64.hpkg"
1607KERN: package_daemon [8192224: 544] KERN: active package: "libexif-0.6.21-2-x86_64.hpkg"
1608KERN: package_daemon [8192517: 544] KERN: active package: "pyqt_python3-5.13.1-1-x86_64.hpkg"
1609KERN: package_daemon [8192828: 544] active package: "gzip-1.10-1-x86_64.hpkg"
1610KERN: package_daemon [8193105: 544] active package: "sdl_gfx-2.0.26-2-x86_64.hpkg"
1611KERN: package_daemon [8193399: 544] active package: "git_daemon-2.23.0-1-x86_64.hpkg"
1612KERN: package_daemon [8193705: 544] active package: "gitdb_python3-0.6.4-2-any.hpkg"
1613KERN: package_daemon [8194003: 544] KERN: active package: "orc-0.4.29-1-x86_64.hpkg"
1614KERN: package_daemon [8194280: 544] KERN: active package: "smpeg-0.4.5-7-x86_64.hpkg"
1615KERN: package_daemon [8194563: 544] KERN: active package: "argh_python3-0.26.2-2-any.hpkg"
1616KERN: package_daemon [8194866: 544] KERN: active package: "sdl_ttf_devel-2.0.11-7-x86_64.hpkg"
1617KERN: package_daemon [8195187: 544] active package: "tcpdump-4.9.2-1-x86_64.hpkg"
1618KERN: package_daemon [8195479: 544] active package: "mkdepend-1.7-5-x86_64.hpkg"
1619KERN: package_daemon [8195761: 544] KERN: active package: "taglib-1.11.1-4-x86_64.hpkg"
1620KERN: package_daemon [8196050: 544] KERN: active package: "qsystray-0.1-5-x86_64.hpkg"
1621KERN: package_daemon [8196335: 544] KERN: active package: "numpy_python-1.16.5-1-x86_64.hpkg"
1622KERN: package_daemon [8196652: 544] active package: "sdl_ttf-2.0.11-7-x86_64.hpkg"
1623KERN: package_daemon [8196941: 544] KERN: active package: "lcov-1.13-1-any.hpkg"
1624KERN: package_daemon [8197204: 544] KERN: active package: "ecdsa_python3-0.13.2-1-any.hpkg"
1625KERN: package_daemon [8197509: 544] KERN: active package: "kauth-5.55.0-2-x86_64.hpkg"
1626KERN: package_daemon [8197796: 544] KERN: active package: "libexif_devel-0.6.21-2-x86_64.hpkg"
1627KERN: package_daemon [8198117: 544] active package: "fluidsynth2-2.0.7-2-x86_64.hpkg"
1628KERN: package_daemon [8198423: 544] active package: "pip_python3-19.2.3-1-any.hpkg"
1629KERN: package_daemon [8198716: 544] KERN: active package: "unittest++-2.0.0-1-x86_64.hpkg"
1630KERN: package_daemon [8199015: 544] KERN: active package: "openblas_devel-0.3.6-1-x86_64.hpkg"
1631KERN: package_daemon [8199331: 544] KERN: active package: "nano-4.4-1-x86_64.hpkg"
1632KERN: package_daemon [8199605: 544] KERN: active package: "libmikmod-3.3.11.1-1-x86_64.hpkg"
1633KERN: package_daemon [8199917: 544] active package: "beautifulsoup_python3-4.8.0-1-any.hpkg"
1634KERN: package_daemon [8200249: 544] active package: "markupsafe_python3-1.1.1-1-x86_64.hpkg"
1635KERN: package_daemon [8200575: 544] KERN: active package: "tiff4-4.0.10-1-x86_64.hpkg"
1636KERN: package_daemon [8200859: 544] KERN: active package: "unittest++_devel-2.0.0-1-x86_64.hpkg"
1637KERN: package_daemon [8201182: 544] KERN: active package: "libtool-2.4.6-1-x86_64.hpkg"
1638KERN: package_daemon [8201475: 544] KERN: active package: "twolame-0.3.13-4-x86_64.hpkg"
1639KERN: package_daemon [8201764: 544] KERN: active package: "libcddb_devel-1.3.2-3-x86_64.hpkg"
1640KERN: package_daemon [8202071: 544] KERN: active package: "sip_pyqt_python3-4.19.19-1-x86_64.hpkg"
1641KERN: package_daemon [8202402: 544] active package: "funcsigs_python3-1.0.2-2-any.hpkg"
1642KERN: package_daemon [8202720: 544] active package: "mpd-0.21.15-1-x86_64.hpkg"
1643KERN: package_daemon [8202999: 544] KERN: active package: "jinja_python3-2.10.1-1-any.hpkg"
1644KERN: package_daemon [8203301: 544] KERN: active package: "unzip-6.10c23-4-x86_64.hpkg"
1645KERN: package_daemon [8203592: 544] KERN: active package: "apr_devel-1.6.5-1-x86_64.hpkg"
1646KERN: package_daemon [8203906: 544] active package: "cryptography_vectors_python36-2.7-1-any.hpkg"
1647KERN: package_daemon [8204265: 544] active package: "gflags-2.2.1-2-x86_64.hpkg"
1648KERN: package_daemon [8204559: 544] active package: "haiku-r1~beta1_hrev53523-1-x86_64.hpkg"
1649KERN: package_daemon [8204885: 544] KERN: active package: "click_python-8.0.1-1-any.hpkg"
1650KERN: package_daemon [8205180: 544] KERN: active package: "libidn-1.35-1-x86_64.hpkg"
1651KERN: package_daemon [8205472: 544] active package: "certifi_python36-2019.9.11-1-any.hpkg"
1652KERN: package_daemon [8205808: 544] active package: "kbookmarks-5.55.0-2-x86_64.hpkg"
1653KERN: package_daemon [8206109: 544] KERN: active package: "libopenshot_python3-0.2.3-4-x86_64.hpkg"
1654KERN: package_daemon [8206440: 544] KERN: active package: "wavpack_bin-5.1.0-2-x86_64.hpkg"
1655KERN: package_daemon [8206747: 544] active package: "apr_util_devel-1.6.1-1-x86_64.hpkg"
1656KERN: package_daemon [8207066: 544] KERN: active package: "nasm-2.12.02-1-x86_64.hpkg"
1657KERN: package_daemon [8207353: 544] active package: "superlu-5.2.1-3-x86_64.hpkg"
1658KERN: package_daemon [8207642: 544] KERN: active package: "libidn_devel-1.35-1-x86_64.hpkg"
1659KERN: package_daemon [8207941: 544] KERN: active package: "game_music_emu-0.6.2-2-x86_64.hpkg"
1660KERN: package_daemon [8208257: 544] active package: "x265-3.0-1-x86_64.hpkg"
1661KERN: package_daemon [8208528: 544] KERN: active package: "pycurl_python3-7.43.0.2-4-x86_64.hpkg"
1662KERN: package_daemon [8208855: 544] KERN: active package: "argh_python-0.26.2-2-any.hpkg"
1663KERN: package_daemon [8209148: 544] KERN: active package: "smpeg_devel-0.4.5-7-x86_64.hpkg"
1664KERN: package_daemon [8209454: 544] active package: "vision-0.10.3-2-x86_64.hpkg"
1665KERN: package_daemon [8209746: 544] KERN: active package: "mp3gain-1.5.2-1-x86_64.hpkg"
1666KERN: package_daemon [8210039: 544] KERN: active package: "ncurses6-6.1-1-x86_64.hpkg"
1667KERN: package_daemon [8210330: 544] KERN: active package: "suitesparse-5.3.0-2-x86_64.hpkg"
1668KERN: package_daemon [8210631: 544] KERN: active package: "haikuwebkit-1.6.9-1-x86_64.hpkg"
1669KERN: package_daemon [8210938: 544] active package: "kglobalaccel-5.55.0-2-x86_64.hpkg"
1670KERN: package_daemon [8211254: 544] active package: "rhash-1.3.8-2-x86_64.hpkg"
1671KERN: package_daemon [8211541: 544] KERN: active package: "c_blosc_devel-1.17.0-1-x86_64.hpkg"
1672KERN: package_daemon [8211855: 544] KERN: active package: "flacon-5.5.1-1-x86_64.hpkg"
1673KERN: package_daemon [8212138: 544] KERN: active package: "haiku_loader-r1~beta1_hrev53523-1-x86_64.hpkg"
1674KERN: package_daemon [8212496: 544] active package: "kcodecs-5.55.0-2-x86_64.hpkg"
1675KERN: package_daemon [8212794: 544] KERN: active package: "opusfile-0.11-1-x86_64.hpkg"
1676KERN: package_daemon [8213082: 544] KERN: active package: "soxr_devel-0.1.3-1-x86_64.hpkg"
1677KERN: package_daemon [8213383: 544] KERN: active package: "netcat-1.10-4-x86_64.hpkg"
1678KERN: package_daemon [8213668: 544] KERN: active package: "libexecinfo_devel-1.1-5-x86_64.hpkg"
1679KERN: package_daemon [8213991: 544] active package: "icu-57.1-3-x86_64.hpkg"
1680KERN: package_daemon [8214261: 544] KERN: active package: "kguiaddons-5.55.0-2-x86_64.hpkg"
1681KERN: package_daemon [8214568: 544] active package: "attrs_python-19.2.0-1-any.hpkg"
1682KERN: package_daemon [8214871: 544] KERN: active package: "gst_plugins_base_devel-1.16.0-1-x86_64.hpkg"
1683KERN: package_daemon [8215222: 544] KERN: active package: "webpositive-r1~beta1_hrev53523-1-x86_64.hpkg"
1684KERN: package_daemon [8215576: 544] KERN: active package: "jsoncpp-1.9.1-1-x86_64.hpkg"
1685KERN: package_daemon [8215870: 544] KERN: active package: "tbb-2018.5-1-x86_64.hpkg"
1686KERN: package_daemon [8216166: 544] KERN: active package: "ilmbase-2.2.1-2-x86_64.hpkg"
1687KERN: package_daemon [8216476: 544] KERN: active package: "ki18n-5.55.0-2-x86_64.hpkg"
1688KERN: package_daemon [8216759: 544] KERN: active package: "glib2-2.62.0-1-x86_64.hpkg"
1689KERN: package_daemon [8217048: 544] KERN: active package: "orc_devel-0.4.29-1-x86_64.hpkg"
1690KERN: package_daemon [8217383: 544] active package: "libcdio1-2.0.0-3-x86_64.hpkg"
1691KERN: package_daemon [8217679: 544] active package: "makefile_engine-r1~beta1_hrev53523-1-any.hpkg"
1692KERN: package_daemon [8218047: 544] active package: "help2man-1.47.5-1-x86_64.hpkg"
1693KERN: package_daemon [8218359: 544] active package: "libid3tag-0.15.1b-6-x86_64.hpkg"
1694KERN: package_daemon [8218661: 544] KERN: active package: "cryptography_vectors_python3-2.7-1-any.hpkg"
1695KERN: package_daemon [8219026: 544] KERN: active package: "nettle-3.4.1-1-x86_64.hpkg"
1696KERN: package_daemon [8219315: 544] KERN: active package: "jsoncpp_devel-1.9.1-1-x86_64.hpkg"
1697KERN: package_daemon [8219629: 544] KERN: active package: "lapack-3.8.0-6-x86_64.hpkg"
1698KERN: package_daemon [8219920: 544] active package: "kiconthemes-5.55.0-2-x86_64.hpkg"
1699KERN: package_daemon [8220225: 544] KERN: active package: "mpfr_devel-3.1.6-3-x86_64.hpkg"
1700KERN: package_daemon [8220525: 544] KERN: active package: "libcdio1_devel-2.0.0-3-x86_64.hpkg"
1701KERN: package_daemon [8220843: 544] KERN: active package: "funcsigs_python-1.0.2-2-any.hpkg"
1702KERN: package_daemon [8221154: 544] KERN: active package: "libjpeg_turbo-2.0.3-1-x86_64.hpkg"
1703KERN: package_daemon [8221466: 544] KERN: active package: "ecdsa_python-0.13.2-1-any.hpkg"
1704KERN: package_daemon [8221766: 544] KERN: active package: "freetype_devel-2.9.1-1-x86_64.hpkg"
1705KERN: package_daemon [8222083: 544] KERN: active package: "gflags_devel-2.2.1-2-x86_64.hpkg"
1706KERN: package_daemon [8222391: 544] KERN: active package: "boost163-1.63.0-4-x86_64.hpkg"
1707KERN: package_daemon [8222692: 544] KERN: active package: "mpg123_devel-1.25.12-1-x86_64.hpkg"
1708KERN: package_daemon [8223008: 544] KERN: active package: "libotr-4.1.1-1-x86_64.hpkg"
1709KERN: package_daemon [8223293: 544] KERN: active package: "kio-5.55.0-2-x86_64.hpkg"
1710KERN: package_daemon [8223569: 544] KERN: active package: "beautifulsoup_python-4.8.0-1-any.hpkg"
1711KERN: package_daemon [8223898: 544] active package: "asn1crypto_python-0.24.0-2-any.hpkg"
1712KERN: package_daemon [8224219: 544] KERN: active package: "aspell-0.60.6.1-5-x86_64.hpkg"
1713KERN: package_daemon [8224519: 544] KERN: active package: "libopusenc-0.2.1-1-x86_64.hpkg"
1714KERN: package_daemon [8224820: 544] KERN: active package: "noto-20170920-3-any.hpkg"
1715KERN: package_daemon [8225096: 544] KERN: active package: "gcc_fortran-8.3.0_2019_05_24-7-x86_64.hpkg"
1716KERN: package_daemon [8225443: 544] KERN: active package: "libgcrypt-1.8.5-1-x86_64.hpkg"
1717KERN: package_daemon [8225742: 544] KERN: active package: "libotr_devel-4.1.1-1-x86_64.hpkg"
1718KERN: package_daemon [8226050: 544] KERN: active package: "jasper-2.0.16-1-x86_64.hpkg"
1719KERN: package_daemon [8226342: 544] KERN: active package: "kitemviews-5.55.0-2-x86_64.hpkg"
1720KERN: package_daemon [8226643: 544] KERN: active package: "certifi_python3-2019.9.11-1-any.hpkg"
1721KERN: package_daemon [8226970: 544] KERN: active package: "gcc_syslibs_devel-8.3.0_2019_05_24-7-x86_64.hpkg"
1722KERN: package_daemon [8227353: 544] KERN: active package: "libxml2-2.9.9-4-x86_64.hpkg"
1723KERN: package_daemon [8227645: 544] KERN: active package: "libmodplug-0.8.9.0-1-x86_64.hpkg"
1724KERN: package_daemon [8227950: 544] KERN: active package: "libjpeg_turbo_devel-2.0.3-1-x86_64.hpkg"
1725KERN: package_daemon [8228286: 544] active package: "hunspell-1.7.0-1-x86_64.hpkg"
1726KERN: package_daemon [8228582: 544] KERN: active package: "kcompletion-5.55.0-2-x86_64.hpkg"
1727KERN: package_daemon [8228896: 544] KERN: active package: "subversion_devel-1.9.7-2-x86_64.hpkg"
1728KERN: package_daemon [8229218: 544] KERN: active package: "opus_tools-0.2-1-x86_64.hpkg"
1729KERN: package_daemon [8229509: 544] KERN: active package: "docutils_python3-0.15.2-1-any.hpkg"
1730KERN: package_daemon [8229827: 544] active package: "docutils_python-0.15.2-1-any.hpkg"
1731KERN: package_daemon [8230143: 544] KERN: active package: "superlu_devel-5.2.1-3-x86_64.hpkg"
1732KERN: package_daemon [8230454: 544] KERN: active package: "jpeg-9c-2-x86_64.hpkg"
1733KERN: package_daemon [8230722: 544] KERN: active package: "kjobwidgets-5.55.0-2-x86_64.hpkg"
1734KERN: package_daemon [8231031: 544] KERN: active package: "libuv-1.29.1-4-x86_64.hpkg"
1735KERN: package_daemon [8231322: 544] active package: "unrar-5.8.1-1-x86_64.hpkg"
1736KERN: package_daemon [8231604: 544] KERN: active package: "asn1crypto_python3-0.24.0-2-any.hpkg"
1737KERN: package_daemon [8231928: 544] active package: "libmodplug_devel-0.8.9.0-1-x86_64.hpkg"
1738KERN: package_daemon [8232258: 544] KERN: active package: "wpa_supplicant-2.7~devel.haiku.1-1-x86_64.hpkg"
1739KERN: package_daemon [8232620: 544] KERN: active package: "libedit-20180525_3.1-2-x86_64.hpkg"
1740KERN: package_daemon [8232935: 544] KERN: active package: "aiodns_python36-1.1.1-1-any.hpkg"
1741KERN: package_daemon [8233240: 544] KERN: active package: "hdf5-1.10.5-1-x86_64.hpkg"
1742KERN: package_daemon [8233522: 544] KERN: active package: "noto_sans_cjk_jp-1.004-2-any.hpkg"
1743KERN: package_daemon [8233837: 544] KERN: active package: "imagemagick-6.9.10.62-1-x86_64.hpkg"
1744KERN: package_daemon [8234158: 544] KERN: active package: "tbb_devel-2018.5-1-x86_64.hpkg"
1745KERN: package_daemon [8234462: 544] active package: "kparts-5.55.0-2-x86_64.hpkg"
1746KERN: package_daemon [8234750: 544] KERN: active package: "libyajl-2.1.0-3-x86_64.hpkg"
1747KERN: package_daemon [8235042: 544] active package: "gitpython_python3-3.0.2-1-any.hpkg"
1748KERN: package_daemon [8235359: 544] KERN: active package: "bzip2-1.0.8-1-x86_64.hpkg"
1749KERN: package_daemon [8235646: 544] KERN: active package: "audiofile_devel-0.3.6-6-x86_64.hpkg"
1750KERN: package_daemon [8235967: 544] KERN: active package: "neofetch-6.1.0-2-any.hpkg"
1751KERN: package_daemon [8236253: 544] KERN: active package: "xz_utils-5.2.4-2-x86_64.hpkg"
1752KERN: package_daemon [8236565: 544] KERN: active package: "cryptography_vectors_python-2.7-1-any.hpkg"
1753KERN: package_daemon [8236925: 544] active package: "libusb_devel-1.0.22-4-x86_64.hpkg"
1754KERN: package_daemon [8237234: 544] KERN: active package: "sdl2_mixer-2.0.4-2-x86_64.hpkg"
1755KERN: package_daemon [8237550: 544] KERN: active package: "zlib-1.2.11-3-x86_64.hpkg"
1756KERN: package_daemon [8237836: 544] KERN: active package: "boost163_devel-1.63.0-4-x86_64.hpkg"
1757KERN: package_daemon [8238157: 544] KERN: active package: "kservice-5.55.0-2-x86_64.hpkg"
1758KERN: package_daemon [8238457: 544] KERN: active package: "llvm8_libs-8.0.0-1-x86_64.hpkg"
1759KERN: package_daemon [8238755: 544] KERN: active package: "libvpx-1.7.0-3-x86_64.hpkg"
1760KERN: package_daemon [8239042: 544] KERN: active package: "game_music_emu_devel-0.6.2-2-x86_64.hpkg"
1761KERN: package_daemon [8239381: 544] KERN: active package: "mpfr-3.1.6-3-x86_64.hpkg"
1762KERN: package_daemon [8239663: 544] KERN: active package: "aspell_en-2018.04.16~0-1-any.hpkg"
1763KERN: package_daemon [8239978: 544] active package: "zip-3.0-4-x86_64.hpkg"
1764KERN: package_daemon [8240244: 544] KERN: active package: "libpcre-8.43-1-x86_64.hpkg"
1765KERN: package_daemon [8240531: 544] KERN: active package: "db61-6.1.23-3-x86_64.hpkg"
1766KERN: package_daemon [8240817: 544] active package: "zstd-1.4.3-1-x86_64.hpkg"
1767KERN: package_daemon [8241100: 544] KERN: active package: "libffi_devel-3.2.1-4-x86_64.hpkg"
1768KERN: package_daemon [8241405: 544] KERN: active package: "cssselect_python-1.1.0-1-any.hpkg"
1769KERN: package_daemon [8241717: 544] KERN: active package: "ktextwidgets-5.55.0-2-x86_64.hpkg"
1770KERN: package_daemon [8242030: 544] KERN: active package: "lcms-2.9-2-x86_64.hpkg"
1771KERN: package_daemon [8242306: 544] KERN: active package: "llvm8-8.0.0-1-x86_64.hpkg"
1772KERN: package_daemon [8242593: 544] active package: "certifi_python-2019.9.11-1-any.hpkg"
1773KERN: package_daemon [8242909: 544] KERN: active package: "autoconf-2.69-8-x86_64.hpkg"
1774KERN: package_daemon [8243199: 544] KERN: active package: "gstreamer_devel-1.16.0-1-x86_64.hpkg"
1775KERN: package_daemon [8243526: 544] KERN: active package: "asn1crypto_python36-0.24.0-2-any.hpkg"
1776KERN: package_daemon [8243854: 544] KERN: active package: "openshot-2.4.4-4-any.hpkg"
1777KERN: package_daemon [8244140: 544] KERN: active package: "kconfig-5.55.0-2-x86_64.hpkg"
1778KERN: package_daemon [8244431: 544] KERN: active package: "db61_devel-6.1.23-3-x86_64.hpkg"
1779KERN: package_daemon [8244735: 544] KERN: active package: "gawk-5.0.1-1-x86_64.hpkg"
1780KERN: package_daemon [8245017: 544] KERN: active package: "kwidgetsaddons-5.55.0-2-x86_64.hpkg"
1781KERN: package_daemon [8245341: 544] active package: "sdl_mixer-1.2.12-7-x86_64.hpkg"
1782KERN: package_daemon [8245640: 544] KERN: active package: "automake-1.16.1-1-x86_64.hpkg"
1783KERN: package_daemon [8245940: 544] active package: "ocl_icd-2.2.12-1-x86_64.hpkg"
1784KERN: package_daemon [8246235: 544] KERN: active package: "libffi-3.2.1-4-x86_64.hpkg"
1785KERN: package_daemon [8246523: 544] KERN: active package: "python_imaging-1.1.7-3-x86_64.hpkg"
1786KERN: package_daemon [8246838: 544] KERN: active package: "sonnet-5.55.0-5-x86_64.hpkg"
1787KERN: package_daemon [8247130: 544] KERN: active package: "zlib_devel-1.2.11-3-x86_64.hpkg"
1788KERN: package_daemon [8247438: 544] KERN: active package: "leptonica-1.78.0-1-x86_64.hpkg"
1789KERN: package_daemon [8247735: 544] KERN: active package: "openexr-2.2.1-2-x86_64.hpkg"
1790KERN: package_daemon [8248028: 544] active package: "suitesparse_devel-5.3.0-2-x86_64.hpkg"
1791KERN: package_daemon [8248359: 544] KERN: active package: "findutils-4.7.0-1-x86_64.hpkg"
1792KERN: package_daemon [8248655: 544] active package: "kwindowsystem-5.55.0-2-x86_64.hpkg"
1793KERN: package_daemon [8248972: 544] KERN: active package: "pycparser_python36-2.19-2-any.hpkg"
1794KERN: package_daemon [8249302: 544] KERN: active package: "mpc_devel-1.1.0-1-x86_64.hpkg"
1795KERN: package_daemon [8249600: 544] active package: "ocl_icd_devel-2.2.12-1-x86_64.hpkg"
1796KERN: package_daemon [8249920: 544] KERN: active package: "coverage_python3-4.5.4-1-x86_64.hpkg"
1797KERN: package_daemon [8250239: 544] KERN: active package: "haiku_devel-r1~beta1_hrev53523-1-x86_64.hpkg"
1798KERN: package_daemon [8250594: 544] KERN: active package: "proj-5.2.0-1-x86_64.hpkg"
1799KERN: package_daemon [8250886: 544] KERN: active package: "webencodings_python-0.5.1-1-any.hpkg"
1800KERN: package_daemon [8251213: 544] KERN: active package: "leptonica_devel-1.78.0-1-x86_64.hpkg"
1801KERN: package_daemon [8251532: 544] KERN: active package: "libiconv-1.15-4-x86_64.hpkg"
1802KERN: package_daemon [8251825: 544] KERN: active package: "idna_python-2.8-1-any.hpkg"
1803KERN: package_daemon [8252135: 544] KERN: active package: "opus_devel-1.3.1-1-x86_64.hpkg"
1804KERN: package_daemon [8252458: 544] active package: "kxmlgui-5.55.0-2-x86_64.hpkg"
1805KERN: package_daemon [8252757: 544] KERN: active package: "libexecinfo-1.1-5-x86_64.hpkg"
1806KERN: package_daemon [8253062: 544] KERN: active package: "libraw_devel-0.19.5-1-x86_64.hpkg"
1807KERN: package_daemon [8253494: 544] KERN: active package: "pyzmq_python3-18.1.0-2-x86_64.hpkg"
1808KERN: package_daemon [8253852: 544] KERN: active package: "opencollada-1.6.68-1-x86_64.hpkg"
1809KERN: package_daemon [8254201: 544] active package: "feedparser_python36-5.2.1-2-any.hpkg"
1810KERN: package_daemon [8254528: 544] KERN: active package: "readline-7.0.3-4-x86_64.hpkg"
1811KERN: package_daemon [8254826: 544] KERN: active package: "openjpeg-2.3.1-2-x86_64.hpkg"
1812KERN: package_daemon [8255126: 544] KERN: active package: "opencv_devel-3.4.3-5-x86_64.hpkg"
1813KERN: package_daemon [8255449: 544] active package: "quicklaunch-1.3.3-1-x86_64.hpkg"
1814KERN: package_daemon [8255764: 544] active package: "sip_pyqt_python-4.19.19-1-x86_64.hpkg"
1815KERN: package_daemon [8256100: 544] active package: "httplib2_python3-0.14.0-1-any.hpkg"
1816KERN: package_daemon [8256419: 544] KERN: active package: "sdl2_mixer_devel-2.0.4-2-x86_64.hpkg"
1817KERN: package_daemon [8256747: 544] KERN: active package: "gettext_libintl-0.19.8.1-7-x86_64.hpkg"
1818KERN: package_daemon [8257084: 544] KERN: active package: "doxygen-1.8.14-1-x86_64.hpkg"
1819KERN: package_daemon [8257391: 544] KERN: active package: "dateutil_python36-2.8.0-2-any.hpkg"
1820KERN: package_daemon [8257714: 544] KERN: active package: "opencv_tools-3.4.3-5-x86_64.hpkg"
1821KERN: package_daemon [8258028: 544] KERN: active package: "glib2_devel-2.62.0-1-x86_64.hpkg"
1822KERN: package_daemon [8258349: 544] active package: "libupnp-1.6.22-1-x86_64.hpkg"
1823KERN: package_daemon [8258647: 544] active package: "bc-1.07.1-2-x86_64.hpkg"
1824KERN: package_daemon [8258929: 544] KERN: active package: "libcuefile-475-3-x86_64.hpkg"
1825KERN: package_daemon [8259227: 544] KERN: active package: "setuptools_python36-41.2.0-1-any.hpkg"
1826KERN: package_daemon [8259559: 544] active package: "urllib3_python3-1.25.6-1-any.hpkg"
1827KERN: package_daemon [8259871: 544] active package: "kconfigwidgets-5.55.0-2-x86_64.hpkg"
1828KERN: package_daemon [8260191: 544] active package: "libmtp-1.1.16-1-x86_64.hpkg"
1829KERN: package_daemon [8260478: 544] KERN: active package: "sqlite_devel-3.29.0.0-1-x86_64.hpkg"
1830KERN: package_daemon [8260794: 544] KERN: active package: "iso8601_python-0.1.12-2-any.hpkg"
1831KERN: package_daemon [8261102: 544] KERN: active package: "openimageio-2.0.10-1-x86_64.hpkg"
1832KERN: package_daemon [8261417: 544] active package: "opencv-3.4.3-5-x86_64.hpkg"
1833KERN: package_daemon [8261704: 544] active package: "libgpg_error-1.36-1-x86_64.hpkg"
1834KERN: package_daemon [8262010: 544] active package: "alembic-1.7.11-2-x86_64.hpkg"
1835KERN: package_daemon [8262300: 544] KERN: active package: "taglib_devel-1.11.1-4-x86_64.hpkg"
1836KERN: package_daemon [8262611: 544] KERN: active package: "bottle_python-0.12.17-1-any.hpkg"
1837KERN: package_daemon [8262919: 544] KERN: active package: "idna_python3-2.8-1-any.hpkg"
1838KERN: package_daemon [8263212: 544] active package: "kcoreaddons-5.55.0-2-x86_64.hpkg"
1839KERN: package_daemon [8263516: 544] KERN: active package: "openssh-7.9p1-3-x86_64.hpkg"
1840KERN: package_daemon [8263805: 544] KERN: active package: "freetype-2.9.1-1-x86_64.hpkg"
1841KERN: package_daemon [8264099: 544] KERN: active package: "cython_python-0.29.13-1-x86_64.hpkg"
1842KERN: package_daemon [8264424: 544] active package: "poppler066_qt5-0.66.0-2-x86_64.hpkg"
1843KERN: package_daemon [8264743: 544] active package: "libicns-0.8.1-8-x86_64.hpkg"
1844KERN: package_daemon [8265034: 544] active package: "alembic_devel-1.7.11-2-x86_64.hpkg"
1845KERN: package_daemon [8265345: 544] KERN: active package: "wavpack-5.1.0-2-x86_64.hpkg"
1846KERN: package_daemon [8265633: 544] KERN: active package: "bison-3.0.5-1-x86_64.hpkg"
1847KERN: package_daemon [8265915: 544] KERN: active package: "swig-4.0.0-1-x86_64.hpkg"
1848KERN: package_daemon [8266196: 544] KERN: active package: "future_python36-0.17.1-1-any.hpkg"
1849KERN: package_daemon [8266510: 544] KERN: active package: "chardet_python3-3.0.4-2-any.hpkg"
1850KERN: package_daemon [8266822: 544] active package: "brotli-1.0.7-1-x86_64.hpkg"
1851KERN: package_daemon [8267105: 544] KERN: active package: "tesseract-3.05.02-1-x86_64.hpkg"
1852KERN: package_daemon [8267409: 544] KERN: active package: "libunibreak-4.0-1-x86_64.hpkg"
1853KERN: package_daemon [8267706: 544] KERN: active package: "libid3tag_devel-0.15.1b-6-x86_64.hpkg"
1854KERN: package_daemon [8268034: 544] KERN: active package: "requests_python3-2.22.0-2-any.hpkg"
1855KERN: package_daemon [8268354: 544] active package: "feedparser_python3-5.2.1-2-any.hpkg"
1856KERN: package_daemon [8268674: 544] active package: "brotli_devel-1.0.7-1-x86_64.hpkg"
1857KERN: package_daemon [8268978: 544] KERN: active package: "arpack-3.7.0-3-x86_64.hpkg"
1858KERN: package_daemon [8269263: 544] KERN: active package: "tesseract_data_eng-3.04.00-4-any.hpkg"
1859KERN: package_daemon [8269589: 544] KERN: active package: "opencollada_devel-1.6.68-1-x86_64.hpkg"
1860KERN: package_daemon [8269923: 544] active package: "pyasn1_python-0.4.4-1-any.hpkg"
1861KERN: package_daemon [8270220: 544] KERN: active package: "dnspython_python36-1.16.0-1-any.hpkg"
1862KERN: package_daemon [8270540: 544] KERN: active package: "libidn2-2.0.5-1-x86_64.hpkg"
1863KERN: package_daemon [8270830: 544] KERN: active package: "pycparser_python3-2.19-2-any.hpkg"
1864KERN: package_daemon [8271146: 544] active package: "tiff4_devel-4.0.10-1-x86_64.hpkg"
1865KERN: package_daemon [8271450: 544] KERN: active package: "numpy_python3-1.16.5-1-x86_64.hpkg"
1866KERN: package_daemon [8271765: 544] KERN: active package: "sip-4.19.19-1-x86_64.hpkg"
1867KERN: package_daemon [8272048: 544] KERN: active package: "ca_root_certificates-2019_01_23-1-any.hpkg"
1868KERN: package_daemon [8272396: 544] KERN: active package: "telegram_desktop-1.8.9-2-x86_64.hpkg"
1869KERN: package_daemon [8272713: 544] KERN: active package: "aiodns_python3-1.1.1-1-any.hpkg"
1870KERN: package_daemon [8273016: 544] KERN: active package: "libgeotiff-1.4.2-3-x86_64.hpkg"
1871KERN: package_daemon [8273317: 544] KERN: active package: "imagemagick_devel-6.9.10.62-1-x86_64.hpkg"
1872KERN: package_daemon [8273660: 544] active package: "miniupnpc-2.1-2-x86_64.hpkg"
1873KERN: package_daemon [8273947: 544] KERN: active package: "musicpc-0.32-1-x86_64.hpkg"
1874KERN: package_daemon [8274232: 544] KERN: active package: "dateutil_python3-2.8.0-2-any.hpkg"
1875KERN: package_daemon [8274544: 544] KERN: active package: "audiofile-0.3.6-6-x86_64.hpkg"
1876KERN: package_daemon [8274845: 544] KERN: active package: "cdrtools-3.02~a09-1-x86_64.hpkg"
1877KERN: package_daemon [8275145: 544] KERN: active package: "which-2.21-5-x86_64.hpkg"
1878KERN: package_daemon [8275425: 544] active package: "double_conversion-3.0.0-1-x86_64.hpkg"
1879KERN: package_daemon [8275752: 544] KERN: active package: "netcdf-4.6.1-5-x86_64.hpkg"
1880KERN: package_daemon [8276037: 544] KERN: active package: "openimageio_devel-2.0.10-1-x86_64.hpkg"
1881KERN: package_daemon [8276362: 544] KERN: active package: "libnatpmp-20150609-2-x86_64.hpkg"
1882KERN: package_daemon [8276672: 544] active package: "curl-7.66.0-1-x86_64.hpkg"
1883KERN: package_daemon [8276958: 544] KERN: active package: "ca_root_certificates_java-2019_01_23-1-any.hpkg"
1884KERN: package_daemon [8277319: 544] KERN: active package: "coreutils-8.29-2-x86_64.hpkg"
1885KERN: package_daemon [8277610: 544] KERN: active package: "gmp_devel-6.1.2-3-x86_64.hpkg"
1886KERN: package_daemon [8277907: 544] KERN: active package: "chromaprint-1.4.3-3-x86_64.hpkg"
1887KERN: package_daemon [8278213: 544] KERN: active package: "faad2-2.8.8-1-x86_64.hpkg"
1888KERN: package_daemon [8278500: 544] active package: "armadillo-9.600.4-2-x86_64.hpkg"
1889KERN: package_daemon [8278807: 544] active package: "tesseract_devel-3.05.02-1-x86_64.hpkg"
1890KERN: package_daemon [8279131: 544] KERN: active package: "libevent21-2.1.8-2-x86_64.hpkg"
1891KERN: package_daemon [8279430: 544] KERN: active package: "qthaikuplugins-5.13.1.0-1-x86_64.hpkg"
1892KERN: package_daemon [8279756: 544] KERN: active package: "lzo_devel-2.10-2-x86_64.hpkg"
1893KERN: package_daemon [8280050: 544] KERN: active package: "openjdk12_jre-12.0.1.12-1-x86_64.hpkg"
1894KERN: package_daemon [8280381: 544] active package: "ctags-5.8-5-x86_64.hpkg"
1895KERN: package_daemon [8280658: 544] active package: "future_python3-0.17.1-1-any.hpkg"
1896KERN: package_daemon [8280962: 544] KERN: active package: "bash-5.0.011-1-x86_64.hpkg"
1897KERN: package_daemon [8281247: 544] KERN: active package: "chromaprint_devel-1.4.3-3-x86_64.hpkg"
1898KERN: package_daemon [8281573: 544] KERN: active package: "youtube_dl_python3-2019.09.12.1-1-any.hpkg"
1899KERN: package_daemon [8281922: 544] active package: "kcrash-5.55.0-2-x86_64.hpkg"
1900KERN: package_daemon [8282214: 544] active package: "gdal-2.4.0-3-x86_64.hpkg"
1901KERN: package_daemon [8282495: 544] active package: "qtwebkit-5.212.0~pre20190906-1-x86_64.hpkg"
1902KERN: package_daemon [8282835: 544] KERN: active package: "the_silver_searcher-2.2.0-1-x86_64.hpkg"
1903KERN: package_daemon [8283166: 544] KERN: active package: "openjpeg_devel-2.3.1-2-x86_64.hpkg"
1904KERN: package_daemon [8283481: 544] KERN: active package: "less-551-1-x86_64.hpkg"
1905KERN: package_daemon [8283756: 544] active package: "feedparser_python-5.2.1-2-any.hpkg"
1906KERN: package_daemon [8284067: 544] KERN: active package: "dnspython_python-1.16.0-1-any.hpkg"
1907KERN: package_daemon [8284381: 544] KERN: active package: "qupzilla-1.8.9-9-x86_64.hpkg"
1908KERN: package_daemon [8284675: 544] KERN: active package: "libpcap-1.8.1-4-x86_64.hpkg"
1909KERN: package_daemon [8284968: 544] active package: "ninja-1.9.0-1-x86_64.hpkg"
1910KERN: package_daemon [8285247: 544] KERN: active package: "cairo-1.16.0-1-x86_64.hpkg"
1911KERN: package_daemon [8285532: 544] KERN: active package: "qtwebkit_devel-5.212.0~pre20190906-1-x86_64.hpkg"
1912KERN: package_daemon [8285899: 544] KERN: active package: "util_linux-2.34-1-x86_64.hpkg"
1913KERN: package_daemon [8286201: 544] KERN: active package: "libqt4-4.8.7-10-x86_64.hpkg"
1914KERN: package_daemon [8286486: 544] KERN: active package: "aiodns_python-1.1.1-1-any.hpkg"
1915KERN: package_daemon [8286787: 544] active package: "twolame_devel-0.3.13-4-x86_64.hpkg"
1916KERN: package_daemon [8287102: 544] KERN: active package: "six_python-1.11.0-1-any.hpkg"
1917KERN: package_daemon [8287398: 544] KERN: active package: "pygments_python3-2.4.2-1-any.hpkg"
1918KERN: package_daemon [8287705: 544] KERN: active package: "skympc-1.6.5-1-x86_64.hpkg"
1919KERN: package_daemon [8287993: 544] active package: "pycparser_python-2.19-2-any.hpkg"
1920KERN: package_daemon [8288307: 544] active package: "poppler_data-0.4.9-1-any.hpkg"
1921KERN: package_daemon [8288600: 544] KERN: active package: "mpg123-1.25.12-1-x86_64.hpkg"
1922KERN: package_daemon [8288891: 544] KERN: active package: "pyqt-5.13.1-1-x86_64.hpkg"
1923KERN: package_daemon [8289174: 544] KERN: active package: "libtasn1-4.14-1-x86_64.hpkg"
1924KERN: package_daemon [8289468: 544] active package: "cmake-3.15.3-2-x86_64.hpkg"
1925KERN: package_daemon [8289750: 544] KERN: active package: "gdal_devel-2.4.0-3-x86_64.hpkg"
1926KERN: package_daemon [8290050: 544] KERN: active package: "exiv2_devel-0.27.2-1-x86_64.hpkg"
1927KERN: package_daemon [8290357: 544] KERN: active package: "iso8601_python36-0.1.12-2-any.hpkg"
1928KERN: package_daemon [8290675: 544] active package: "libopenshot_audio-0.1.8-1-x86_64.hpkg"
1929KERN: package_daemon [8290999: 544] KERN: active package: "openimageio_tools-2.0.10-1-x86_64.hpkg"
1930KERN: package_daemon [8291326: 544] KERN: active package: "solid-5.55.0-2-x86_64.hpkg"
1931KERN: package_daemon [8291612: 544] KERN: active package: "libdiscid-0.6.2-4-x86_64.hpkg"
1932KERN: package_daemon [8291914: 544] active package: "pixman_devel-0.38.4-1-x86_64.hpkg"
1933KERN: package_daemon [8292222: 544] KERN: active package: "openjdk12-12.0.1.12-1-x86_64.hpkg"
1934KERN: package_daemon [8292532: 544] KERN: active package: "sqlite-3.29.0.0-1-x86_64.hpkg"
1935KERN: package_daemon [8292829: 544] KERN: active package: "diffutils-3.7-1-x86_64.hpkg"
1936KERN: package_daemon [8293125: 544] active package: "sdl2_ttf-2.0.14-6-x86_64.hpkg"
1937KERN: package_daemon [8293423: 544] active package: "file_data-5.37-1-any.hpkg"
1938KERN: package_daemon [8293707: 544] active package: "flite-2.0.0-3-x86_64.hpkg"
1939KERN: package_daemon [8293986: 544] KERN: active package: "libqt4_devel-4.8.7-10-x86_64.hpkg"
1940KERN: package_daemon [8294297: 544] KERN: active package: "libmad_devel-0.15.1b-7-x86_64.hpkg"
1941KERN: package_daemon [8294612: 544] KERN: active package: "libopenshot_audio_devel-0.1.8-1-x86_64.hpkg"
1942KERN: package_daemon [8294964: 544] KERN: active package: "pyyaml_python3-5.1.2-1-x86_64.hpkg"
1943KERN: package_daemon [8295278: 544] KERN: active package: "libsamplerate_devel-0.1.9-2-x86_64.hpkg"
1944KERN: package_daemon [8295617: 544] active package: "tnftp-20151004-4-x86_64.hpkg"
1945KERN: package_daemon [8295912: 544] active package: "mutagen_python3-1.42.0-1-any.hpkg"
1946KERN: package_daemon [8296224: 544] active package: "libpcre2-10.33-1-x86_64.hpkg"
1947KERN: package_daemon [8296519: 544] active package: "ffmpeg-4.2.1-1-x86_64.hpkg"
1948KERN: package_daemon [8296802: 544] KERN: active package: "poppler066-0.66.0-2-x86_64.hpkg"
1949KERN: package_daemon [8297104: 544] KERN: active package: "musepack_tools_devel-475-2-x86_64.hpkg"
1950KERN: package_daemon [8297437: 544] active package: "sdl2_image-2.0.4-1-x86_64.hpkg"
1951KERN: package_daemon [8297739: 544] active package: "pillow_python3-4.3.0-1-x86_64.hpkg"
1952KERN: package_daemon [8298055: 544] active package: "bepdf-2.1.1-1-x86_64.hpkg"
1953KERN: package_daemon [8298340: 544] active package: "libebur128-1.2.4-1-x86_64.hpkg"
1954KERN: package_daemon [8298637: 544] KERN: active package: "lz4-1.9.2-1-x86_64.hpkg"
1955KERN: package_daemon [8298910: 544] KERN: active package: "nghttp2_devel-1.34.0-1-x86_64.hpkg"
1956KERN: package_daemon [8299227: 544] KERN: active package: "discid_python3-1.2.0-2-any.hpkg"
1957KERN: package_daemon [8299533: 544] KERN: active package: "libpng16-1.6.37-1-x86_64.hpkg"
1958KERN: package_daemon [8299835: 544] active package: "cairo_devel-1.16.0-1-x86_64.hpkg"
1959KERN: package_daemon [8300146: 544] active package: "opensubdiv_devel-3.4.0-1-x86_64.hpkg"
1960KERN: package_daemon [8300464: 544] KERN: active package: "wget-1.20.3-1-x86_64.hpkg"
1961KERN: package_daemon [8300745: 544] KERN: active package: "sdl2_net-2.0.1-2-x86_64.hpkg"
1962KERN: package_daemon [8301038: 544] KERN: active package: "graphite2_devel-1.3.13-1-x86_64.hpkg"
1963KERN: package_daemon [8301367: 544] active package: "fontconfig-2.13.1-4-x86_64.hpkg"
1964KERN: package_daemon [8301673: 544] active package: "fonttools_python3-4.0.2-1-any.hpkg"
1965KERN: package_daemon [8301989: 544] active package: "libevent21_devel-2.1.8-2-x86_64.hpkg"
1966KERN: package_daemon [8302308: 544] KERN: active package: "lz4_devel-1.9.2-1-x86_64.hpkg"
1967KERN: package_daemon [8302603: 544] KERN: active package: "pyaes_python3-1.6.0-1-any.hpkg"
1968KERN: package_daemon [8302903: 544] KERN: active package: "transmission-2.94-4-x86_64.hpkg"
1969KERN: package_daemon [8303211: 544] active package: "libpng16_devel-1.6.37-1-x86_64.hpkg"
1970KERN: package_daemon [8303527: 544] KERN: active package: "openal_devel-1.19.1-1-x86_64.hpkg"
1971KERN: package_daemon [8303836: 544] KERN: active package: "poppler066_glib-0.66.0-2-x86_64.hpkg"
1972KERN: package_daemon [8304159: 544] KERN: active package: "sdl2_gfx-1.0.4-2-x86_64.hpkg"
1973KERN: package_daemon [8304459: 544] KERN: active package: "setuptools_python3-41.2.0-1-any.hpkg"
1974KERN: package_daemon [8304780: 544] KERN: active package: "gettext-0.19.8.1-7-x86_64.hpkg"
1975KERN: package_daemon [8305081: 544] KERN: active package: "ruby-2.6.3-2-x86_64.hpkg"
1976KERN: package_daemon [8305362: 544] KERN: active package: "ecdsa_python36-0.13.2-1-any.hpkg"
1977KERN: package_daemon [8305675: 544] active package: "catkeyseditor-0.1.2-3-x86_64.hpkg"
1978KERN: package_daemon [8305988: 544] active package: "eigen-3.3.7-2-x86_64.hpkg"
1979KERN: package_daemon [8306267: 544] KERN: active package: "libsolv-0.3.0_haiku_2014_12_22-3-x86_64.hpkg"
1980KERN: package_daemon [8306616: 544] KERN: active package: "cssselect_python36-1.1.0-1-any.hpkg"
1981KERN: package_daemon [8306935: 544] KERN: active package: "c_blosc-1.17.0-1-x86_64.hpkg"
1982KERN: package_daemon [8307232: 544] KERN: active package: "libogg-1.3.4-1-x86_64.hpkg"
1983KERN: package_daemon [8307514: 544] KERN: active package: "llvm7_libs-7.0.1-2-x86_64.hpkg"
1984KERN: package_daemon [8307816: 544] active package: "blis-0.6.0-1-x86_64.hpkg"
1985KERN: package_daemon [8308093: 544] KERN: active package: "kdbusaddons-5.55.0-2-x86_64.hpkg"
1986KERN: package_daemon [8308405: 544] KERN: active package: "alembic_py_python36-1.2.1-1-any.hpkg"
1987KERN: package_daemon [8308725: 544] KERN: active package: "libsdl2_devel-2.0.9-2-x86_64.hpkg"
1988KERN: package_daemon [8309036: 544] KERN: active package: "iso8601_python3-0.1.12-2-any.hpkg"
1989KERN: package_daemon [8309354: 544] active package: "a52dec-0.7.4-5-x86_64.hpkg"
1990KERN: package_daemon [8309642: 544] active package: "pyasn1_python3-0.4.4-1-any.hpkg"
1991KERN: package_daemon [8309948: 544] active package: "apr-1.6.5-1-x86_64.hpkg"
1992KERN: package_daemon [8310222: 544] KERN: active package: "snappy-1.1.7-2-x86_64.hpkg"
1993KERN: package_daemon [8310506: 544] KERN: active package: "dateutil_python-2.8.0-2-any.hpkg"
1994KERN: package_daemon [8310814: 544] KERN: active package: "glew1_devel-1.13.0-2-x86_64.hpkg"
1995KERN: package_daemon [8311126: 544] active package: "cffi_python3-1.12.3-1-x86_64.hpkg"
1996KERN: package_daemon [8311434: 544] KERN: active package: "samba-3.6.25-7-x86_64.hpkg"
1997KERN: package_daemon [8311718: 544] KERN: active package: "openssl-1.0.2t-1-x86_64.hpkg"
1998KERN: package_daemon [8312012: 544] KERN: active package: "harfbuzz-2.6.1-1-x86_64.hpkg"
1999KERN: package_daemon [8312309: 544] active package: "perl-5.30.0-1-x86_64.hpkg"
2000KERN: package_daemon [8312588: 544] KERN: active package: "libreplaygain-475-3-x86_64.hpkg"
2001KERN: package_daemon [8312890: 544] KERN: active package: "sdl2_ttf_devel-2.0.14-6-x86_64.hpkg"
2002KERN: package_daemon [8313209: 544] KERN: active package: "kdiff3-1.8.0~git-2-x86_64.hpkg"
2003KERN: package_daemon [8313512: 544] active package: "flac_devel-1.3.3-1-x86_64.hpkg"
2004KERN: package_daemon [8313809: 544] KERN: active package: "screenfetch-3.8.0-2-any.hpkg"
2005KERN: package_daemon [8314102: 544] KERN: active package: "picard-2.2.1-2-x86_64.hpkg"
2006KERN: package_daemon [8314390: 544] KERN: active package: "libao-1.2.2-2-x86_64.hpkg"
2007KERN: package_daemon [8314677: 544] active package: "curl_devel-7.66.0-1-x86_64.hpkg"
2008KERN: package_daemon [8314978: 544] KERN: active package: "libssh2-1.8.1-1-x86_64.hpkg"
2009KERN: package_daemon [8315266: 544] KERN: active package: "libsdl_devel-1.2.15-15-x86_64.hpkg"
2010KERN: package_daemon [8315582: 544] KERN: active package: "libdvdread-6.0.1-1-x86_64.hpkg"
2011KERN: package_daemon [8315885: 544] active package: "soxr-0.1.3-1-x86_64.hpkg"
2012KERN: package_daemon [8316160: 544] KERN: active package: "flex-2.6.4-1-x86_64.hpkg"
2013KERN: package_daemon [8316437: 544] KERN: active package: "jam-2.5_2018_11_21-7-x86_64.hpkg"
2014KERN: package_daemon [8316745: 544] KERN: active package: "sdl2_image_devel-2.0.4-1-x86_64.hpkg"
2015KERN: package_daemon [8317073: 544] active package: "bottle_python36-0.12.17-1-any.hpkg"
2016KERN: package_daemon [8317389: 544] active package: "glib_networking-2.54.1-2-x86_64.hpkg"
2017KERN: package_daemon [8317713: 544] active package: "qutebrowser-1.8.1-3-x86_64.hpkg"
2018KERN: package_daemon [8318013: 544] KERN: active package: "ffmpeg_avdevice-4.2.1-1-x86_64.hpkg"
2019KERN: package_daemon [8318330: 544] KERN: active package: "uchardet-0.0.6-2-x86_64.hpkg"
2020KERN: package_daemon [8318623: 544] KERN: active package: "bzip2_devel-1.0.8-1-x86_64.hpkg"
2021KERN: package_daemon [8318931: 544] KERN: active package: "libwebp-1.0.3-1-x86_64.hpkg"
2022KERN: package_daemon [8319222: 544] KERN: active package: "libopenmpt-0.4.6-1-x86_64.hpkg"
2023KERN: package_daemon [8319525: 544] KERN: active package: "sdl2_net_devel-2.0.1-2-x86_64.hpkg"
2024KERN: package_daemon [8319840: 544] KERN: active package: "libpcre_devel-8.43-1-x86_64.hpkg"
2025KERN: package_daemon [8320146: 544] KERN: active package: "blis_devel-0.6.0-1-x86_64.hpkg"
2026KERN: package_daemon [8320447: 544] KERN: active package: "kdoctools-5.55.0-2-x86_64.hpkg"
2027KERN: package_daemon [8320754: 544] active package: "snappy_devel-1.1.7-2-x86_64.hpkg"
2028KERN: package_daemon [8321063: 544] active package: "apr_util-1.6.1-1-x86_64.hpkg"
2029KERN: package_daemon [8321358: 544] active package: "qca2-2.0.3-4-x86_64.hpkg"
2030KERN: package_daemon [8321634: 544] KERN: active package: "dtc-1.4.7-2-x86_64.hpkg"
2031KERN: package_daemon [8321908: 544] KERN: active package: "liblayout-1.4.1-8-x86_64.hpkg"
2032KERN: package_daemon [8322204: 544] KERN: active package: "tinyxml-2.6.2-4-x86_64.hpkg"
2033KERN: package_daemon [8322500: 544] active package: "lua-5.3.5-1-x86_64.hpkg"
2034KERN: package_daemon [8322777: 544] active package: "sdl2_gfx_devel-1.0.4-2-x86_64.hpkg"
2035KERN: package_daemon [8323093: 544] active package: "e2fsprogs-1.45.3-1-x86_64.hpkg"
2036KERN: package_daemon [8323391: 544] KERN: active package: "glew1-1.13.0-2-x86_64.hpkg"
2037KERN: package_daemon [8323676: 544] KERN: active package: "frozendict_python36-1.2-2-any.hpkg"
2038KERN: package_daemon [8323993: 544] KERN: active package: "icu_devel-57.1-3-x86_64.hpkg"
2039KERN: package_daemon [8324293: 544] active package: "sip_python36-4.19.19-1-x86_64.hpkg"
2040KERN: package_daemon [8324609: 544] active package: "zeromq-4.3.2-1-x86_64.hpkg"
2041KERN: package_daemon [8324896: 544] active package: "qca2_devel-2.0.3-4-x86_64.hpkg"
2042KERN: package_daemon [8325193: 544] KERN: active package: "wonderbrush-2.1.2-8-x86_64.hpkg"
2043KERN: package_daemon [8325495: 544] KERN: active package: "libtheora-1.1.1-7-x86_64.hpkg"
2044KERN: package_daemon [8325792: 544] KERN: active package: "opencolorio-1.0.9-6-x86_64.hpkg"
2045KERN: package_daemon [8326101: 544] KERN: active package: "exiv2-0.27.2-1-x86_64.hpkg"
2046KERN: package_daemon [8326383: 544] KERN: active package: "openjdk12_default-12.0.1.12-1-x86_64.hpkg"
2047KERN: package_daemon [8326724: 544] active package: "cssselect_python3-1.1.0-1-any.hpkg"
2048KERN: package_daemon [8327041: 544] active package: "boost164-1.64.0-3-x86_64.hpkg"
2049KERN: package_daemon [8327339: 544] active package: "harfbuzz_devel-2.6.1-1-x86_64.hpkg"
2050KERN: package_daemon [8327656: 544] active package: "util_linux_devel-2.34-1-x86_64.hpkg"
2051KERN: package_daemon [8327976: 544] active package: "faad2_devel-2.8.8-1-x86_64.hpkg"
2052KERN: package_daemon [8328277: 544] KERN: active package: "gst_libav-1.16.0-2-x86_64.hpkg"
2053KERN: package_daemon [8328577: 544] KERN: active package: "libiconv_devel-1.15-4-x86_64.hpkg"
2054KERN: package_daemon [8328889: 544] KERN: active package: "libxml2_devel-2.9.9-4-x86_64.hpkg"
2055KERN: package_daemon [8329204: 544] active package: "zeromq_devel-4.3.2-1-x86_64.hpkg"
2056KERN: package_daemon [8329509: 544] KERN: active package: "pyaes_python-1.6.0-1-any.hpkg"
2057KERN: package_daemon [8329804: 544] KERN: active package: "pixman-0.38.4-1-x86_64.hpkg"
2058KERN: package_daemon [8330094: 544] KERN: active package: "libunistring-0.9.10-1-x86_64.hpkg"
2059KERN: package_daemon [8330412: 544] active package: "opencolorio_devel-1.0.9-6-x86_64.hpkg"
2060KERN: package_daemon [8330739: 544] active package: "libopenshot-0.2.3-4-x86_64.hpkg"
2061KERN: package_daemon [8331044: 544] active package: "xorgproto-2018.4-2-any.hpkg"
2062KERN: package_daemon [8331330: 544] KERN: active package: "libbluray-1.1.1-1-x86_64.hpkg"
2063KERN: package_daemon [8331626: 544] KERN: active package: "glew-2.1.0-2-x86_64.hpkg"
2064KERN: package_daemon [8331905: 544] KERN: active package: "slayer-1.0-1-x86_64.hpkg"
2065KERN: package_daemon [8332187: 544] KERN: active package: "file-5.37-1-x86_64.hpkg"
2066KERN: package_daemon [8332468: 544] active package: "gst_plugins_bad-1.16.0-2-x86_64.hpkg"
2067KERN: package_daemon [8332790: 544] active package: "libogg_devel-1.3.4-1-x86_64.hpkg"
2068KERN: package_daemon [8333095: 544] KERN: active package: "fontconfig_devel-2.13.1-4-x86_64.hpkg"
2069KERN: package_daemon [8333420: 544] KERN: active package: "libupnp_devel-1.6.22-1-x86_64.hpkg"
2070KERN: package_daemon [8333736: 544] KERN: active package: "attica-5.55.0-2-x86_64.hpkg"
2071KERN: package_daemon [8334031: 544] active package: "readline_devel-7.0.3-4-x86_64.hpkg"
2072KERN: package_daemon [8334348: 544] active package: "lzo-2.10-2-x86_64.hpkg"
2073KERN: package_daemon [8334621: 544] active package: "libvorbis-1.3.6-1-x86_64.hpkg"
2074KERN: package_daemon [8334914: 544] KERN: active package: "cffi_python-1.12.3-1-x86_64.hpkg"
2075KERN: package_daemon [8335220: 544] KERN: active package: "libsdl2-2.0.9-2-x86_64.hpkg"
2076KERN: package_daemon [8335510: 544] KERN: active package: "openssl_man-1.0.2t-1-any.hpkg"
2077KERN: package_daemon [8335811: 544] active package: "future_python-0.17.1-1-any.hpkg"
2078KERN: package_daemon [8336112: 544] KERN: active package: "gst_plugins_base-1.16.0-1-x86_64.hpkg"
2079KERN: package_daemon [8336436: 544] KERN: active package: "sdl_gfx_devel-2.0.26-2-x86_64.hpkg"
2080KERN: package_daemon [8336751: 544] KERN: active package: "cantata-2.3.3-1-x86_64.hpkg"
2081KERN: package_daemon [8337045: 544] active package: "fbreader-0.99.4-3-x86_64.hpkg"
2082KERN: package_daemon [8337338: 544] KERN: active package: "speex_devel-1.2.0-4-x86_64.hpkg"
2083KERN: package_daemon [8337640: 544] KERN: active package: "capstone-3.0.5-1-x86_64.hpkg"
2084KERN: package_daemon [8337935: 544] KERN: active package: "libvpx3-1.5.0-3-x86_64.hpkg"
2085KERN: package_daemon [8338228: 544] active package: "c_ares-1.15.0-1-x86_64.hpkg"
2086KERN: package_daemon [8338515: 544] KERN: active package: "xcb_proto-1.13-2-any.hpkg"
2087KERN: package_daemon [8338796: 544] KERN: active package: "graphite2-1.3.13-1-x86_64.hpkg"
2088KERN: package_daemon [8339096: 544] KERN: active package: "python-2.7.16-4-x86_64.hpkg"
2089KERN: package_daemon [8339394: 544] active package: "hdf5_devel-1.10.5-1-x86_64.hpkg"
2090KERN: package_daemon [8339699: 544] active package: "gst_plugins_good-1.16.0-1-x86_64.hpkg"
2091KERN: package_daemon [8340026: 544] active package: "sip_python3-4.19.19-1-x86_64.hpkg"
2092KERN: package_daemon [8340334: 544] KERN: active package: "alembic_py_python3-1.2.1-1-any.hpkg"
2093KERN: package_daemon [8340651: 544] KERN: active package: "libxslt_devel-1.1.32-1-x86_64.hpkg"
2094KERN: package_daemon [8340966: 544] KERN: active package: "zstd_devel-1.4.3-1-x86_64.hpkg"
2095KERN: package_daemon [8341272: 544] active package: "openblas-0.3.6-1-x86_64.hpkg"
2096KERN: package_daemon [8341567: 544] active package: "ffmpeg_devel-4.2.1-1-x86_64.hpkg"
2097KERN: package_daemon [8341876: 544] active package: "enca-1.19-2-x86_64.hpkg"
2098KERN: package_daemon [8342148: 544] KERN: active package: "libpthread_stubs-0.4-4-any.hpkg"
2099KERN: package_daemon [8342451: 544] KERN: active package: "openssl_devel-1.0.2t-1-x86_64.hpkg"
2100KERN: package_daemon [8342767: 544] KERN: active package: "musepack_tools-475-2-x86_64.hpkg"
2101KERN: package_daemon [8343081: 544] active package: "gst_plugins_ugly-1.16.0-1-x86_64.hpkg"
2102KERN: package_daemon [8343408: 544] active package: "p7zip-9.20.1-7-x86_64.hpkg"
2103KERN: package_daemon [8343696: 544] active package: "gd-2.2.5-3-x86_64.hpkg"
2104KERN: package_daemon [8343964: 544] KERN: active package: "serf-1.3.9-3-x86_64.hpkg"
2105KERN: package_daemon [8344241: 544] KERN: active package: "iasl-20181031-1-x86_64.hpkg"
2106KERN: package_daemon [8344532: 544] KERN: active package: "cblas_reference-20110120-4-x86_64.hpkg"
2107KERN: package_daemon [8344866: 544] active package: "fribidi-1.0.5-1-x86_64.hpkg"
2108KERN: package_daemon [8345152: 544] KERN: active package: "libgpg_error_devel-1.36-1-x86_64.hpkg"
2109KERN: package_daemon [8345477: 544] KERN: active package: "libxau-1.0.8-6-x86_64.hpkg"
2110KERN: package_daemon [8345763: 544] KERN: active package: "python36-3.6.8-3-x86_64.hpkg"
2111KERN: package_daemon [8346062: 544] active package: "sdl_image-1.2.12-8-x86_64.hpkg"
2112KERN: package_daemon [8346359: 544] KERN: active package: "sdl_net-1.2.8-7-x86_64.hpkg"
2113KERN: package_daemon [8346648: 544] KERN: active package: "gstreamer-1.16.0-1-x86_64.hpkg"
2114KERN: package_daemon [8346948: 544] KERN: active package: "coverage_python-4.5.4-1-x86_64.hpkg"
2115KERN: package_daemon [8347270: 544] KERN: active package: "frozendict_python3-1.2-2-any.hpkg"
2116KERN: package_daemon [8347587: 544] active package: "markdown_python36-3.1.1-1-any.hpkg"
2117KERN: package_daemon [8347904: 544] active package: "patch-2.7.6-2-x86_64.hpkg"
2118KERN: package_daemon [8348183: 544] KERN: active package: "scintilla-4.2.0-1-x86_64.hpkg"
2119KERN: package_daemon [8348479: 544] KERN: active package: "pyaes_python36-1.6.0-1-any.hpkg"
2120KERN: package_daemon [8348783: 544] KERN: active package: "libcddb-1.3.2-3-x86_64.hpkg"
2121KERN: package_daemon [8349076: 544] active package: "libgcrypt_devel-1.8.5-1-x86_64.hpkg"
2122KERN: package_daemon [8349393: 544] KERN: active package: "libxdmcp-1.1.2-2-x86_64.hpkg"
2123KERN: package_daemon [8349685: 544] KERN: active package: "python3-3.7.3-3-x86_64.hpkg"
2124KERN: package_daemon [8349975: 544] KERN: active package: "sdl_sound-1.0.3-8-x86_64.hpkg"
2125KERN: package_daemon [8350276: 544] active package: "hyphen-2.8.8-3-x86_64.hpkg"
2126KERN: package_daemon [8350559: 544] KERN: active package: "xz_utils_devel-5.2.4-2-x86_64.hpkg"
2127KERN: package_daemon [8350872: 544] KERN: active package: "glog-0.3.5-2-x86_64.hpkg"
2128KERN: package_daemon [8351151: 544] KERN: active package: "libao_devel-1.2.2-2-x86_64.hpkg"
2129KERN: package_daemon [8351460: 544] active package: "pe-2.4.5-8-x86_64.hpkg"
2130KERN: package_daemon [8351728: 544] KERN: active package: "yaml_cpp-0.6.2-1-x86_64.hpkg"
2131KERN: package_daemon [8352020: 544] KERN: active package: "subversion-1.9.7-2-x86_64.hpkg"
2132KERN: package_daemon [8352322: 544] KERN: active package: "libusb-1.0.22-4-x86_64.hpkg"
2133KERN: package_daemon [8352616: 544] KERN: active package: "libxslt-1.1.32-1-x86_64.hpkg"
2134KERN: package_daemon [8352905: 544] KERN: active package: "check-0.12.0-1-x86_64.hpkg"
2135KERN: package_daemon [8353192: 544] active package: "qt5-5.13.1-3-x86_64.hpkg"
2136KERN: package_daemon [8353472: 544] KERN: active package: "giflib-5.1.4-2-x86_64.hpkg"
2137KERN: package_daemon [8353759: 544] KERN: active package: "binutils-2.31.1-1-x86_64.hpkg"
2138KERN: package_daemon [8354051: 544] KERN: active package: "pango-1.42.4-1-x86_64.hpkg"
2139KERN: package_daemon [8354340: 544] active package: "lame-3.100-3-x86_64.hpkg"
2140KERN: package_daemon [8354619: 544] KERN: active package: "enum34-1.1.6-1-any.hpkg"
2141KERN: package_daemon [8354896: 544] KERN: active package: "glog_devel-0.3.5-2-x86_64.hpkg"
2142KERN: package_daemon [8355192: 544] KERN: active package: "alembic_py_python-1.2.1-1-any.hpkg"
2143KERN: package_daemon [8355508: 544] active package: "giflib_devel-5.1.4-2-x86_64.hpkg"
2144KERN: package_daemon [8355821: 544] active package: "vamp_plugin_sdk-2.6-3-x86_64.hpkg"
2145KERN: package_daemon [8356129: 544] KERN: active package: "libxau_devel-1.0.8-6-x86_64.hpkg"
2146KERN: package_daemon [8356434: 544] KERN: active package: "libmad-0.15.1b-7-x86_64.hpkg"
2147KERN: package_daemon [8356729: 544] KERN: active package: "libwebp_devel-1.0.3-1-x86_64.hpkg"
2148KERN: package_daemon [8357047: 544] KERN: active package: "nghttp2-1.34.0-1-x86_64.hpkg"
2149KERN: package_daemon [8357344: 544] KERN: active package: "attrs_python36-19.2.0-1-any.hpkg"
2150KERN: package_daemon [8357652: 544] KERN: active package: "sdl_net_devel-1.2.8-7-x86_64.hpkg"
2151KERN: package_daemon [8357958: 544] KERN: active package: "setuptools_python-41.2.0-1-any.hpkg"
2152KERN: package_daemon [8358277: 544] active package: "libmms-0.6.4-2-x86_64.hpkg"
2153KERN: package_daemon [8358565: 544] KERN: active package: "sip_python-4.19.19-1-x86_64.hpkg"
2154KERN: package_daemon [8358873: 544] KERN: active package: "mesa-17.1.10-4-x86_64.hpkg"
2155KERN: package_daemon [8359155: 544] KERN: active package: "gcc_syslibs-8.3.0_2019_05_24-7-x86_64.hpkg"
2156KERN: package_daemon [8359501: 544] active package: "m4-1.4.18-3-x86_64.hpkg"
2157KERN: package_daemon [8359778: 544] active package: "dnspython_python3-1.16.0-1-any.hpkg"
2158KERN: package_daemon [8360099: 544] active package: "colors-2.3-5-x86_64.hpkg"
2159KERN: package_daemon [8360378: 544] active package: "fftw-3.3.8-5-x86_64.hpkg"
2160KERN: package_daemon [8360659: 544] active package: "openvdb-6.1.0-2-x86_64.hpkg"
2161KERN: package_daemon [8360945: 544] KERN: active package: "expat-2.2.8-1-x86_64.hpkg"
2162KERN: package_daemon [8361226: 544] KERN: active package: "libmpdclient-2.16-1-x86_64.hpkg"
2163KERN: package_daemon [8361531: 544] KERN: active package: "cppunit-1.14.0-4-x86_64.hpkg"
2164KERN: package_daemon [8361832: 544] active package: "wavpack_devel-5.1.0-2-x86_64.hpkg"
2165KERN: package_daemon [8362145: 544] active package: "graphviz-2.40.1-2-x86_64.hpkg"
2166KERN: package_daemon [8362443: 544] active package: "six_python3-1.11.0-1-any.hpkg"
2167KERN: package_daemon [8362737: 544] KERN: active package: "scintilla_lexers-4.2.0-1-x86_64.hpkg"
2168KERN: package_daemon [8363057: 544] KERN: active package: "qemu-3.1.0-4-x86_64.hpkg"
2169KERN: package_daemon [8363335: 544] KERN: active package: "fluidsynth-1.1.11-3-x86_64.hpkg"
2170KERN: package_daemon [8363644: 544] active package: "make-4.1-3-x86_64.hpkg"
2171KERN: package_daemon [8363913: 544] KERN: active package: "libsamplerate-0.1.9-2-x86_64.hpkg"
2172KERN: package_daemon [8364222: 544] KERN: active package: "opensubdiv-3.4.0-1-x86_64.hpkg"
2173KERN: package_daemon [8364524: 544] KERN: active package: "ncurses6_devel-6.1-1-x86_64.hpkg"
2174KERN: package_daemon [8364838: 544] KERN: active package: "pyqt_python-5.13.1-1-x86_64.hpkg"
2175KERN: package_daemon [8365152: 544] active package: "glu-9.0.0-7-x86_64.hpkg"
2176KERN: package_daemon [8365424: 544] KERN: active package: "ncmpcpp-0.8.2-3-x86_64.hpkg"
2177KERN: package_daemon [8365712: 544] KERN: active package: "openexr_devel-2.2.1-2-x86_64.hpkg"
2178KERN: package_daemon [8366025: 544] KERN: active package: "lame_devel-3.100-3-x86_64.hpkg"
2179KERN: package_daemon [8366330: 544] KERN: active package: "libnice-0.1.14-2-x86_64.hpkg"
2180KERN: package_daemon [8366618: 544] KERN: active package: "cppunit_devel-1.14.0-4-x86_64.hpkg"
2181KERN: package_daemon [8366934: 544] active package: "sdl_image_devel-1.2.12-8-x86_64.hpkg"
2182KERN: package_daemon [8367263: 544] active package: "karchive-5.55.0-2-x86_64.hpkg"
2183KERN: package_daemon [8367556: 544] KERN: active package: "koder-0.5.1-1-x86_64.hpkg"
2184KERN: package_daemon [8367837: 544] KERN: active package: "qemu_x86-3.1.0-4-x86_64.hpkg"
2185KERN: package_daemon [8368130: 544] KERN: active package: "pypeg2_python3-2.15.2-2-any.hpkg"
2186KERN: package_daemon [8368441: 544] active package: "click_python36-8.0.1-1-any.hpkg"
2187KERN: package_daemon [8368742: 544] KERN: active package: "hunspell_devel-1.7.0-1-x86_64.hpkg"
2188KERN: package_daemon [8369055: 544] KERN: active package: "libdvdnav-6.0.0-1-x86_64.hpkg"
2189KERN: package_daemon [8369352: 544] KERN: active package: "libxdmcp_devel-1.1.2-2-x86_64.hpkg"
2190KERN: package_daemon [8369673: 544] active package: "mako_python3-1.0.3-1-any.hpkg"
2191KERN: package_daemon [8369972: 544] active package: "digiclock-1.0-3-x86_64.hpkg"
2192KERN: package_daemon [8370262: 544] active package: "sdl_sound_devel-1.0.3-8-x86_64.hpkg"
2193KERN: package_daemon [8370579: 544] active package: "gtest-1.9.0~git-1-x86_64.hpkg"
2194KERN: package_daemon [8370875: 544] KERN: active package: "libsdl-1.2.15-15-x86_64.hpkg"
2195KERN: package_daemon [8371169: 544] KERN: active package: "frozendict_python-1.2-2-any.hpkg"
2196KERN: package_daemon [8371482: 544] active package: "markdown_python3-3.1.1-1-any.hpkg"
2197KERN: package_daemon [8371794: 544] active package: "scons-2.5.1-3-x86_64.hpkg"
2198KERN: package_daemon [8372078: 544] active package: "libxcb-1.13-3-x86_64.hpkg"
2199KERN: package_daemon [8372357: 544] KERN: active package: "sdl_pango-0.1.2-3-x86_64.hpkg"
2200KERN: package_daemon [8372652: 544] KERN: active package: "libsndfile-1.0.28-1-x86_64.hpkg"
2201KERN: package_daemon [8372957: 544] KERN: active package: "pkgconfig-0.29.2-3-x86_64.hpkg"
2202KERN: package_daemon [8373262: 544] KERN: active package: "mesa_swpipe-17.1.10-4-x86_64.hpkg"
2203KERN: package_daemon [8373572: 544] KERN: active package: "sed-4.4-3-x86_64.hpkg"
2204KERN: package_daemon [8373840: 544] KERN: active package: "flac-1.3.3-1-x86_64.hpkg"
2205KERN: package_daemon [8374123: 544] active package: "faac-1.29.9.2-1-x86_64.hpkg"
2206KERN: package_daemon [8374409: 544] KERN: active package: "cryptography_python-2.7-1-x86_64.hpkg"
2207KERN: package_daemon [8374733: 544] KERN: active package: "irssi-1.2.1-1-x86_64.hpkg"
2208KERN: package_daemon [8375015: 544] KERN: active package: "man-1.6g-6-x86_64.hpkg"
2209KERN: package_daemon [8375291: 544] active package: "pugixml-1.9-1-x86_64.hpkg"
2210KERN: package_daemon [8375571: 544] KERN: active package: "lapack_devel-3.8.0-6-x86_64.hpkg"
2211KERN: package_daemon [8375877: 544] KERN: active package: "libcdio-2.1.0-2-x86_64.hpkg"
2212KERN: package_daemon [8376167: 544] KERN: active package: "libx11-1.6.5-7-x86_64.hpkg"
2213KERN: package_daemon [8376456: 544] KERN: active package: "numpy_python36-1.16.5-1-x86_64.hpkg"
2214KERN: package_daemon [8376779: 544] active package: "glu_devel-9.0.0-7-x86_64.hpkg"
2215KERN: package_daemon [8377077: 544] active package: "mpc-1.1.0-1-x86_64.hpkg"
2216KERN: package_daemon [8377349: 544] KERN: active package: "expat_devel-2.2.8-1-x86_64.hpkg"
2217KERN: package_daemon [8377651: 544] KERN: active package: "sdl_pango_devel-0.1.2-3-x86_64.hpkg"
2218KERN: package_daemon [8377970: 544] KERN: active package: "gtest_devel-1.9.0~git-1-x86_64.hpkg"
2219KERN: package_daemon [8378292: 544] KERN: active package: "libsoup-2.60.2-1-x86_64.hpkg"
2220KERN: package_daemon [8378584: 544] KERN: active package: "sip_pyqt_python36-4.19.19-1-x86_64.hpkg"
2221KERN: package_daemon [8378917: 544] KERN: active package: "mesa_devel-17.1.10-4-x86_64.hpkg"
2222KERN: package_daemon [8379226: 544] KERN: active package: "sharutils-4.15.2-3-x86_64.hpkg"
2223KERN: package_daemon [8379532: 544] active package: "libopenshot_devel-0.2.3-4-x86_64.hpkg"
2224KERN: package_daemon [8379859: 544] active package: "pugixml_devel-1.9-1-x86_64.hpkg"
2225KERN: package_daemon [8380160: 544] KERN: active package: "fftw_devel-3.3.8-5-x86_64.hpkg"
2226KERN: package_daemon [8380461: 544] KERN: active package: "libxcb_devel-1.13-3-x86_64.hpkg"
2227KERN: package_daemon [8380766: 544] KERN: active package: "rust_bin-1.36.0-1-x86_64.hpkg"
2228KERN: package_daemon [8381069: 544] active package: "gmp-6.1.2-3-x86_64.hpkg"
2229KERN: package_daemon [8381346: 544] active package: "texinfo-6.5-4-x86_64.hpkg"
2230KERN: package_daemon [8381630: 544] active package: "futures_python-3.3.0-1-any.hpkg"
2231KERN: package_daemon [8381931: 544] KERN: active package: "libsrtp-1.5.4-2-x86_64.hpkg"
2232KERN: package_daemon [8382219: 544] KERN: active package: "libvorbis_devel-1.3.6-1-x86_64.hpkg"
2233KERN: package_daemon [8382537: 544] KERN: active package: "argh_python36-0.26.2-2-any.hpkg"
2234KERN: package_daemon [8382848: 544] active package: "speex-1.2.0-4-x86_64.hpkg"
2235KERN: package_daemon [8383131: 544] active package: "v8-7.4.288.28-2-x86_64.hpkg"
2236KERN: package_daemon [8383423: 544] active package: "rubberband-1.8.2-1-x86_64.hpkg"
2237KERN: package_daemon [8383720: 544] KERN: active package: "qt5_devel-5.13.1-3-x86_64.hpkg"
2238KERN: package_daemon [8384019: 544] KERN: active package: "gnutls-3.6.4-1-x86_64.hpkg"
2239KERN: package_daemon [8384304: 544] KERN: active package: "jasper1-1.900.5-2-x86_64.hpkg"
2240KERN: package_daemon [8384606: 544] active package: "getconf-0.5-1-x86_64.hpkg"
2241KERN: package_daemon [8384886: 544] active package: "libtool_libltdl-2.4.6-1-x86_64.hpkg"
2242KERN: package_daemon [8385203: 544] KERN: active package: "libsndfile_devel-1.0.28-1-x86_64.hpkg"
2243KERN: package_daemon [8385534: 544] active package: "sdl_mixer_devel-1.2.12-7-x86_64.hpkg"
2244KERN: package_daemon [8385857: 544] active package: "libass-0.14.0-2-x86_64.hpkg"
2245KERN: package_daemon [8386149: 544] active package: "openvdb_tools-6.1.0-2-x86_64.hpkg"
2246KERN: package_daemon [8386461: 544] active package: "grep-3.3-1-x86_64.hpkg"
2247KERN: package_daemon [8386729: 544] KERN: active package: "bottle_python3-0.12.17-1-any.hpkg"
2248KERN: package_daemon [8387039: 544] KERN: active package: "jasper1_devel-1.900.5-2-x86_64.hpkg"
2249KERN: package_daemon [8387359: 544] active package: "minizip-1.2.11-1-x86_64.hpkg"
2250KERN: package_daemon [8387657: 544] active package: "libyajl_devel-2.1.0-3-x86_64.hpkg"
2251KERN: package_daemon [8387970: 544] active package: "tar-1.32-1-x86_64.hpkg"
2252KERN: package_daemon [8388243: 544] active package: "nodejs-12.3.1-3-x86_64.hpkg"
2253KERN: package_daemon [8388530: 544] KERN: active package: "libcdio_paranoia-10.2_2.0.0-1-x86_64.hpkg"
2254KERN: package_daemon [8388868: 544] KERN: active package: "openvdb_devel-6.1.0-2-x86_64.hpkg"
2255KERN: package_daemon [8389180: 544] KERN: active package: "groff-1.22.3-1-x86_64.hpkg"
2256KERN: package_daemon [8389473: 544] active package: "git-2.23.0-1-x86_64.hpkg"
2257KERN: package_daemon [8389754: 544] active package: "fribidi_devel-1.0.5-1-x86_64.hpkg"
2258KERN: package_daemon [8390068: 544] active package: "funcsigs_python36-1.0.2-2-any.hpkg"
2259KERN: package_daemon [8390384: 544] active package: "beautifulsoup_python36-4.8.0-1-any.hpkg"
2260KERN: package_daemon [8390716: 544] KERN: active package: "vorbis_tools-1.4.0-4-x86_64.hpkg"
2261KERN: package_daemon [8391026: 544] KERN: active package: "nodejs_devel-12.3.1-3-x86_64.hpkg"
2262KERN: package_daemon [8391338: 544] KERN: active package: "mpv-0.29.1-5-x86_64.hpkg"
2263KERN: package_daemon [8391619: 544] KERN: active package: "opensubdiv_tools-3.4.0-1-x86_64.hpkg"
2264KERN: package_daemon [8391946: 544] active package: "attrs_python3-19.2.0-1-any.hpkg"
2265KERN: package_daemon [8392252: 544] active package: "libraw-0.19.5-1-x86_64.hpkg"
2266KERN: package_daemon [8392543: 544] active package: "uchardet_devel-0.0.6-2-x86_64.hpkg"
2267KERN: package_daemon [8392857: 544] KERN: active package: "libass_devel-0.14.0-2-x86_64.hpkg"
2268KERN: package_daemon [8393171: 544] KERN: active package: "openal-1.19.1-1-x86_64.hpkg"
2269KERN: package_daemon [8393461: 544] KERN: active package: "libgphoto2-2.5.19-1-x86_64.hpkg"
2270KERN: package_daemon [8393765: 544] active package: "markdown_python-3.1.1-1-any.hpkg"
2271KERN: package_daemon [8394074: 544] active package: "paladin-2.0-1-x86_64.hpkg"
2272KERN: package_daemon [8394360: 544] active package: "cryptography_python3-2.7-1-x86_64.hpkg"
2273KERN: package_daemon [8394692: 544] active package: "click_python3-8.0.1-1-any.hpkg"
2274KERN: package_daemon [8394993: 544] active package: "libmpdclient_devel-2.16-1-x86_64.hpkg"
2275KERN: package_daemon [8395324: 544] KERN: active package: "weechat-2.4-2-x86_64.hpkg"
2276KERN: package_daemon [8395607: 544] KERN: active package: "gutenprint8-5.3.1-1-x86_64.hpkg"
2277KERN: package_daemon [8395992: 544] KERN: The latest volume state is also the currently active one
2278KERN: package_daemon [8396353: 544] KERN: Volume::InitialVerify((nil), (nil))
2279KERN: package_daemon [8418352: 544] Volume::InitialVerify(): volume at "/boot/system" is consistent
2280KERN: package_daemon [8420066: 544] Failed to open packages activation file: No such file or directory
2281KERN: package_daemon [8420439: 544] KERN: Failed to get activated packages info from activated packages file. Assuming all package files in package directory are activated.
2282KERN: package_daemon [8421036: 544] KERN: latest volume state:
2283KERN: package_daemon [8421233: 544] KERN: The latest volume state is also the currently active one
2284KERN: package_daemon [8421581: 544] Volume::InitialVerify(0x7d0060, (nil))
2285KERN: package_daemon [8431175: 544] Volume::InitialVerify(): volume at "/boot/home/config" is consistent
2286KERN: [idualwifi7260] (iwm) fw chunk addr 0x800000 len 81920 failed to load
2287KERN: [idualwifi7260] (iwm) iwm_pcie_load_section: Could not load the [0] uCode section
2288KERN: [idualwifi7260] (iwm) iwm_start_fw: failed -2147483639
2289KERN: [idualwifi7260] (iwm) Failed to start INIT ucode: -2147483639
2290KERN: msi_free_vectors: freeing 1 vectors starting from 44
2291KERN: free_io_interrupt_vectors: freeing 1 vectors starting from 44
2292KERN: set MTRRs to:
2293KERN: mtrr: 0: base: 0xdcc00000, size: 0x200000, type: 0
2294KERN: mtrr: 1: base: 0xdce00000, size: 0x80000, type: 0
2295KERN: mtrr: 2: base: 0xdcec0000, size: 0x20000, type: 0
2296KERN: mtrr: 3: base: 0xdcee0000, size: 0x10000, type: 0
2297KERN: mtrr: 4: base: 0xdcef0000, size: 0x8000, type: 0
2298KERN: mtrr: 5: base: 0xdcefe000, size: 0x1000, type: 0
2299KERN: mtrr: 6: base: 0xf0000000, size: 0x10000000, type: 0
2300KERN: mtrr: 7: base: 0xe0000000, size: 0x20000000, type: 1
2301KERN: pci_unreserve_device(3, 0, 0, idualwifi7260)
2302KERN: loaded driver /boot/system/add-ons/kernel/drivers/dev/input/wacom
2303KERN: emuxki: init_hardware()
2304KERN: echo3g: init_hardware()
2305KERN: echo3g: no card found
2306KERN: pci_reserve_device(0, 3, 0, hda)
2307KERN: HDA: Detected controller @ PCI:0:3:0, IRQ:16, type 8086/0a0c (17aa/220c)
2308KERN: pci_reserve_device(0, 27, 0, hda)
2309KERN: HDA: Detected controller @ PCI:0:27:0, IRQ:22, type 8086/9c20 (17aa/220c)
2310KERN: loaded driver /boot/system/add-ons/kernel/drivers/dev/audio/hmulti/hda
2311KERN: auvia: init_hardware()
2312KERN: auich: init_hardware()
2313KERN: loaded driver /boot/system/add-ons/kernel/drivers/dev/net/pegasus
2314KERN: sis7018:init_hardware:ver:2.0.2
2315KERN: [33musb_asix:[0m00.12.990:init_driver::ver.0.10.1
2316KERN: loaded driver /boot/system/add-ons/kernel/drivers/dev/net/usb_asix
2317KERN: set MTRRs to:
2318KERN: mtrr: 0: base: 0xdcc00000, size: 0x200000, type: 0
2319KERN: mtrr: 1: base: 0xdce00000, size: 0x80000, type: 0
2320KERN: mtrr: 2: base: 0xdcec0000, size: 0x20000, type: 0
2321KERN: mtrr: 3: base: 0xdcee0000, size: 0x10000, type: 0
2322KERN: mtrr: 4: base: 0xdcef0000, size: 0x8000, type: 0
2323KERN: mtrr: 5: base: 0xdcefe000, size: 0x1000, type: 0
2324KERN: mtrr: 6: base: 0xf0000000, size: 0x10000000, type: 0
2325KERN: mtrr: 7: base: 0xe0000000, size: 0x20000000, type: 1
2326KERN: hda: enabling PCI bus mastering
2327KERN: allocate_io_interrupt_vectors: allocated 1 vectors starting from 44
2328KERN: msi_allocate_vectors: allocated 1 vectors starting from 44
2329KERN: msi enabled: 0x0001
2330KERN: hda: using MSI vector 44
2331KERN: hda: DMA snooping: yes
2332KERN: etherpci: init_driver KERN: hda: HDA v1.0, O:2/I:0/B:0, #SDO:1, 64bit:yes
2333KERN: init_driver: etherpci not found
2334KERN: hda: Codec 0 Vendor: 8086 Product: 2807, Revision: 1.0.0.0 Quirks: 0700
2335KERN: hda: Audio Group: Output delay: 4 samples, Input delay: 0 samples, Beep Generator: no
2336KERN: hda: #GPIO: 0, #GPO: 0, #GPI: 0, unsol: no, wake: no
2337KERN: hda: Supported formats:
2338KERN: hda: Supported rates:
2339KERN: hda: widget start 2, count 2
2340KERN: hda: 2: Audio output
2341KERN: hda: Supported formats: 16bits 20bits 24bits 32bits bitstream
2342KERN: hda: Supported rates: 32khz 44khz 48khz 88khz 96khz 176khz 192khz
2343KERN: hda: Supported power states: D0 D3
2344KERN: hda: [Power] [Digital] [Format override] [Stereo]
2345KERN: hda: 3: Pin complex
2346KERN: hda: [Output]
2347KERN: hda: Jack, HDMI Digital other out, Other digital, N/A, Association:1
2348KERN: hda: Supported power states: D0 D3
2349KERN: hda: [CP caps] [Power] [Digital] [Conn. list] [Unsol. responses] [Amplifier override] [Out amplifier] [Stereo]
2350KERN: hda: Out Amp: supports mute, step size: 0.25 dB, # steps: 0, offset to 0 dB: 0
2351KERN: hda: Inputs: <2>
2352KERN: hda: build output tree: use mixer
2353KERN: hda: look at pin widget 3 (1 inputs)
2354KERN: hda: try widget 2: 0xffffffff991d27b8
2355KERN: hda: try without mixer!
2356KERN: hda: build output tree: don't use mixer
2357KERN: hda: look at pin widget 3 (1 inputs)
2358KERN: hda: try widget 2: 0xffffffff991d27b8
2359KERN: hda: widget 2 is candidate
2360KERN: hda: output: added output widget 2
2361KERN: hda: add pin widget 3
2362KERN: hda: build input tree
2363KERN: hda: build input tree failed
2364KERN: hda: build tree!
2365KERN: hda: Audiogroup:
2366KERN: hda: 2: Audio output
2367KERN: hda: Supported power states: D0 D3
2368KERN: hda: [Power] [Digital] [Format override] [Stereo]
2369KERN: hda: 3: Pin complex
2370KERN: hda: [Pres Detect][Output]
2371KERN: hda: Supported power states: D0 D3
2372KERN: hda: [CP caps] [Power] [Digital] [Conn. list] [Unsol. responses] [Amplifier override] [Out amplifier] [Stereo]
2373KERN: hda: Out Amp: supports mute, step size: 0.25 dB, # steps: 0, offset to 0 dB: 0
2374KERN: hda: Inputs: <2>
2375KERN: hda: Enabled unsolicited responses on widget 3
2376KERN: hda: ENABLE pin widget 3
2377KERN: hda: UNMUTE/SET OUTPUT GAIN widget 3 (offset 0)
2378KERN: hda: hda_audio_group_get_widgets failed for playback stream
2379KERN: hda: hda_audio_group_get_widgets failed for record stream
2380KERN: hda: streams playback 0x0000000000000000, record 0x0000000000000000
2381KERN: hda: Failed to setup new audio function group (No such device)!
2382KERN: hda: no active codec
2383KERN: set MTRRs to:
2384KERN: mtrr: 0: base: 0xdcc00000, size: 0x200000, type: 0
2385KERN: mtrr: 1: base: 0xdce00000, size: 0x80000, type: 0
2386KERN: mtrr: 2: base: 0xdcec0000, size: 0x20000, type: 0
2387KERN: mtrr: 3: base: 0xdcee0000, size: 0x10000, type: 0
2388KERN: mtrr: 4: base: 0xdcef0000, size: 0x8000, type: 0
2389KERN: mtrr: 5: base: 0xdcefe000, size: 0x1000, type: 0
2390KERN: mtrr: 6: base: 0xf0000000, size: 0x10000000, type: 0
2391KERN: mtrr: 7: base: 0xe0000000, size: 0x20000000, type: 1
2392KERN: hda: ERROR: No such device(80007007)
2393KERN: set MTRRs to:
2394KERN: mtrr: 0: base: 0xdcc00000, size: 0x200000, type: 0
2395KERN: mtrr: 1: base: 0xdce00000, size: 0x80000, type: 0
2396KERN: mtrr: 2: base: 0xdcec0000, size: 0x20000, type: 0
2397KERN: mtrr: 3: base: 0xdcee0000, size: 0x10000, type: 0
2398KERN: mtrr: 4: base: 0xdcef0000, size: 0x8000, type: 0
2399KERN: mtrr: 5: base: 0xdcefe000, size: 0x1000, type: 0
2400KERN: mtrr: 6: base: 0xf0000000, size: 0x10000000, type: 0
2401KERN: mtrr: 7: base: 0xe0000000, size: 0x20000000, type: 1
2402KERN: hda: enabling PCI bus mastering
2403KERN: allocate_io_interrupt_vectors: allocated 1 vectors starting from 45
2404KERN: msi_allocate_vectors: allocated 1 vectors starting from 45
2405KERN: msi enabled: 0x0081
2406KERN: hda: using MSI vector 45
2407KERN: hda: DMA snooping: yes
2408KERN: hda: HDA v1.0, O:4/I:4/B:0, #SDO:1, 64bit:yes
2409KERN: hda: Codec 0 Vendor: 10ec Product: 0292, Revision: 1.0.0.1 Quirks: 0700
2410KERN: hda: Audio Group: Output delay: 15 samples, Input delay: 15 samples, Beep Generator: yes
2411KERN: hda: #GPIO: 5, #GPO: 0, #GPI: 0, unsol: yes, wake: no
2412KERN: hda: Supported formats: 16bits 20bits 24bits
2413KERN: hda: Supported rates: 32khz 44khz 48khz 88khz 96khz 192khz
2414KERN: hda: widget start 2, count 35
2415KERN: hda: 2: Audio output
2416KERN: hda: Supported formats: 16bits 20bits 24bits
2417KERN: hda: Supported rates: 44khz 48khz 96khz 192khz
2418KERN: hda: Supported power states: D0 D1 D2 D3
2419KERN: hda: [Power] [Format override] [Amplifier override] [Out amplifier] [Stereo]
2420KERN: hda: Out Amp: step size: 0.75 dB, # steps: 87, offset to 0 dB: 87
2421KERN: hda: 3: Audio output
2422KERN: hda: Supported formats: 16bits 20bits 24bits
2423KERN: hda: Supported rates: 44khz 48khz 96khz 192khz
2424KERN: hda: Supported power states: D0 D1 D2 D3
2425KERN: hda: [Power] [Format override] [Amplifier override] [Out amplifier] [Stereo]
2426KERN: hda: Out Amp: step size: 0.75 dB, # steps: 87, offset to 0 dB: 87
2427KERN: hda: 4: Vendor defined
2428KERN: hda: Supported power states:
2429KERN: hda: 5: Vendor defined
2430KERN: hda: Supported power states:
2431KERN: hda: 6: Audio output
2432KERN: hda: Supported formats: 16bits 20bits 24bits
2433KERN: hda: Supported rates: 32khz 44khz 48khz 88khz 96khz 192khz
2434KERN: hda: Supported power states: D0 D1 D2 D3
2435KERN: hda: [Power] [Digital] [Format override] [Stereo]
2436KERN: hda: 7: Vendor defined
2437KERN: hda: Supported power states:
2438KERN: hda: 8: Audio input
2439KERN: hda: Supported formats: 16bits 20bits 24bits
2440KERN: hda: Supported rates: 44khz 48khz 96khz 192khz
2441KERN: hda: Supported power states: D0 D1 D2 D3
2442KERN: hda: [Power] [Conn. list] [Format override] [Amplifier override] [In amplifier] [Stereo]
2443KERN: hda: In Amp: supports mute, step size: 0.75 dB, # steps: 63, offset to 0 dB: 23
2444KERN: hda: Inputs: <35>
2445KERN: hda: 9: Audio input
2446KERN: hda: Supported formats: 16bits 20bits 24bits
2447KERN: hda: Supported rates: 44khz 48khz 96khz 192khz
2448KERN: hda: Supported power states: D0 D1 D2 D3
2449KERN: hda: [Power] [Conn. list] [Format override] [Amplifier override] [In amplifier] [Stereo]
2450KERN: hda: In Amp: supports mute, step size: 0.75 dB, # steps: 63, offset to 0 dB: 23
2451KERN: hda: Inputs: <34>
2452KERN: hda: 10: Vendor defined
2453KERN: hda: Supported power states:
2454KERN: hda: 11: Audio mixer
2455KERN: hda: Supported power states: D0
2456KERN: hda: [Conn. list] [Amplifier override] [In amplifier] [Stereo]
2457KERN: hda: In Amp: supports mute, step size: 1.5 dB, # steps: 31, offset to 0 dB: 23
2458KERN: hda: Inputs: 24 25 26 27 29
2459KERN: hda: 12: Audio mixer
2460KERN: hda: Supported power states: D0
2461KERN: hda: [Conn. list] [Amplifier override] [In amplifier] [Stereo]
2462KERN: hda: In Amp: supports mute, step size: 0.25 dB, # steps: 0, offset to 0 dB: 0
2463KERN: hda: Inputs: 2 11
2464KERN: hda: 13: Audio mixer
2465KERN: hda: Supported power states: D0
2466KERN: hda: [Conn. list] [Amplifier override] [In amplifier] [Stereo]
2467KERN: hda: In Amp: supports mute, step size: 0.25 dB, # steps: 0, offset to 0 dB: 0
2468KERN: hda: Inputs: 3 11
2469KERN: hda: 14: Vendor defined
2470KERN: hda: Supported power states:
2471KERN: hda: 15: Audio mixer
2472KERN: hda: Supported power states: D0
2473KERN: hda: [Conn. list] [Amplifier override] [In amplifier]
2474KERN: hda: In Amp: supports mute, step size: 0.25 dB, # steps: 0, offset to 0 dB: 0
2475KERN: hda: Inputs: 2 3
2476KERN: hda: 16: Vendor defined
2477KERN: hda: Supported power states:
2478KERN: hda: 17: Vendor defined
2479KERN: hda: Supported power states:
2480KERN: hda: 18: Pin complex
2481KERN: hda: [Input]
2482KERN: hda: Fixed, Mic in, Other digital, N/A, Association:3
2483KERN: hda: Supported power states: D0 D1 D2 D3
2484KERN: hda: [Power] [Amplifier override] [In amplifier] [Stereo]
2485KERN: hda: In Amp: step size: 12 dB, # steps: 3, offset to 0 dB: 0
2486KERN: hda: 19: Pin complex
2487KERN: hda: [Input]
2488KERN: hda: None, Line out, N/A, N/A, Association:0
2489KERN: hda: Supported power states: D0 D1 D2 D3
2490KERN: hda: [Power] [Amplifier override] [In amplifier] [Stereo]
2491KERN: hda: In Amp: step size: 12 dB, # steps: 3, offset to 0 dB: 0
2492KERN: hda: 20: Pin complex
2493KERN: hda: [Output]
2494KERN: hda: Fixed, Speaker, Other analog, N/A, Association:1
2495KERN: hda: Supported power states: D0 D1 D2 D3
2496KERN: hda: [Power] [Conn. list] [Unsol. responses] [Amplifier override] [Out amplifier] [Stereo]
2497KERN: hda: Out Amp: supports mute, step size: 0.25 dB, # steps: 0, offset to 0 dB: 0
2498KERN: hda: Inputs: 12 13
2499KERN: hda: 21: Pin complex
2500KERN: hda: [Output]
2501KERN: hda: Jack, Left HP out, 1/8", Black, Association:1
2502KERN: hda: Supported power states: D0 D1 D2 D3
2503KERN: hda: [Power] [Conn. list] [Unsol. responses] [Amplifier override] [Out amplifier] [Stereo]
2504KERN: hda: Out Amp: supports mute, step size: 0.25 dB, # steps: 0, offset to 0 dB: 0
2505KERN: hda: Inputs: 12 13
2506KERN: hda: 22: Pin complex
2507KERN: hda: [Output]
2508KERN: hda: None, Speaker, 1/8", Black, Association:15
2509KERN: hda: Supported power states: D0 D1 D2 D3
2510KERN: hda: [Power] [Conn. list] [Unsol. responses] [Amplifier override] [Out amplifier] [Stereo]
2511KERN: hda: Out Amp: supports mute, step size: 0.25 dB, # steps: 0, offset to 0 dB: 0
2512KERN: hda: Inputs: 12 13
2513KERN: hda: 23: Vendor defined
2514KERN: hda: Supported power states:
2515KERN: hda: 24: Pin complex
2516KERN: hda: [Input] [Output]
2517KERN: hda: None, Speaker, 1/8", Black, Association:15
2518KERN: hda: Supported power states: D0 D1 D2 D3
2519KERN: hda: [Power] [Conn. list] [Unsol. responses] [Amplifier override] [Out amplifier] [In amplifier] [Stereo]
2520KERN: hda: In Amp: step size: 10 dB, # steps: 3, offset to 0 dB: 0
2521KERN: hda: Out Amp: supports mute, step size: 0.25 dB, # steps: 0, offset to 0 dB: 0
2522KERN: hda: Inputs: 12 13
2523KERN: hda: 25: Pin complex
2524KERN: hda: [Input]
2525KERN: hda: None, Speaker, 1/8", Black, Association:15
2526KERN: hda: Supported power states: D0 D1 D2 D3
2527KERN: hda: [Power] [Unsol. responses] [Amplifier override] [In amplifier] [Stereo]
2528KERN: hda: In Amp: step size: 12 dB, # steps: 3, offset to 0 dB: 0
2529KERN: hda: 26: Pin complex
2530KERN: hda: [Input]
2531KERN: hda: Jack, Left Mic in, 1/8", Black, Association:2
2532KERN: hda: Supported power states: D0 D1 D2 D3
2533KERN: hda: [Power] [Unsol. responses] [Amplifier override] [In amplifier] [Stereo]
2534KERN: hda: In Amp: step size: 10 dB, # steps: 3, offset to 0 dB: 0
2535KERN: hda: 27: Pin complex
2536KERN: hda: [Input] [Output]
2537KERN: hda: None, Speaker, 1/8", Black, Association:15
2538KERN: hda: Supported power states: D0 D1 D2 D3
2539KERN: hda: [Power] [Conn. list] [Unsol. responses] [Amplifier override] [Out amplifier] [In amplifier] [Stereo]
2540KERN: hda: In Amp: step size: 10 dB, # steps: 3, offset to 0 dB: 0
2541KERN: hda: Out Amp: supports mute, step size: 0.25 dB, # steps: 0, offset to 0 dB: 0
2542KERN: hda: Inputs: 12 13
2543KERN: hda: 28: Vendor defined
2544KERN: hda: Supported power states:
2545KERN: hda: 29: Pin complex
2546KERN: hda: [Input]
2547KERN: hda: None, Modem hand side, ATAPI internal, Purple, Association:0
2548KERN: hda: Supported power states: D0 D1 D2 D3
2549KERN: hda: [Power]
2550KERN: hda: 30: Pin complex
2551KERN: hda: [Output]
2552KERN: hda: None, Speaker, 1/8", Black, Association:15
2553KERN: hda: Supported power states: D0 D1 D2 D3
2554KERN: hda: [Power] [Digital] [Conn. list] [Unsol. responses] [Stereo]
2555KERN: hda: Inputs: <6>
2556KERN: hda: 31: Vendor defined
2557KERN: hda: Supported power states:
2558KERN: hda: 32: Vendor defined
2559KERN: hda: Supported power states:
2560KERN: hda: [Proc widget]
2561KERN: hda: 33: Vendor defined
2562KERN: hda: Supported power states:
2563KERN: hda: 34: Audio selector
2564KERN: hda: Supported power states: D0
2565KERN: hda: [Conn. list] [Stereo]
2566KERN: hda: Inputs: 24 25 26 27 29 11 18 19
2567KERN: hda: 35: Audio selector
2568KERN: hda: Supported power states: D0
2569KERN: hda: [Conn. list] [Stereo]
2570KERN: hda: Inputs: 24 25 26 27 29 11
2571KERN: hda: 36: Vendor defined
2572KERN: hda: Supported power states:
2573KERN: hda: build output tree: use mixer
2574KERN: hda: look at pin widget 20 (2 inputs)
2575KERN: hda: try widget 12: 0xffffffff8299aeb8
2576KERN: hda: widget 12 is candidate
2577KERN: hda: output: added output widget 2
2578KERN: hda: output: added mixer/selector widget 12
2579KERN: hda: output: not added mixer/selector widget 11
2580KERN: hda: add pin widget 20
2581KERN: hda: look at pin widget 21 (2 inputs)
2582KERN: hda: try widget 12: 0xffffffff8299aeb8
2583KERN: hda: widget 12 is candidate
2584KERN: hda: add pin widget 21
2585KERN: hda: look at pin widget 22 (2 inputs)
2586KERN: hda: try widget 12: 0xffffffff8299aeb8
2587KERN: hda: widget 12 is candidate
2588KERN: hda: try widget 13: 0xffffffff8299af64
2589KERN: hda: widget 13 is candidate
2590KERN: hda: output: added output widget 3
2591KERN: hda: output: added mixer/selector widget 13
2592KERN: hda: output: not added mixer/selector widget 11
2593KERN: hda: add pin widget 22
2594KERN: hda: look at pin widget 24 (2 inputs)
2595KERN: hda: try widget 12: 0xffffffff8299aeb8
2596KERN: hda: widget 12 is candidate
2597KERN: hda: try widget 13: 0xffffffff8299af64
2598KERN: hda: widget 13 is candidate
2599KERN: hda: look at pin widget 27 (2 inputs)
2600KERN: hda: try widget 12: 0xffffffff8299aeb8
2601KERN: hda: widget 12 is candidate
2602KERN: hda: try widget 13: 0xffffffff8299af64
2603KERN: hda: widget 13 is candidate
2604KERN: hda: look at pin widget 30 (1 inputs)
2605KERN: hda: try widget 6: 0xffffffff8299aab0
2606KERN: hda: build input tree
2607KERN: hda: look at input widget 8 (1 inputs)
2608KERN: hda: try widget 35: 0xffffffff8299be2c
2609KERN: hda: widget 35 is candidate
2610KERN: hda: input: added input widget 26
2611KERN: hda: input: added mixer/selector widget 35
2612KERN: hda: input: not added mixer/selector widget 11
2613KERN: hda: add pin widget 8
2614KERN: hda: look at input widget 9 (1 inputs)
2615KERN: hda: try widget 34: 0xffffffff8299bd80
2616KERN: hda: widget 34 is candidate
2617KERN: hda: input: not added mixer/selector widget 11
2618KERN: hda: input: added input widget 18
2619KERN: hda: input: added mixer/selector widget 34
2620KERN: hda: add pin widget 9
2621KERN: hda: build tree!
2622KERN: hda: Audiogroup:
2623KERN: hda: 2: Audio output
2624KERN: hda: Supported power states: D0 D1 D2 D3
2625KERN: hda: [Power] [Format override] [Amplifier override] [Out amplifier] [Stereo]
2626KERN: hda: Out Amp: step size: 0.75 dB, # steps: 87, offset to 0 dB: 87
2627KERN: hda: 3: Audio output
2628KERN: hda: Supported power states: D0 D1 D2 D3
2629KERN: hda: [Power] [Format override] [Amplifier override] [Out amplifier] [Stereo]
2630KERN: hda: Out Amp: step size: 0.75 dB, # steps: 87, offset to 0 dB: 87
2631KERN: hda: 4: Vendor defined
2632KERN: hda: Supported power states:
2633KERN: hda: 5: Vendor defined
2634KERN: hda: Supported power states:
2635KERN: hda: 6: Audio output
2636KERN: hda: Supported power states: D0 D1 D2 D3
2637KERN: hda: [Power] [Digital] [Format override] [Stereo]
2638KERN: hda: 7: Vendor defined
2639KERN: hda: Supported power states:
2640KERN: hda: 8: Audio input
2641KERN: hda: Supported power states: D0 D1 D2 D3
2642KERN: hda: [Power] [Conn. list] [Format override] [Amplifier override] [In amplifier] [Stereo]
2643KERN: hda: In Amp: supports mute, step size: 0.75 dB, # steps: 63, offset to 0 dB: 23
2644KERN: hda: Inputs: <35>
2645KERN: hda: 9: Audio input
2646KERN: hda: Supported power states: D0 D1 D2 D3
2647KERN: hda: [Power] [Conn. list] [Format override] [Amplifier override] [In amplifier] [Stereo]
2648KERN: hda: In Amp: supports mute, step size: 0.75 dB, # steps: 63, offset to 0 dB: 23
2649KERN: hda: Inputs: <34>
2650KERN: hda: 10: Vendor defined
2651KERN: hda: Supported power states:
2652KERN: hda: 11: Audio mixer
2653KERN: hda: Supported power states: D0
2654KERN: hda: [Conn. list] [Amplifier override] [In amplifier] [Stereo]
2655KERN: hda: In Amp: supports mute, step size: 1.5 dB, # steps: 31, offset to 0 dB: 23
2656KERN: hda: Inputs: <24> 25 26 27 29
2657KERN: hda: 12: Audio mixer
2658KERN: hda: Supported power states: D0
2659KERN: hda: [Conn. list] [Amplifier override] [In amplifier] [Stereo]
2660KERN: hda: In Amp: supports mute, step size: 0.25 dB, # steps: 0, offset to 0 dB: 0
2661KERN: hda: Inputs: <2> 11
2662KERN: hda: 13: Audio mixer
2663KERN: hda: Supported power states: D0
2664KERN: hda: [Conn. list] [Amplifier override] [In amplifier] [Stereo]
2665KERN: hda: In Amp: supports mute, step size: 0.25 dB, # steps: 0, offset to 0 dB: 0
2666KERN: hda: Inputs: <3> 11
2667KERN: hda: 14: Vendor defined
2668KERN: hda: Supported power states:
2669KERN: hda: 15: Audio mixer
2670KERN: hda: Supported power states: D0
2671KERN: hda: [Conn. list] [Amplifier override] [In amplifier]
2672KERN: hda: In Amp: supports mute, step size: 0.25 dB, # steps: 0, offset to 0 dB: 0
2673KERN: hda: Inputs: <2> 3
2674KERN: hda: 16: Vendor defined
2675KERN: hda: Supported power states:
2676KERN: hda: 17: Vendor defined
2677KERN: hda: Supported power states:
2678KERN: hda: 18: Pin complex
2679KERN: hda: [Input]
2680KERN: hda: Supported power states: D0 D1 D2 D3
2681KERN: hda: [Power] [Amplifier override] [In amplifier] [Stereo]
2682KERN: hda: In Amp: step size: 12 dB, # steps: 3, offset to 0 dB: 0
2683KERN: hda: 19: Pin complex
2684KERN: hda: [Input]
2685KERN: hda: Supported power states: D0 D1 D2 D3
2686KERN: hda: [Power] [Amplifier override] [In amplifier] [Stereo]
2687KERN: hda: In Amp: step size: 12 dB, # steps: 3, offset to 0 dB: 0
2688KERN: hda: 20: Pin complex
2689KERN: hda: [Output][EAPD]
2690KERN: hda: Supported power states: D0 D1 D2 D3
2691KERN: hda: [Power] [Conn. list] [Unsol. responses] [Amplifier override] [Out amplifier] [Stereo]
2692KERN: hda: Out Amp: supports mute, step size: 0.25 dB, # steps: 0, offset to 0 dB: 0
2693KERN: hda: Inputs: <12> 13
2694KERN: hda: 21: Pin complex
2695KERN: hda: [Pres Detect][HP Drive][Output][EAPD]
2696KERN: hda: Supported power states: D0 D1 D2 D3
2697KERN: hda: [Power] [Conn. list] [Unsol. responses] [Amplifier override] [Out amplifier] [Stereo]
2698KERN: hda: Out Amp: supports mute, step size: 0.25 dB, # steps: 0, offset to 0 dB: 0
2699KERN: hda: Inputs: <12> 13
2700KERN: hda: 22: Pin complex
2701KERN: hda: [Pres Detect][HP Drive][Output][EAPD]
2702KERN: hda: Supported power states: D0 D1 D2 D3
2703KERN: hda: [Power] [Conn. list] [Unsol. responses] [Amplifier override] [Out amplifier] [Stereo]
2704KERN: hda: Out Amp: supports mute, step size: 0.25 dB, # steps: 0, offset to 0 dB: 0
2705KERN: hda: Inputs: 12 <13>
2706KERN: hda: 23: Vendor defined
2707KERN: hda: Supported power states:
2708KERN: hda: 24: Pin complex
2709KERN: hda: [Pres Detect][Output][Input][VRef HIZ][VRef 50][VRef Gr][VRef 80][VRef 100]
2710KERN: hda: Supported power states: D0 D1 D2 D3
2711KERN: hda: [Power] [Conn. list] [Unsol. responses] [Amplifier override] [Out amplifier] [In amplifier] [Stereo]
2712KERN: hda: In Amp: step size: 10 dB, # steps: 3, offset to 0 dB: 0
2713KERN: hda: Out Amp: supports mute, step size: 0.25 dB, # steps: 0, offset to 0 dB: 0
2714KERN: hda: Inputs: <12> 13
2715KERN: hda: 25: Pin complex
2716KERN: hda: [Pres Detect][Input]
2717KERN: hda: Supported power states: D0 D1 D2 D3
2718KERN: hda: [Power] [Unsol. responses] [Amplifier override] [In amplifier] [Stereo]
2719KERN: hda: In Amp: step size: 12 dB, # steps: 3, offset to 0 dB: 0
2720KERN: hda: 26: Pin complex
2721KERN: hda: [Pres Detect][Input][VRef HIZ][VRef 50][VRef Gr][VRef 80][VRef 100]
2722KERN: hda: Supported power states: D0 D1 D2 D3
2723KERN: hda: [Power] [Unsol. responses] [Amplifier override] [In amplifier] [Stereo]
2724KERN: hda: In Amp: step size: 10 dB, # steps: 3, offset to 0 dB: 0
2725KERN: hda: 27: Pin complex
2726KERN: hda: [Pres Detect][Output][Input][VRef HIZ][VRef 50][VRef Gr][VRef 80][VRef 100]
2727KERN: hda: Supported power states: D0 D1 D2 D3
2728KERN: hda: [Power] [Conn. list] [Unsol. responses] [Amplifier override] [Out amplifier] [In amplifier] [Stereo]
2729KERN: hda: In Amp: step size: 10 dB, # steps: 3, offset to 0 dB: 0
2730KERN: hda: Out Amp: supports mute, step size: 0.25 dB, # steps: 0, offset to 0 dB: 0
2731KERN: hda: Inputs: <12> 13
2732KERN: hda: 28: Vendor defined
2733KERN: hda: Supported power states:
2734KERN: hda: 29: Pin complex
2735KERN: hda: [Input]
2736KERN: hda: Supported power states: D0 D1 D2 D3
2737KERN: hda: [Power]
2738KERN: hda: 30: Pin complex
2739KERN: hda: [Pres Detect][Output]
2740KERN: hda: Supported power states: D0 D1 D2 D3
2741KERN: hda: [Power] [Digital] [Conn. list] [Unsol. responses] [Stereo]
2742KERN: hda: Inputs: <6>
2743KERN: hda: 31: Vendor defined
2744KERN: hda: Supported power states:
2745KERN: hda: 32: Vendor defined
2746KERN: hda: Supported power states:
2747KERN: hda: [Proc widget]
2748KERN: hda: 33: Vendor defined
2749KERN: hda: Supported power states:
2750KERN: hda: 34: Audio selector
2751KERN: hda: Supported power states: D0
2752KERN: loaded driver /boot/system/add-ons/kernel/drivers/dev/net/usb_ecm
2753KERN: hda: [Conn. list] [Stereo]
2754KERN: hda: Inputs: 24 25 26 27 29 11 <18> 19
2755KERN: hda: 35: Audio selector
2756KERN: hda: Supported power states: D0
2757KERN: hda: [Conn. list] [Stereo]
2758KERN: hda: Inputs: 24 25 <26> 27 29 11
2759KERN: hda: 36: Vendor defined
2760KERN: hda: Supported power states:
2761KERN: hda: Enabled unsolicited responses on widget 21
2762KERN: hda: Enabled unsolicited responses on widget 26
2763KERN: hda: UNMUTE/SET OUTPUT GAIN widget 2 (offset 87)
2764KERN: hda: UNMUTE/SET OUTPUT GAIN widget 3 (offset 87)
2765KERN: hda: UNMUTE/SET INPUT GAIN widget 12 (offset 0)
2766KERN: hda: UNMUTE/SET INPUT GAIN widget 13 (offset 0)
2767KERN: hda: ENABLE pin widget 20
2768KERN: hda: ENABLE EAPD pin widget 20
2769KERN: hda: UNMUTE/SET OUTPUT GAIN widget 20 (offset 0)
2770KERN: hda: ENABLE pin widget 21
2771KERN: hda: ENABLE EAPD pin widget 21
2772KERN: hda: UNMUTE/SET OUTPUT GAIN widget 21 (offset 0)
2773KERN: hda: ENABLE pin widget 22
2774KERN: hda: ENABLE EAPD pin widget 22
2775KERN: hda: UNMUTE/SET OUTPUT GAIN widget 22 (offset 0)
2776KERN: hda: UNMUTE/SET INPUT GAIN widget 8 (offset 23)
2777KERN: hda: UNMUTE/SET INPUT GAIN widget 9 (offset 23)
2778KERN: hda: ENABLE pin widget 18
2779KERN: hda: UNMUTE/SET INPUT GAIN widget 18 (offset 0)
2780KERN: hda: input vref 50 enabled
2781KERN: hda: input vref 80 enabled
2782KERN: hda: input vref 100 enabled
2783KERN: hda: ENABLE pin widget 26
2784KERN: hda: UNMUTE/SET INPUT GAIN widget 26 (offset 0)
2785KERN: hda: streams playback 0xffffffff996d7be0, record 0xffffffff996d8d18
2786KERN: hda: sensed pin widget 21, 0
2787KERN: looking for settings file
2788KERN: hda: sample size 4, num channels 2, buffer length 10240
2789KERN: hda: hda_stream_setup_buffers: setup stream 1: SR=192000, SF=24 F=0x1831 (0x100)
2790KERN: hda: hda_stream_setup_buffers(Playback): Allocated 163840 bytes for 2 buffers
2791KERN: hda: hda_stream_setup_buffers(Playback): Allocated 4096 bytes for 2 BDLEs
2792KERN: hda: stream: 1 fifo size: 1536 num_io_widgets: 2
2793KERN: hda: widgets: KERN: 2 KERN: 3
2794KERN: hda: sample size 4, num channels 2, buffer length 10240
2795KERN: hda: hda_stream_setup_buffers: setup stream 2: SR=192000, SF=24 F=0x1831 (0x100)
2796KERN: hda: hda_stream_setup_buffers(Recording): Allocated 163840 bytes for 2 buffers
2797KERN: hda: hda_stream_setup_buffers(Recording): Allocated 4096 bytes for 2 BDLEs
2798KERN: hda: stream: 2 fifo size: 1536 num_io_widgets: 2
2799KERN: hda: widgets: KERN: 8 KERN: 9
2800KERN: hda: couldn't find a string for widget 29 in hda_find_multi_custom_string()
2801KERN: Last message repeated 2 times.
2802KERN: hda_stream_start() offset 80
2803KERN: hda_stream_start() offset 0
2804KERN: [net/ipro1000/0] compat_open(0x2)
2805KERN: Highpoint-IDE: supports_device()
2806Last message repeated 1 time
2807KERN: loaded driver /boot/system/add-ons/kernel/drivers/dev/bus/usb_raw
2808KERN: ifmedia_ioctl: switching em to Type: Ethernet
2809KERN: SubType: autoselect
2810KERN: ps2: keyboard found
2811KERN: usb_hid: keyboard device unhandled control 0x00002710
2812KERN: Last message repeated 2 times.
2813KERN: register_domain(9, unix)
2814KERN: /dev/net/ipro1000/0: media change, media 0x20 quality 1000 speed 1000000000
2815KERN: acquire_advisory_lock(vnode = 0xffffffff99a0de80, flock = 0xffffffff92ff7e90, wait = no)
2816AUTH 'sshd'[692]: error: setsockopt IPV6_V6ONLY: Operation not supported
2817AUTH 'sshd'[692]: Server listening on :: port 22.
2818AUTH 'sshd'[692]: Server listening on 0.0.0.0 port 22.
2819AUTH 'sshd'[692]: error: Couldn't create pid file "/packages/openssh-7.9p1-3/.self/var/run/sshd.pid": No such file or directory
2820KERN: Last message repeated 5 times.
2821KERN: bfs: bfs_create_index:2174: File or Directory already exists
2822KERN: Last message repeated 7 times.
2823KERN: ps2: devfs_publish_device input/mouse/ps2/ibm_trackpoint_0, status = 0x00000000