Ticket #3375: pci-cpp-fail.txt

File pci-cpp-fail.txt, 21.5 KB (added by umccullough, 13 years ago)

build failure on pci.cpp

Line 
1C++ generated/objects/linux/x86/release/tools/fs_shell/path_util.o
2C++ generated/objects/linux/x86/release/tools/fs_shell/rootfs.o
3C++ generated/objects/linux/x86/release/tools/fs_shell/sem.o
4C++ generated/objects/linux/x86/release/tools/fs_shell/stat.o
5C++ generated/objects/linux/x86/release/tools/fs_shell/stat_util.o
6C++ generated/objects/linux/x86/release/tools/fs_shell/stdio.o
7C++ generated/objects/linux/x86/release/tools/fs_shell/string.o
8C++ generated/objects/linux/x86/release/tools/fs_shell/thread.o
9C++ generated/objects/linux/x86/release/tools/fs_shell/time.o
10C++ generated/objects/linux/x86/release/tools/fs_shell/uio.o
11C++ generated/objects/linux/x86/release/tools/fs_shell/unistd.o
12C++ generated/objects/linux/x86/release/tools/fs_shell/vfs.o
13src/tools/fs_shell/vfs.cpp: In function âfssh_status_t FSShell::vfs_init(FSShell::kernel_args*)â:
14src/tools/fs_shell/vfs.cpp:2879: warning: invalid access to non-static data member âFSShell::vnode::nextâ of NULL object
15src/tools/fs_shell/vfs.cpp:2879: warning: (perhaps the âoffsetofâ macro was used incorrectly)
16src/tools/fs_shell/vfs.cpp:2884: warning: invalid access to non-static data member âFSShell::vnode::unused_linkâ of NULL object
17src/tools/fs_shell/vfs.cpp:2884: warning: (perhaps the âoffsetofâ macro was used incorrectly)
18src/tools/fs_shell/vfs.cpp: In function âfssh_dev_t FSShell::fs_mount(char*, const char*, const char*, uint32_t, const char*, bool)â:
19src/tools/fs_shell/vfs.cpp:4555: warning: invalid access to non-static data member âFSShell::vnode::mount_linkâ of NULL object
20src/tools/fs_shell/vfs.cpp:4555: warning: (perhaps the âoffsetofâ macro was used incorrectly)
21C++ generated/objects/linux/x86/release/tools/fs_shell/external_commands_unix.o
22C++ generated/objects/linux/x86/release/tools/fs_shell/fssh.o
23Archive generated/objects/linux/x86/release/tools/fs_shell/fs_shell.a
24ar: creating generated/objects/linux/x86/release/tools/fs_shell/fs_shell.a
25Ranlib generated/objects/linux/x86/release/tools/fs_shell/fs_shell.a
26Link generated/objects/linux/x86/release/tools/bfs_shell/bfs_shell
27Chmod1 generated/objects/linux/x86/release/tools/bfs_shell/bfs_shell
28C++ generated/objects/linux/x86/release/tools/fs_shell/fs_shell_command.o
29C++ generated/objects/linux/x86/release/tools/fs_shell/fs_shell_command_unix.o
30Link generated/objects/linux/x86/release/tools/fs_shell/fs_shell_command
31Chmod1 generated/objects/linux/x86/release/tools/fs_shell/fs_shell_command
32C++ generated/objects/linux/x86/release/tools/copyattr.o
33Link generated/objects/linux/x86/release/tools/copyattr
34Chmod1 generated/objects/linux/x86/release/tools/copyattr
35MkDir1 generated/objects/linux/x86/release/tools/makebootable
36MkDir1 generated/objects/linux/x86/release/tools/makebootable/platform
37MkDir1 generated/objects/linux/x86/release/tools/makebootable/platform/bios_ia32
38C++ generated/objects/linux/x86/release/tools/makebootable/platform/bios_ia32/makebootable.o
39src/bin/makebootable/platform/bios_ia32/makebootable.cpp: In function âint main(int, const char* const*)â:
40src/bin/makebootable/platform/bios_ia32/makebootable.cpp:615: warning: format â%dâ expects type âintâ, but argument 4 has type âoff_tâ
41C++ generated/objects/linux/x86/release/tools/makebootable/platform/bios_ia32/PartitionMap.o
42C++ generated/objects/linux/x86/release/tools/makebootable/platform/bios_ia32/PartitionMapParser.o
43C++ generated/objects/linux/x86/release/tools/xres.o
44src/bin/xres.cpp: In member function âvirtual void ListState::ProcessInput(const char*)â:
45src/bin/xres.cpp:358: warning: format â%11luâ expects type âlong unsigned intâ, but argument 4 has type âsize_tâ
46Link generated/objects/linux/x86/release/tools/xres
47Chmod1 generated/objects/linux/x86/release/tools/xres
48MkDir1 generated/objects/haiku
49MkDir1 generated/objects/haiku/x86
50MkDir1 generated/objects/haiku/x86/common
51MkDir1 generated/objects/haiku/x86/common/bin
52MkDir1 generated/objects/haiku/x86/common/bin/makebootable
53MkDir1 generated/objects/haiku/x86/common/bin/makebootable/platform
54MkDir1 generated/objects/haiku/x86/common/bin/makebootable/platform/bios_ia32
55AddFileDataResource1 generated/objects/haiku/x86/common/bin/makebootable/platform/bios_ia32/file-data-RAWT:666:BootCode-stage1.bin.rsrc
56Link generated/objects/linux/x86/release/tools/makebootable/platform/bios_ia32/makebootable
57XRes1 generated/objects/linux/x86/release/tools/makebootable/platform/bios_ia32/makebootable
58Chmod1 generated/objects/linux/x86/release/tools/makebootable/platform/bios_ia32/makebootable
59MkDir1 generated/objects/linux/x86/release/tools/rc
60C++ generated/objects/linux/x86/release/tools/rc/rc.o
61MkDir1 generated/objects/linux/x86/common
62MkDir1 generated/objects/linux/x86/common/tools
63MkDir1 generated/objects/linux/x86/common/tools/rc
64Yacc1 generated/objects/linux/x86/common/tools/rc/parser.cpp generated/objects/linux/x86/common/tools/rc/parser.hpp
65C++ generated/objects/linux/x86/release/tools/rc/compile.o
66C++ generated/objects/linux/x86/release/tools/rc/decompile.o
67src/bin/rc/decompile.cpp: In function âvoid write_size(const char*, const void*, size_t)â:
68src/bin/rc/decompile.cpp:412: warning: format â%luâ expects type âlong unsigned intâ, but argument 3 has type âunsigned intâ
69src/bin/rc/decompile.cpp: In function âvoid write_ssize(const char*, const void*, size_t)â:
70src/bin/rc/decompile.cpp:424: warning: format â%ldâ expects type âlong intâ, but argument 3 has type âintâ
71Lex generated/objects/linux/x86/common/tools/rc/lexer.cpp
72C++ generated/objects/linux/x86/release/tools/rc/lexer.o
73C++ generated/objects/linux/x86/release/tools/rc/parser.o
74C++ generated/objects/linux/x86/release/tools/rc/rdef.o
75Archive generated/objects/linux/x86/release/tools/rc/librdef.a
76ar: creating generated/objects/linux/x86/release/tools/rc/librdef.a
77Ranlib generated/objects/linux/x86/release/tools/rc/librdef.a
78Link generated/objects/linux/x86/release/tools/rc/rc
79Chmod1 generated/objects/linux/x86/release/tools/rc/rc
80MkDir1 generated/objects/linux/x86/release/tools/resattr
81C++ generated/objects/linux/x86/release/tools/resattr/resattr.o
82Link generated/objects/linux/x86/release/tools/resattr/resattr
83Chmod1 generated/objects/linux/x86/release/tools/resattr/resattr
84MkDir1 generated/objects/linux/x86/release/tools/unzip
85Cc generated/objects/linux/x86/release/tools/unzip/unzip.o
86Cc generated/objects/linux/x86/release/tools/unzip/unreduce.o
87Cc generated/objects/linux/x86/release/tools/unzip/unshrink.o
88Cc generated/objects/linux/x86/release/tools/unzip/crc32.o
89Cc generated/objects/linux/x86/release/tools/unzip/ttyio.o
90Cc generated/objects/linux/x86/release/tools/unzip/crctab.o
91Cc generated/objects/linux/x86/release/tools/unzip/crypt.o
92Cc generated/objects/linux/x86/release/tools/unzip/envargs.o
93Cc generated/objects/linux/x86/release/tools/unzip/explode.o
94Cc generated/objects/linux/x86/release/tools/unzip/extract.o
95Cc generated/objects/linux/x86/release/tools/unzip/fileio.o
96Cc generated/objects/linux/x86/release/tools/unzip/globals.o
97Cc generated/objects/linux/x86/release/tools/unzip/inflate.o
98src/bin/unzip/inflate.c: In function âhuft_buildâ:
99src/bin/unzip/inflate.c:1395: warning: signed and unsigned type in conditional expression
100Cc generated/objects/linux/x86/release/tools/unzip/list.o
101Cc generated/objects/linux/x86/release/tools/unzip/match.o
102src/bin/unzip/match.c: In function ârecmatchâ:
103src/bin/unzip/match.c:254: warning: signed and unsigned type in conditional expression
104src/bin/unzip/match.c:254: warning: signed and unsigned type in conditional expression
105Cc generated/objects/linux/x86/release/tools/unzip/process.o
106Cc generated/objects/linux/x86/release/tools/unzip/zipinfo.o
107Cc generated/objects/linux/x86/release/tools/unzip/beos.o
108In file included from headers/build/os/kernel/fs_attr.h:9,
109 from src/bin/unzip/beos.c:45:
110headers/build/os/kernel/OS.h:357: warning: type qualifiers ignored on function return type
111C++ generated/objects/linux/x86/release/tools/unzip/beosmain.o
112Archive generated/objects/linux/x86/release/tools/unzip/libunzip.a
113ar: creating generated/objects/linux/x86/release/tools/unzip/libunzip.a
114Ranlib generated/objects/linux/x86/release/tools/unzip/libunzip.a
115Link generated/objects/linux/x86/release/tools/unzip/unzip
116Chmod1 generated/objects/linux/x86/release/tools/unzip/unzip
117MkDir1 generated/objects/linux/x86/release/tools/vmdkimage
118C++ generated/objects/linux/x86/release/tools/vmdkimage/vmdkimage.o
119Link generated/objects/linux/x86/release/tools/vmdkimage/vmdkimage
120Chmod1 generated/objects/linux/x86/release/tools/vmdkimage/vmdkimage
121MkDir1 generated/objects/haiku/x86/release
122...on 200th target...
123MkDir1 generated/objects/haiku/x86/release/tools
124Archive generated/objects/linux/x86/release/build/libroot/libroot_build.a
125ar: creating generated/objects/linux/x86/release/build/libroot/libroot_build.a
126Ranlib generated/objects/linux/x86/release/build/libroot/libroot_build.a
127C++ generated/objects/linux/x86/release/tools/rm_attrs.o
128Link generated/objects/linux/x86/release/tools/rm_attrs_tmp
129Chmod1 generated/objects/linux/x86/release/tools/rm_attrs_tmp
130File generated/objects/haiku/x86/release/tools/rm_attrs
131Chmod1 generated/objects/haiku/x86/release/tools/rm_attrs
132AddVariableToScript1 generated/haiku.image-init-vars
133AddTargetVariableToScript1 generated/haiku.image-init-vars
134AddTargetVariableToScript1 generated/haiku.image-init-vars
135AddTargetVariableToScript1 generated/haiku.image-init-vars
136AddTargetVariableToScript1 generated/haiku.image-init-vars
137AddTargetVariableToScript1 generated/haiku.image-init-vars
138AddTargetVariableToScript1 generated/haiku.image-init-vars
139AddTargetVariableToScript1 generated/haiku.image-init-vars
140AddTargetVariableToScript1 generated/haiku.image-init-vars
141AddTargetVariableToScript1 generated/haiku.image-init-vars
142AddTargetVariableToScript1 generated/haiku.image-init-vars
143InitScript1 generated/haiku.image-make-dirs
144CreateContainerMakeDirectoriesScript1 generated/haiku.image-make-dirs
145ResComp1 generated/objects/haiku/x86/common/home-config-settings-printers-preview.rsrc
146ResAttr1 generated/objects/haiku/x86/common/haiku.image-make-dirs-attributes-home-config-settings-printers-Preview
147AppendToContainerMakeDirectoriesScriptAttributes <HaikuImage>haiku.image-make-dirs-attributes-dummy-home/config/settings/printers/Preview
148ResComp1 generated/objects/haiku/x86/common/home-config-settings-printers-save-as-pdf.rsrc
149ResAttr1 generated/objects/haiku/x86/common/haiku.image-make-dirs-attributes-home-config-settings-printers-Save as PDF
150AppendToContainerMakeDirectoriesScriptAttributes <HaikuImage>haiku.image-make-dirs-attributes-dummy-home/config/settings/printers/Save as PDF
151InitScript1 generated/haiku.image-copy-files
152MkDir1 generated/objects/haiku/x86/release/add-ons
153MkDir1 generated/objects/haiku/x86/release/add-ons/kernel
154MkDir1 generated/objects/haiku/x86/release/add-ons/kernel/bus_managers
155MkDir1 generated/objects/haiku/x86/release/add-ons/kernel/bus_managers/pci
156C++ generated/objects/haiku/x86/release/add-ons/kernel/bus_managers/pci/pci.o
157In file included from headers/os/support/Errors.h:9,
158 from headers/os/support/SupportDefs.h:20,
159 from headers/os/drivers/KernelExport.h:9,
160 from src/add-ons/kernel/bus_managers/pci/pci.cpp:10:
161headers/posix/limits.h:11:26: error: limits.h: No such file or directory
162In file included from src/add-ons/kernel/bus_managers/pci/pci.cpp:14:
163headers/private/kernel/util/kernel_cpp.h:11:15: error: new: No such file or directory
164In file included from src/add-ons/kernel/bus_managers/pci/pci.cpp:14:
165headers/private/kernel/util/kernel_cpp.h:17: error: 'nothrow_t' does not name a type
166headers/private/kernel/util/kernel_cpp.h:27: error: expected type-specifier
167headers/private/kernel/util/kernel_cpp.h:27: error: expected `)'
168headers/private/kernel/util/kernel_cpp.h:27: error: expected initializer
169headers/private/kernel/util/kernel_cpp.h:37: error: expected type-specifier
170headers/private/kernel/util/kernel_cpp.h:37: error: expected `)'
171headers/private/kernel/util/kernel_cpp.h:37: error: expected initializer
172headers/private/kernel/util/kernel_cpp.h:44: error: expected unqualified-id before '&' token
173headers/private/kernel/util/kernel_cpp.h:44: error: expected ',' or '...' before '&' token
174headers/private/kernel/util/kernel_cpp.h:51: error: expected unqualified-id before '&' token
175headers/private/kernel/util/kernel_cpp.h:51: error: expected ',' or '...' before '&' token
176In file included from headers/private/kernel/util/VectorMap.h:38,
177 from src/add-ons/kernel/bus_managers/pci/pci.h:13,
178 from src/add-ons/kernel/bus_managers/pci/pci.cpp:17:
179headers/private/kernel/util/Vector.h: In member function 'status_t Vector<Value>::Insert(const Value&, int32)':
180headers/private/kernel/util/Vector.h:334: error: 'LONG_MIN' was not declared in this scope
181headers/private/kernel/util/Vector.h:336: error: 'LONG_MIN' was not declared in this scope
182headers/private/kernel/util/Vector.h: In member function 'status_t Vector<Value>::Insert(const Value&, const VectorIterator<Value>&)':
183headers/private/kernel/util/Vector.h:359: error: 'LONG_MIN' was not declared in this scope
184In file included from src/add-ons/kernel/bus_managers/pci/pci.h:13,
185 from src/add-ons/kernel/bus_managers/pci/pci.cpp:17:
186headers/private/kernel/util/VectorMap.h: In member function 'status_t VectorMap<Key, Value, EntryStrategy>::Insert(const Key&, const Value&)':
187headers/private/kernel/util/VectorMap.h:325: error: 'LONG_MIN' was not declared in this scope
188src/add-ons/kernel/bus_managers/pci/pci.cpp: In function 'status_t pci_init()':
189src/add-ons/kernel/bus_managers/pci/pci.cpp:240: warning: deprecated conversion from string constant to 'char*'
190src/add-ons/kernel/bus_managers/pci/pci.cpp:240: warning: deprecated conversion from string constant to 'char*'
191src/add-ons/kernel/bus_managers/pci/pci.cpp:241: warning: deprecated conversion from string constant to 'char*'
192src/add-ons/kernel/bus_managers/pci/pci.cpp:241: warning: deprecated conversion from string constant to 'char*'
193src/add-ons/kernel/bus_managers/pci/pci.cpp:242: warning: deprecated conversion from string constant to 'char*'
194src/add-ons/kernel/bus_managers/pci/pci.cpp:242: warning: deprecated conversion from string constant to 'char*'
195src/add-ons/kernel/bus_managers/pci/pci.cpp:243: warning: deprecated conversion from string constant to 'char*'
196src/add-ons/kernel/bus_managers/pci/pci.cpp:243: warning: deprecated conversion from string constant to 'char*'
197src/add-ons/kernel/bus_managers/pci/pci.cpp:244: warning: deprecated conversion from string constant to 'char*'
198src/add-ons/kernel/bus_managers/pci/pci.cpp:244: warning: deprecated conversion from string constant to 'char*'
199src/add-ons/kernel/bus_managers/pci/pci.cpp:245: warning: deprecated conversion from string constant to 'char*'
200src/add-ons/kernel/bus_managers/pci/pci.cpp:245: warning: deprecated conversion from string constant to 'char*'
201src/add-ons/kernel/bus_managers/pci/pci.cpp:247: warning: deprecated conversion from string constant to 'char*'
202src/add-ons/kernel/bus_managers/pci/pci.cpp:247: warning: deprecated conversion from string constant to 'char*'
203src/add-ons/kernel/bus_managers/pci/pci.cpp:248: warning: deprecated conversion from string constant to 'char*'
204src/add-ons/kernel/bus_managers/pci/pci.cpp:248: warning: deprecated conversion from string constant to 'char*'
205src/add-ons/kernel/bus_managers/pci/pci.cpp:249: warning: deprecated conversion from string constant to 'char*'
206src/add-ons/kernel/bus_managers/pci/pci.cpp:249: warning: deprecated conversion from string constant to 'char*'
207src/add-ons/kernel/bus_managers/pci/pci.cpp:250: warning: deprecated conversion from string constant to 'char*'
208src/add-ons/kernel/bus_managers/pci/pci.cpp:250: warning: deprecated conversion from string constant to 'char*'
209src/add-ons/kernel/bus_managers/pci/pci.cpp:251: warning: deprecated conversion from string constant to 'char*'
210src/add-ons/kernel/bus_managers/pci/pci.cpp:251: warning: deprecated conversion from string constant to 'char*'
211src/add-ons/kernel/bus_managers/pci/pci.cpp:252: warning: deprecated conversion from string constant to 'char*'
212src/add-ons/kernel/bus_managers/pci/pci.cpp:252: warning: deprecated conversion from string constant to 'char*'
213src/add-ons/kernel/bus_managers/pci/pci.cpp:262: warning: deprecated conversion from string constant to 'char*'
214src/add-ons/kernel/bus_managers/pci/pci.cpp:262: warning: deprecated conversion from string constant to 'char*'
215src/add-ons/kernel/bus_managers/pci/pci.cpp: In function 'void pci_uninit()':
216src/add-ons/kernel/bus_managers/pci/pci.cpp:271: warning: deprecated conversion from string constant to 'char*'
217src/add-ons/kernel/bus_managers/pci/pci.cpp:272: warning: deprecated conversion from string constant to 'char*'
218src/add-ons/kernel/bus_managers/pci/pci.cpp:273: warning: deprecated conversion from string constant to 'char*'
219src/add-ons/kernel/bus_managers/pci/pci.cpp:274: warning: deprecated conversion from string constant to 'char*'
220src/add-ons/kernel/bus_managers/pci/pci.cpp:275: warning: deprecated conversion from string constant to 'char*'
221src/add-ons/kernel/bus_managers/pci/pci.cpp:276: warning: deprecated conversion from string constant to 'char*'
222src/add-ons/kernel/bus_managers/pci/pci.cpp:278: warning: deprecated conversion from string constant to 'char*'
223src/add-ons/kernel/bus_managers/pci/pci.cpp:279: warning: deprecated conversion from string constant to 'char*'
224src/add-ons/kernel/bus_managers/pci/pci.cpp:280: warning: deprecated conversion from string constant to 'char*'
225src/add-ons/kernel/bus_managers/pci/pci.cpp:281: warning: deprecated conversion from string constant to 'char*'
226src/add-ons/kernel/bus_managers/pci/pci.cpp:282: warning: deprecated conversion from string constant to 'char*'
227src/add-ons/kernel/bus_managers/pci/pci.cpp:283: warning: deprecated conversion from string constant to 'char*'
228src/add-ons/kernel/bus_managers/pci/pci.cpp: In member function 'PCIBus* PCI::_CreateBus(PCIDev*, int, uint8)':
229src/add-ons/kernel/bus_managers/pci/pci.cpp:812: error: 'nothrow' is not a member of 'std'
230src/add-ons/kernel/bus_managers/pci/pci.cpp: In member function 'PCIDev* PCI::_CreateDevice(PCIBus*, uint8, uint8)':
231src/add-ons/kernel/bus_managers/pci/pci.cpp:834: error: 'nothrow' is not a member of 'std'
232src/add-ons/kernel/bus_managers/pci/pci.cpp: In member function 'status_t PCI::FindCapability(int, uint8, uint8, uint8, uint8, uint8*)':
233src/add-ons/kernel/bus_managers/pci/pci.cpp:1232: error: 'LONG_MIN' was not declared in this scope
234src/add-ons/kernel/bus_managers/pci/pci.cpp:1263: error: 'LONG_MIN' was not declared in this scope
235src/add-ons/kernel/bus_managers/pci/pci.cpp:1277: error: 'LONG_MIN' was not declared in this scope
236
237/home/umccullough/haiku/haiku/trunk/generated/cross-tools/bin/i586-pc-haiku-gcc -c "src/add-ons/kernel/bus_managers/pci/pci.cpp" -O -Wall -Wno-trigraphs -Wno-multichar -pipe -fno-strict-aliasing -fno-tree-vrp -nostdinc -Wno-deprecated -D_ZETA_USING_DEPRECATED_API_=1 -D_ZETA_TS_FIND_DIR_=1 -pipe -fno-strict-aliasing -fno-tree-vrp -finline -fno-builtin -fno-exceptions -DBOCHS_DEBUG_HACK=0 -fno-use-cxa-atexit -ffreestanding -D_KERNEL_MODE -D__HAIKU__ -DHAIKU_DISTRO_COMPATIBILITY_DEFAULT -D__INTEL__ -DARCH_x86 -DBOOT_ARCHIVE_IMAGE_OFFSET=300 -DHAIKU_TARGET_PLATFORM_HAIKU -iquote build/user_config_headers -iquote build/config_headers -iquote src/add-ons/kernel/bus_managers/pci -iquote generated/objects/common/add-ons/kernel/bus_managers/pci -iquote generated/objects/linux/x86/common/add-ons/kernel/bus_managers/pci -iquote generated/objects/haiku/x86/common/add-ons/kernel/bus_managers/pci -I headers/private/. -I headers/private/kernel -I headers/private/libroot -I headers/private/kernel/boot/platform/bios_ia32 -I headers/private/kernel/arch/x86 -I headers/private/. -I headers/private/system -I headers/private/system/arch/x86 -I headers/private/shared -I headers/private/kernel/util -I /home/umccullough/haiku/haiku/trunk/generated/cross-tools/lib/gcc/i586-pc-haiku/4.3.3/../../../../include/c++/4.3.3 -I /home/umccullough/haiku/haiku/trunk/generated/cross-tools/lib/gcc/i586-pc-haiku/4.3.3/../../../../include/c++/4.3.3/i586-pc-haiku -I /home/umccullough/haiku/haiku/trunk/generated/cross-tools/lib/gcc/i586-pc-haiku/4.3.3/../../../../include/c++/4.3.3/backward -I /home/umccullough/haiku/haiku/trunk/generated/cross-tools/lib/gcc/i586-pc-haiku/4.3.3/../../../../include/c++/4.3.3/ext -I /home/umccullough/haiku/haiku/trunk/generated/cross-tools/lib/gcc/i586-pc-haiku/4.3.3/include -I headers -I headers/posix -I headers/gnu -I headers/glibc -I headers/os -I headers/os/add-ons -I headers/os/add-ons/file_system -I headers/os/add-ons/graphics -I headers/os/add-ons/input_server -I headers/os/add-ons/registrar -I headers/os/add-ons/screen_saver -I headers/os/add-ons/tracker -I headers/os/app -I headers/os/device -I headers/os/drivers -I headers/os/game -I headers/os/interface -I headers/os/kernel -I headers/os/media -I headers/os/mail -I headers/os/midi -I headers/os/midi2 -I headers/os/net -I headers/os/opengl -I headers/os/storage -I headers/os/support -I headers/os/translation -I headers/private/. -o "generated/objects/haiku/x86/release/add-ons/kernel/bus_managers/pci/pci.o" ;
238
239...failed C++ generated/objects/haiku/x86/release/add-ons/kernel/bus_managers/pci/pci.o ...
240...skipped pci for lack of <src!add-ons!kernel!bus_managers!pci>pci.o...
241...skipped <HaikuImage>haiku.image-copy-files-dummy-beos/system/add-ons/kernel/bus_managers for lack of pci...
242...skipped haiku.image for lack of <HaikuImage>haiku.image-copy-files...
243...failed updating 1 target(s)...
244...skipped 3 target(s)...
245...updated 218 target(s)...
246umccullough@debsrv3:~/haiku/haiku/trunk$