Ticket #5551: syslog.2

File syslog.2, 119.3 KB (added by stargatefan, 9 years ago)

from recent 41373 build.

Line 
1KERN: (not supported)
2KERN: ahci: ahci_supports_device
3KERN: usb uhci: no devices found
4KERN: usb ohci -1: iospace offset: 0xfe6fe000
5KERN: add_memory_type_range(120, 0xfe6fe000, 0x1000, 0)
6KERN: usb ohci -1: successfully started the controller
7KERN: usb ohci -1: iospace offset: 0xfe6fd000
8KERN: add_memory_type_range(123, 0xfe6fd000, 0x1000, 0)
9KERN: usb ohci -1: successfully started the controller
10KERN: usb ohci -1: iospace offset: 0xfe6fc000
11KERN: add_memory_type_range(126, 0xfe6fc000, 0x1000, 0)
12KERN: usb ohci -1: successfully started the controller
13KERN: usb ohci -1: iospace offset: 0xfe6f7000
14KERN: add_memory_type_range(129, 0xfe6f7000, 0x1000, 0)
15KERN: usb ohci -1: successfully started the controller
16KERN: add_memory_type_range(132, 0xfe6ff000, 0x1000, 0)
17KERN: usb ehci -1: successfully started the controller
18KERN: add_memory_type_range(136, 0xfe6ff000, 0x1000, 0)
19KERN: usb ehci -1: successfully started the controller
20KERN: add_memory_type_range(140, 0xfe6ff000, 0x1000, 0)
21KERN: usb ehci -1: successfully started the controller
22KERN: usb hub 2: port 4: device removed
23KERN: usb hub 7: port 0: device removed
24KERN: usb hub 17: port 0: device removed
25KERN: usb hub 22: port 4: new device connected
26KERN: usb ehci -1: lowspeed device connected, giving up port ownership
27KERN: usb hub 27: port 0: new device connected
28KERN: usb error control pipe 36: timeout waiting for queued request to complete
29Last message repeated 1 time
30KERN: usb error ehci -1: qtd (0x05b7db00) error: 0x00080248
31KERN: usb error control pipe 36: timeout waiting for queued request to complete
32KERN: usb error ehci -1: qtd (0x05b7dd00) error: 0x00080248
33KERN: usb error ehci -1: error while setting device address
34KERN: usb error control pipe 36: timeout waiting for queued request to complete
35Last message repeated 1 time
36KERN: usb error ehci -1: qtd (0x05b7e100) error: 0x00080248
37KERN: usb error control pipe 36: timeout waiting for queued request to complete
38KERN: usb error ehci -1: qtd (0x05b7e300) error: 0x00080248
39KERN: usb error ehci -1: error while setting device address
40KERN: usb hub 32: port 0: new device connected
41KERN: usb error control pipe 37: timeout waiting for queued request to complete
42Last message repeated 1 time
43KERN: usb error ehci -1: qtd (0x05b7e700) error: 0x00080248
44KERN: usb error control pipe 37: timeout waiting for queued request to complete
45KERN: usb error ehci -1: qtd (0x05b7e900) error: 0x00080248
46KERN: usb error ehci -1: error while setting device address
47KERN: usb error control pipe 37: timeout waiting for queued request to complete
48Last message repeated 1 time
49KERN: usb error ehci -1: qtd (0x05b7ed00) error: 0x00080248
50KERN: usb error control pipe 37: timeout waiting for queued request to complete
51KERN: usb error ehci -1: qtd (0x05b7ef00) error: 0x00080248
52KERN: usb error ehci -1: error while setting device address
53KERN: get_boot_partitions(): boot volume message:
54KERN: KMessage: buffer: 0x827869ec (size/capacity: 316/316), flags: 0xa
55KERN: field: "booted from image" (BOOL): true
56KERN: field: "partition offset" (LLNG): 0 (0x0)
57KERN: field: "boot method" (LONG): 1 (0x1)
58KERN: field: "boot drive number" (LLNG): 0 (0x0)
59KERN: field: "disk identifier" (RAWT): data at 0x82786ad8, 80 bytes
60KERN: get_boot_partitions(): boot method type: 1
61KERN: partitioning system: partitioning_systems/intel/extended/v1
62KERN: KDiskDeviceManager::_AddDiskSystem(partitioning_systems/intel/extended/v1)
63KERN: intel: ep_std_ops(0x1)
64KERN: intel: ep_std_ops(0x2)
65KERN: KDiskDeviceManager::_AddDiskSystem() done: No error
66KERN: partitioning system: partitioning_systems/intel/map/v1
67KERN: KDiskDeviceManager::_AddDiskSystem(partitioning_systems/intel/map/v1)
68KERN: intel: pm_std_ops(0x1)
69KERN: intel: pm_std_ops(0x2)
70KERN: KDiskDeviceManager::_AddDiskSystem() done: No error
71KERN: partitioning system: partitioning_systems/session/v1
72KERN: KDiskDeviceManager::_AddDiskSystem(partitioning_systems/session/v1)
73KERN: KDiskDeviceManager::_AddDiskSystem() done: No error
74KERN: file system: file_systems/write_overlay/v1
75KERN: KDiskDeviceManager::_AddDiskSystem(file_systems/write_overlay/v1)
76KERN: KDiskDeviceManager::_AddDiskSystem() done: No error
77KERN: file system: file_systems/bfs/v1
78KERN: KDiskDeviceManager::_AddDiskSystem(file_systems/bfs/v1)
79KERN: KDiskDeviceManager::_AddDiskSystem() done: No error
80KERN: file system: file_systems/devfs/v1
81KERN: KDiskDeviceManager::_AddDiskSystem(file_systems/devfs/v1)
82KERN: KDiskDeviceManager::_AddDiskSystem() done: No error
83KERN: file system: file_systems/attribute_overlay/v1
84KERN: KDiskDeviceManager::_AddDiskSystem(file_systems/attribute_overlay/v1)
85KERN: KDiskDeviceManager::_AddDiskSystem() done: No error
86KERN: file system: file_systems/iso9660/v1
87KERN: KDiskDeviceManager::_AddDiskSystem(file_systems/iso9660/v1)
88KERN: KDiskDeviceManager::_AddDiskSystem() done: No error
89KERN: file system: file_systems/rootfs/v1
90KERN: KDiskDeviceManager::_AddDiskSystem(file_systems/rootfs/v1)
91KERN: KDiskDeviceManager::_AddDiskSystem() done: No error
92KERN: number of disk systems: 9
93KERN: KDiskDeviceManager::_Scan(/dev/disk)
94KERN: PCI-ATA: Controller in native mode: cmd 0xd800, ctrl 0xd402, irq 10
95KERN: PCI-ATA: init channel...
96KERN: PCI-ATA: channel index 0
97KERN: PCI-ATA: bus master base 0xc400
98KERN: PCI-ATA: init channel done
99KERN: ata 0: _DevicePresent: device 0, presence 1
100KERN: ata 0: _DevicePresent: device 1, presence 1
101KERN: ata 0: deviceMask 3
102KERN: ata 0: probing device 0
103KERN: ata 0: signature of device 0: 0xeb14
104KERN: atapi 0-0: model number: HL-DT-ST RW/DVD GCC-4120B
105KERN: atapi 0-0: serial number:
106KERN: atapi 0-0: firmware rev.: 2.01
107KERN: atapi 0-0: using DMA mode 0x02
108KERN: ata 0: identified ATAPI device 0
109KERN: ata 0: probing device 1
110KERN: ata 0: signature of device 1: 0xeb14
111KERN: atapi 0-1: model number: SAMSUNG DVD-ROM SD-816B
112KERN: atapi 0-1: serial number:
113KERN: atapi 0-1: firmware rev.: H000
114KERN: atapi 0-1: using DMA mode 0x12
115KERN: ata 0: identified ATAPI device 1
116KERN: SCSI -- is_sg_list_dma_safe: S/G-entry has bad alignment @0x16a3245
117KERN: publish device: node 0x832fbd78, path disk/atapi/0/master/raw, module drivers/disk/scsi/scsi_cd/device_v1
118KERN: SCSI -- is_sg_list_dma_safe: S/G-entry has bad alignment @0x16a3245
119KERN: publish device: node 0x832fbcd8, path disk/atapi/0/slave/raw, module drivers/disk/scsi/scsi_cd/device_v1
120KERN: ata 0 error: invalid target device
121KERN: Last message repeated 12 times.
122KERN: PCI-ATA: Controller in native mode: cmd 0xd000, ctrl 0xc802, irq 10
123KERN: PCI-ATA: init channel...
124KERN: PCI-ATA: channel index 1
125KERN: PCI-ATA: bus master base 0xc408
126KERN: PCI-ATA: init channel done
127KERN: ata 1: _DevicePresent: device 0, presence 0
128KERN: ata 1: _DevicePresent: device selection failed for device 1
129KERN: ata 1: deviceMask 0
130KERN: ata 1: ignoring device 0
131KERN: ata 1: ignoring device 1
132KERN: ata 1 error: target device not present
133Last message repeated 1 time
134KERN: ata 1 error: invalid target device
135KERN: Last message repeated 12 times.
136KERN: PCI-ATA: Controller in legacy mode: cmd 0x1f0, ctrl 0x3f6, irq 14
137KERN: PCI-ATA: init channel...
138KERN: PCI-ATA: channel index 0
139KERN: PCI-ATA: bus master base 0xff00
140KERN: PCI-ATA: init channel done
141KERN: ata 2: _DevicePresent: device 0, presence 1
142KERN: ata 2: _DevicePresent: device 1, presence 1
143KERN: ata 2: deviceMask 3
144KERN: ata 2: probing device 0
145KERN: ata 2: signature of device 0: 0x0000
146KERN: ata 2-0: model number: ST3500418AS
147KERN: ata 2-0: serial number: 9VM0D9YP
148KERN: ata 2-0: firmware rev.: CC34
149KERN: ata 2-0: using DMA mode 0x16
150KERN: ata 2: identified ATA device 0
151KERN: ata 2: probing device 1
152KERN: ata 2: signature of device 1: 0x0000
153KERN: ata 2-1: model number: SAMSUNG HD103SJ
154KERN: ata 2-1: serial number: S246JX0ZA00222
155KERN: ata 2-1: firmware rev.: 1AJ10001
156KERN: ata 2-1: using DMA mode 0x16
157KERN: ata 2: identified ATA device 1
158KERN: ata 2 error: command failed, error bit is set. status 0x51, error 0x04
159KERN: SCSI -- is_sg_list_dma_safe: S/G-entry has bad alignment @0x16a3245
160KERN: publish device: node 0x832fb9b8, path disk/ata/2/master/raw, module drivers/disk/scsi/scsi_disk/device_v1
161KERN: ata 2 error: command failed, error bit is set. status 0x51, error 0x04
162KERN: SCSI -- is_sg_list_dma_safe: S/G-entry has bad alignment @0x16a3245
163KERN: publish device: node 0x832fb918, path disk/ata/2/slave/raw, module drivers/disk/scsi/scsi_disk/device_v1
164KERN: ata 2 error: invalid target device
165KERN: Last message repeated 12 times.
166KERN: PCI-ATA: Controller in legacy mode: cmd 0x170, ctrl 0x376, irq 15
167KERN: PCI-ATA: init channel...
168KERN: PCI-ATA: channel index 1
169KERN: PCI-ATA: bus master base 0xff08
170KERN: usb hub 2: PCI-ATA: init channel done
171KERN: port 4: new device connected
172KERN: ata 3: _DevicePresent: device selection failed for device 0
173KERN: ata 3: _DeviKERN: cePresent: device 1, presence 0
174KERN: ata 3: deviceMask 0
175KERN: ata 3: ignoring device 0
176KERN: ata 3: ignoring device 1
177KERN: ata 3 error: target device not present
178Last message repeated 1 time
179KERN: ata 3 error: invalid target device
180KERN: Last message repeated 12 times.
181KERN: PCI-ATA: Controller in native mode: cmd 0x8000, ctrl 0x7002, irq 11
182KERN: PCI-ATA: init channel...
183KERN: PCI-ATA: channel index 0
184KERN: PCI-ATA: bus master base 0x3000
185KERN: PCI-ATA: init channel done
186KERN: ata 4: _DevicePresent: device 0, presence 1
187KERN: ata 4: _DevicePresent: device selection failed for device 1
188KERN: ata 4: deviceMask 1
189KERN: ata 4: probing device 0
190KERN: ata 4: signature of device 0: 0xeb14
191KERN: atapi 4-0: model number: TSSTcorp CDDVDW SH-S223C
192KERN: atapi 4-0: serial number: R4136GAZ754678
193KERN: atapi 4-0: firmware rev.: SB04
194KERN: atapi 4-0 error: more than on DMA mode selected, not using DMA
195KERN: ata 4: identified ATAPI device 0
196KERN: ata 4: ignoring device 1
197KERN: usb hub 22: port 4: device removed
198KERN: SCSI -- is_sg_list_dma_safe: S/G-entry has bad alignment @0x16a3245
199KERN: publish device: node 0x832fb5a8, path disk/atapi/4/master/raw, module drivers/disk/scsi/scsi_cd/device_v1
200KERN: ata 4 error: target device not present
201KERN: ata 4 error: invalid target device
202KERN: Last message repeated 12 times.
203KERN: PCI-ATA: Controller in native mode: cmd 0x6000, ctrl 0x5002, irq 11
204KERN: PCI-ATA: init channel...
205KERN: PCI-ATA: channel index 1
206KERN: PCI-ATA: bus master base 0x3008
207KERN: PCI-ATA: init channel done
208KERN: ata 5: _DevicePresent: device 0, presence 1
209KERN: ata 5: _DevicePresent: device 1, presence 1
210KERN: ata 5: deviceMask 3
211KERN: ata 5: probing device 0
212KERN: ata 5: signature of device 0: 0xeb14
213KERN: atapi 5-0: model number: hp DVD-RAM GH40L
214KERN: atapi 5-0: serial number: 850CC012676
215KERN: atapi 5-0: firmware rev.: RB0E
216KERN: atapi 5-0: using DMA mode 0x15
217KERN: ata 5: identified ATAPI device 0
218KERN: ata 5: probing device 1
219KERN: ata 5: signature of device 1: 0x0000
220KERN: ata 5-1: model number: WDC WD6400AAKS-65A7B2
221KERN: ata 5-1: serial number: WD-WMASY5964892
222KERN: ata 5-1: firmware rev.: 01.03B01
223KERN: ata 5-1: using DMA mode 0x16
224KERN: ata 5: identified ATA device 1
225KERN: SCSI -- is_sg_list_dma_safe: S/G-entry has bad alignment @0x16a3245
226KERN: publish device: node 0x832fb3c8, path disk/atapi/5/master/raw, module drivers/disk/scsi/scsi_cd/device_v1
227KERN: ata 5 error: command failed, error bit is set. status 0x51, error 0x04
228KERN: SCSI -- is_sg_list_dma_safe: S/G-entry has bad alignment @0x16a3245
229KERN: publish device: node 0x832fb328, path disk/ata/5/slave/raw, module drivers/disk/scsi/scsi_disk/device_v1
230KERN: ata 5 error: invalid target device
231KERN: Last message repeated 12 times.
232KERN: ahci: ahci_supports_device
233Last message repeated 1 time
234KERN: KDiskDeviceManager::_Scan(/dev/disk/ata)
235KERN: KDiskDeviceManager::_Scan(/dev/disk/ata/2)
236KERN: KDiskDeviceManager::_Scan(/dev/disk/ata/2/master)
237KERN: KDiskDeviceManager::_Scan(/dev/disk/ata/2/master/raw)
238KERN: found device: /dev/disk/ata/2/master/raw
239KERN: DMAResource@0x832fda00: low/high 0/100000000, max segment count 512, align 2, boundary 65536, max transfer 33553920, max segment size 33554432
240KERN: slab memory manager: created area 0x81801000 (198)
241KERN: KDiskDeviceManager::_Scan(/dev/disk/ata/2/slave)
242KERN: KDiskDeviceManager::_Scan(/dev/disk/ata/2/slave/raw)
243KERN: found device: /dev/disk/ata/2/slave/raw
244KERN: DMAResource@0x832fd900: low/high 0/100000000, max segment count 512, align 2, boundary 65536, max transfer 33553920, max segment size 33554432
245KERN: slab memory manager: created area 0x88801000 (233)
246KERN: slab memory manager: created area 0x89001000 (234)
247KERN: KDiskDeviceManager::_Scan(/dev/disk/ata/5)
248KERN: KDiskDeviceManager::_Scan(/dev/disk/ata/5/slave)
249KERN: KDiskDeviceManager::_Scan(/dev/disk/ata/5/slave/raw)
250KERN: found device: /dev/disk/ata/5/slave/raw
251KERN: DMAResource@0x832fd100: low/high 0/100000000, max segment count 512, align 2, boundary 65536, max transfer 33553920, max segment size 33554432
252KERN: slab memory manager: created area 0x89801000 (269)
253KERN: slab memory manager: created area 0x8a001000 (270)
254KERN: KDiskDeviceManager::_Scan(/dev/disk/atapi)
255KERN: KDiskDeviceManager::_Scan(/dev/disk/atapi/0)
256KERN: KDiskDeviceManager::_Scan(/dev/disk/atapi/0/master)
257KERN: KDiskDeviceManager::_Scan(/dev/disk/atapi/0/master/raw)
258KERN: found device: /dev/disk/atapi/0/master/raw
259KERN: KDiskDeviceManager::_Scan(/dev/disk/atapi/0/slave)
260KERN: KDiskDeviceManager::_Scan(/dev/disk/atapi/0/slave/raw)
261KERN: found device: /dev/disk/atapi/0/slave/raw
262KERN: KDiskDeviceManager::_Scan(/dev/disk/atapi/4)
263KERN: KDiskDeviceManager::_Scan(/dev/disk/atapi/4/master)
264KERN: KDiskDeviceManager::_Scan(/dev/disk/atapi/4/master/raw)
265KERN: found device: /dev/disk/atapi/4/master/raw
266KERN: KDiskDeviceManager::_Scan(/dev/disk/atapi/5)
267KERN: KDiskDeviceManager::_Scan(/dev/disk/atapi/5/master)
268KERN: KDiskDeviceManager::_Scan(/dev/disk/atapi/5/master/raw)
269KERN: found device: /dev/disk/atapi/5/master/raw
270KERN: DMAResource@0x832fd180: low/high 0/100000000, max segment count 512, align 2, boundary 65536, max transfer 524288, max segment size 134217728
271KERN: slab memory manager: created area 0x8a801000 (305)
272KERN: ata 5 error: command failed, error bit is set. status 0x51, error 0x50
273KERN: atapi 5-0 error: device indicates transfer error after dma
274KERN: check_sense: Illegal request
275KERN: KDiskDeviceManager::_ScanPartition(/dev/disk/ata/2/master/raw)
276KERN: intel: ep_std_ops(0x1)
277KERN: trying: partitioning_systems/intel/extended/v1
278KERN: returned: -1
279KERN: intel: ep_std_ops(0x2)
280KERN: intel: pm_std_ops(0x1)
281KERN: trying: partitioning_systems/intel/map/v1
282KERN: intel: pm_identify_partition(0, 0: 0, 500107862016, 512)
283KERN: returned: 0.81
284KERN: trying: partitioning_systems/session/v1
285KERN: returned: -1
286KERN: trying: file_systems/write_overlay/v1
287KERN: returned: -1
288KERN: trying: file_systems/bfs/v1
289KERN: returned: -1
290KERN: trying: file_systems/devfs/v1
291KERN: returned: -1
292KERN: trying: file_systems/attribute_overlay/v1
293KERN: returned: -1
294KERN: trying: file_systems/iso9660/v1
295KERN: identify(0, 0x83304ed0)
296KERN: returned: -1
297KERN: trying: file_systems/rootfs/v1
298KERN: returned: -1
299KERN: scanning with: partitioning_systems/intel/map/v1
300KERN: intel: pm_scan_partition(0, 0: 0, 500107862016, 512)
301KERN: KDiskDeviceManager::_ScanPartition(/dev/disk/ata/2/master/0)
302KERN: intel: ep_std_ops(0x1)
303KERN: trying: partitioning_systems/intel/extended/v1
304KERN: intel: ep_identify_partition(0, 8225280, 500097024000, 512)
305KERN: returned: 0.949
306KERN: trying: partitioning_systems/intel/map/v1
307KERN: intel: pm_identify_partition(0, 7: 8225280, 500097024000, 512)
308KERN: returned: -1
309KERN: trying: partitioning_systems/session/v1
310KERN: returned: -1
311KERN: trying: file_systems/write_overlay/v1
312KERN: returned: -1
313KERN: trying: file_systems/bfs/v1
314KERN: returned: -1
315KERN: trying: file_systems/devfs/v1
316KERN: returned: -1
317KERN: trying: file_systems/attribute_overlay/v1
318KERN: returned: -1
319KERN: trying: file_systems/iso9660/v1
320KERN: identify(0, 0x832fe4c0)
321KERN: returned: -1
322KERN: trying: file_systems/rootfs/v1
323KERN: returned: -1
324KERN: scanning with: partitioning_systems/intel/extended/v1
325KERN: intel: ep_scan_partition(0, 8225280, 500097024000, 512)
326KERN: KDiskDeviceManager::_ScanPartition(/dev/disk/ata/2/master/0_0)
327KERN: trying: partitioning_systems/intel/extended/v1
328KERN: intel: ep_identify_partition(0, 8257536, 391860532224, 512)
329KERN: returned: -1
330KERN: trying: partitioning_systems/intel/map/v1
331KERN: intel: pm_identify_partition(0, 8: 8257536, 391860532224, 512)
332KERN: returned: -1
333KERN: trying: partitioning_systems/session/v1
334KERN: returned: -1
335KERN: trying: file_systems/write_overlay/v1
336KERN: returned: -1
337KERN: trying: file_systems/bfs/v1
338KERN: returned: -1
339KERN: trying: file_systems/devfs/v1
340KERN: returned: -1
341KERN: trying: file_systems/attribute_overlay/v1
342KERN: returned: -1
343KERN: trying: file_systems/iso9660/v1
344KERN: identify(0, 0x832e2fc0)
345KERN: returned: -1
346KERN: trying: file_systems/rootfs/v1
347KERN: returned: -1
348KERN: KDiskDeviceManager::_ScanPartition(/dev/disk/ata/2/master/0_1)
349KERN: trying: partitioning_systems/intel/extended/v1
350KERN: intel: ep_identify_partition(0, 391868822528, 108236111872, 512)
351KERN: returned: -1
352KERN: trying: partitioning_systems/intel/map/v1
353KERN: intel: pm_identify_partition(0, 9: 391868822528, 108236111872, 512)
354KERN: returned: -1
355KERN: trying: partitioning_systems/session/v1
356KERN: returned: -1
357KERN: trying: file_systems/write_overlay/v1
358KERN: returned: -1
359KERN: trying: file_systems/bfs/v1
360KERN: returned: 0.8
361KERN: trying: file_systems/devfs/v1
362KERN: returned: -1
363KERN: trying: file_systems/attribute_overlay/v1
364KERN: returned: -1
365KERN: trying: file_systems/iso9660/v1
366KERN: identify(0, 0x832e2fc0)
367KERN: returned: -1
368KERN: trying: file_systems/rootfs/v1
369KERN: returned: -1
370KERN: scanning with: file_systems/bfs/v1
371KERN: KDiskDeviceManager::_ScanPartition(/dev/disk/ata/2/slave/raw)
372KERN: trying: partitioning_systems/intel/extended/v1
373KERN: returned: -1
374KERN: trying: partiKERN: tioning_systems/intel/map/v1
375KERN: intel: pm_identify_partition(0, 1: 0, 1000204886016, 512)
376KERN: returned: 0.5
377KERN: trying: partitioning_systems/session/v1
378KERN: returned: -1
379KERN: trying: file_systems/write_overlay/v1
380KERN: returned: -1
381KERN: trying: file_systems/bfs/v1
382KERN: returned: -1
383KERN: trying: file_systems/devfs/v1
384KERN: returned: -1
385KERN: trying: file_systems/attribute_overlay/v1
386KERN: returned: -1
387KERN: trying: file_systems/iso9660/v1
388KERN: identify(0, 0x83304ec0)
389KERN: returned: -1
390KERN: trying: file_systems/rootfs/v1
391KERN: returned: -1
392KERN: scanning with: partitioning_systems/intel/map/v1
393KERN: intel: pm_scan_partition(0, 1: 0, 1000204886016, 512)
394KERN: KDiskDeviceManager::_ScanPartition(/dev/disk/ata/5/slave/raw)
395KERN: trying: partitioning_systems/intel/extended/v1
396KERN: returned: -1
397KERN: trying: partitioning_systems/intel/map/v1
398KERN: intel: pm_identify_partition(0, 2: 0, 640135028736, 512)
399KERN: returned: 0.81
400KERN: trying: partitioning_systems/session/v1
401KERN: returned: -1
402KERN: trying: file_systems/write_overlay/v1
403KERN: returned: -1
404KERN: trying: file_systems/bfs/v1
405KERN: returned: -1
406KERN: trying: file_systems/devfs/v1
407KERN: returned: -1
408KERN: trying: file_systems/attribute_overlay/v1
409KERN: returned: -1
410KERN: trying: file_systems/iso9660/v1
411KERN: identify(0, 0x832e7320)
412KERN: returned: -1
413KERN: trying: file_systems/rootfs/v1
414KERN: returned: -1
415KERN: scanning with: partitioning_systems/intel/map/v1
416KERN: intel: pm_scan_partition(0, 2: 0, 640135028736, 512)
417KERN: KDiskDeviceManager::_ScanPartition(/dev/disk/ata/5/slave/0)
418KERN: trying: partitioning_systems/intel/extended/v1
419KERN: intel: ep_identify_partition(0, 32256, 443021773824, 512)
420KERN: returned: -1
421KERN: trying: partitioning_systems/intel/map/v1
422KERN: intel: pm_identify_partition(0, 10: 32256, 443021773824, 512)
423KERN: returned: -1
424KERN: trying: partitioning_systems/session/v1
425KERN: returned: -1
426KERN: trying: file_systems/write_overlay/v1
427KERN: returned: -1
428KERN: trying: file_systems/bfs/v1
429KERN: returned: -1
430KERN: trying: file_systems/devfs/v1
431KERN: returned: -1
432KERN: trying: file_systems/attribute_overlay/v1
433KERN: returned: -1
434KERN: trying: file_systems/iso9660/v1
435KERN: identify(0, 0x891ffb70)
436KERN: returned: -1
437KERN: trying: file_systems/rootfs/v1
438KERN: returned: -1
439KERN: KDiskDeviceManager::_ScanPartition(/dev/disk/ata/5/slave/1)
440KERN: trying: partitioning_systems/intel/extended/v1
441KERN: intel: ep_identify_partition(0, 443021806080, 107874547200, 512)
442KERN: returned: -1
443KERN: trying: partitioning_systems/intel/map/v1
444KERN: intel: pm_identify_partition(0, 11: 443021806080, 107874547200, 512)
445KERN: returned: -1
446KERN: trying: partitioning_systems/session/v1
447KERN: returned: -1
448KERN: trying: file_systems/write_overlay/v1
449KERN: returned: -1
450KERN: trying: file_systems/bfs/v1
451KERN: returned: -1
452KERN: trying: file_systems/devfs/v1
453KERN: returned: -1
454KERN: trying: file_systems/attribute_overlay/v1
455KERN: returned: -1
456KERN: trying: file_systems/iso9660/v1
457KERN: identify(0, 0x891ffb80)
458KERN: returned: -1
459KERN: trying: file_systems/rootfs/v1
460KERN: returned: -1
461KERN: KDiskDeviceManager::_ScanPartition(/dev/disk/ata/5/slave/2)
462KERN: trying: partitioning_systems/intel/extended/v1
463KERN: intel: ep_identify_partition(0, 550896353280, 89238011904, 512)
464KERN: returned: -1
465KERN: trying: partitioning_systems/intel/map/v1
466KERN: intel: pm_identify_partition(0, 12: 550896353280, 89238011904, 512)
467KERN: returned: -1
468KERN: trying: partitioning_systems/session/v1
469KERN: returned: -1
470KERN: trying: file_systems/write_overlay/v1
471KERN: returned: -1
472KERN: trying: file_systems/bfs/v1
473KERN: returned: 0.8
474KERN: trying: file_systems/devfs/v1
475KERN: returned: -1
476KERN: trying: file_systems/attribute_overlay/v1
477KERN: returned: -1
478KERN: trying: file_systems/iso9660/v1
479KERN: identify(0, 0x891ffb70)
480KERN: returned: -1
481KERN: trying: file_systems/rootfs/v1
482KERN: returned: -1
483KERN: scanning with: file_systems/bfs/v1
484KERN: KDiskDeviceManager::_ScanPartition(/dev/disk/atapi/5/master/raw)
485KERN: trying: partitioning_systems/intel/extended/v1
486KERN: returned: -1
487KERN: trying: partitioning_systems/intel/map/v1
488KERN: intel: pm_identify_partition(0, 6: 0, 438919168, 2048)
489KERN: returned: -1
490KERN: trying: partitioning_systems/session/v1
491KERN: raw_command:
492KERN: returned: 0.1
493KERN: trying: file_systems/write_overlay/v1
494KERN: returned: -1
495KERN: trying: file_systems/bfs/v1
496KERN: returned: -1
497KERN: trying: file_systems/devfs/v1
498KERN: returned: -1
499KERN: trying: file_systems/attribute_overlay/v1
500KERN: returned: -1
501KERN: trying: file_systems/iso9660/v1
502KERN: identify(0, 0x891ffb80)
503KERN: found primary descriptor
504KERN: iso9660_primary_descriptor:
505KERN: volume descriptor type: 1 (primary)
506KERN: standard identifier: CD001 (valid)
507KERN: version: 1
508KERN: identifier: 'Haiku '
509KERN: size: 214164
510KERN: set size: 1
511KERN: sequence number: 1
512KERN: logical block size: 2048
513KERN: path table size: 13420
514KERN: set identifier:
515KERN: root directory record:
516KERN: length: 34
517KERN: location: 36
518KERN: data length: 2048
519KERN: volume space: 1
520KERN: iso9660_info::set_string(0x891ffb80 ('<NULL>'), 'Haiku ', 5)
521KERN: returned: 0.6
522KERN: trying: file_systems/rootfs/v1
523KERN: returned: -1
524KERN: scanning with: file_systems/iso9660/v1
525KERN: device 0: /dev/disk/ata/2/master/raw
526KERN: media status: No error
527KERN: device flags: 2
528KERN: offset: 0
529KERN: size: 500107862016 (476940.23 MB)
530KERN: content size: 500107862016
531KERN: block size: 512
532KERN: child count: 1
533KERN: index: -1
534KERN: status: 0
535KERN: flags: 5
536KERN: volume: -1
537KERN: disk system: partitioning_systems/intel/map/v1
538KERN: name: ST3500418AS
539KERN: content name: <NULL>
540KERN: type: <NULL>
541KERN: content type: Intel Partition Map
542KERN: params: <NULL>
543KERN: content params: <NULL>
544KERN: partition 7: /dev/disk/ata/2/master/0
545KERN: offset: 8225280
546KERN: size: 500097024000 (476929.687 MB)
547KERN: content size: 500097024000
548KERN: block size: 512
549KERN: child count: 2
550KERN: index: 0
551KERN: status: 0
552KERN: flags: 4
553KERN: volume: -1
554KERN: disk system: partitioning_systems/intel/extended/v1
555KERN: name: <NULL>
556KERN: content name: <NULL>
557KERN: type: Intel Extended Partition
558KERN: content type: Intel Extended Partition
559KERN: params: type = 5 ; active = 1
560KERN: content params: <NULL>
561KERN: partition 8: /dev/disk/ata/2/master/0_0
562KERN: offset: 8257536
563KERN: size: 391860532224 (373707.325 MB)
564KERN: content size: 0
565KERN: block size: 512
566KERN: child count: 0
567KERN: index: 0
568KERN: status: 2
569KERN: flags: 0
570KERN: volume: -1
571KERN: disk system: <NULL>
572KERN: name: <NULL>
573KERN: content name: <NULL>
574KERN: type: Windows NT, OS/2
575KERN: content type: <NULL>
576KERN: params: active false ;
577KERN: partition_table_offset 8257024 ;
578KERN:
579KERN: content params: <NULL>
580KERN: partition 9: /dev/disk/ata/2/master/0_1
581KERN: offset: 391868822528
582KERN: size: 108236111872 (103222 MB)
583KERN: content size: 108236111872
584KERN: block size: 2048
585KERN: child count: 0
586KERN: index: 1
587KERN: status: 0
588KERN: flags: 2
589KERN: volume: -1
590KERN: disk system: file_systems/bfs/v1
591KERN: name: <NULL>
592KERN: content name: Haiku
593KERN: type: Be File System
594KERN: content type: Be File System
595KERN: params: active false ;
596KERN: partition_table_offset 391868790272 ;
597KERN:
598KERN: content params: <NULL>
599KERN: device 1: /dev/disk/ata/2/slave/raw
600KERN: media status: No error
601KERN: device flags: 2
602KERN: offset: 0
603KERN: size: 1000204886016 (953869.71 MB)
604KERN: content size: 1000204886016
605KERN: block size: 512
606KERN: child count: 0
607KERN: index: -1
608KERN: status: 0
609KERN: flags: 5
610KERN: volume: -1
611KERN: disk system: partitioning_systems/intel/map/v1
612KERN: name: SAMSUNG HD103SJ
613KERN: content name: <NULL>
614KERN: type: <NULL>
615KERN: content type: Intel Partition Map
616KERN: params: <NULL>
617KERN: content params: <NULL>
618KERN: device 2: /dev/disk/ata/5/slave/raw
619KERN: media status: No error
620KERN: device flags: 2
621KERN: offset: 0
622KERN: size: 640135028736 (610480.335 MB)
623KERN: content size: 640135028736
624KERN: block size: 512
625KERN: child count: 3
626KERN: index: -1
627KERN: status: 0
628KERN: flags: 5
629KERN: volumKERN: e: -1
630KERN: disk system: partitioning_systems/intel/map/v1
631KERN: name: WDC WD6400AAKS-65A7B2
632KERN: content name: <NULL>
633KERN: type: <NULL>
634KERN: content type: Intel Partition Map
635KERN: params: <NULL>
636KERN: content params: <NULL>
637KERN: partition 10: /dev/disk/ata/5/slave/0
638KERN: offset: 32256
639KERN: size: 443021773824 (422498.487 MB)
640KERN: content size: 0
641KERN: block size: 512
642KERN: child count: 0
643KERN: index: 0
644KERN: status: 2
645KERN: flags: 0
646KERN: volume: -1
647KERN: disk system: <NULL>
648KERN: name: <NULL>
649KERN: content name: <NULL>
650KERN: type: Windows NT, OS/2
651KERN: content type: <NULL>
652KERN: params: type = 7 ; active = 0
653KERN: content params: <NULL>
654KERN: partition 11: /dev/disk/ata/5/slave/1
655KERN: offset: 443021806080
656KERN: size: 107874547200 (102877.185 MB)
657KERN: content size: 0
658KERN: block size: 512
659KERN: child count: 0
660KERN: index: 1
661KERN: status: 2
662KERN: flags: 0
663KERN: volume: -1
664KERN: disk system: <NULL>
665KERN: name: <NULL>
666KERN: content name: <NULL>
667KERN: type: Windows NT, OS/2
668KERN: content type: <NULL>
669KERN: params: type = 7 ; active = 0
670KERN: content params: <NULL>
671KERN: partition 12: /dev/disk/ata/5/slave/2
672KERN: offset: 550896353280
673KERN: size: 89238011904 (85104 MB)
674KERN: content size: 89238011904
675KERN: block size: 2048
676KERN: child count: 0
677KERN: index: 2
678KERN: status: 0
679KERN: flags: 2
680KERN: volume: -1
681KERN: disk system: file_systems/bfs/v1
682KERN: name: <NULL>
683KERN: content name: Haiku
684KERN: type: Be File System
685KERN: content type: Be File System
686KERN: params: type = 235 ; active = 0
687KERN: content params: <NULL>
688KERN: device 3: /dev/disk/atapi/0/master/raw
689KERN: media status: No media present
690KERN: device flags: 5
691KERN: device 4: /dev/disk/atapi/0/slave/raw
692KERN: media status: No media present
693KERN: device flags: 5
694KERN: device 5: /dev/disk/atapi/4/master/raw
695KERN: media status: No media present
696KERN: device flags: 5
697KERN: device 6: /dev/disk/atapi/5/master/raw
698KERN: media status: No error
699KERN: device flags: 7
700KERN: offset: 0
701KERN: size: 438919168 (418.585 MB)
702KERN: content size: 882
703KERN: block size: 882
704KERN: child count: 0
705KERN: index: -1
706KERN: status: 0
707KERN: flags: b
708KERN: volume: -1
709KERN: disk system: file_systems/iso9660/v1
710KERN: name: hp DVD-RAM GH40L
711KERN: content name: Haiku
712KERN: type: <NULL>
713KERN: content type: ISO9660 File System
714KERN: params: <NULL>
715KERN: content params: <NULL>
716KERN: Mounted boot partition: /dev/disk/atapi/5/master/raw
717KERN: module_init_post_boot_device() failed to normalize path of module image 0x8300c5e8, "attribute_overlay"
718KERN: module_init_post_boot_device() failed to normalize path of module image 0x8300c600, "write_overlay"
719KERN: module_init_post_boot_device() failed to normalize path of module image 0x8300c5b8, "iso9660"
720KERN: module: Search for file_cache/launch_speedup/v1 failed.
721KERN: partitioning system: partitioning_systems/amiga_rdb/v1
722KERN: KDiskDeviceManager::_AddDiskSystem(partitioning_systems/amiga_rdb/v1)
723KERN: KDiskDeviceManager::_AddDiskSystem() done: No error
724KERN: partitioning system: partitioning_systems/apple/v1
725KERN: KDiskDeviceManager::_AddDiskSystem(partitioning_systems/apple/v1)
726KERN: KDiskDeviceManager::_AddDiskSystem() done: No error
727KERN: partitioning system: partitioning_systems/efi_gpt/v1
728KERN: KDiskDeviceManager::_AddDiskSystem(partitioning_systems/efi_gpt/v1)
729KERN: KDiskDeviceManager::_AddDiskSystem() done: No error
730KERN: file system: file_systems/btrfs/v1
731KERN: KDiskDeviceManager::_AddDiskSystem(file_systems/btrfs/v1)
732KERN: KDiskDeviceManager::_AddDiskSystem() done: No error
733KERN: file system: file_systems/cdda/v1
734KERN: KDiskDeviceManager::_AddDiskSystem(file_systems/cdda/v1)
735KERN: KDiskDeviceManager::_AddDiskSystem() done: No error
736KERN: file system: file_systems/exfat/v1
737KERN: KDiskDeviceManager::_AddDiskSystem(file_systems/exfat/v1)
738KERN: KDiskDeviceManager::_AddDiskSystem() done: No error
739KERN: file system: file_systems/ext2/v1
740KERN: KDiskDeviceManager::_AddDiskSystem(file_systems/ext2/v1)
741KERN: KDiskDeviceManager::_AddDiskSystem() done: No error
742KERN: file system: file_systems/fat/v1
743KERN: KDiskDeviceManager::_AddDiskSystem(file_systems/fat/v1)
744KERN: KDiskDeviceManager::_AddDiskSystem() done: No error
745KERN: file system: file_systems/googlefs/v1
746KERN: KDiskDeviceManager::_AddDiskSystem(file_systems/googlefs/v1)
747KERN: googlefs: std_ops(INIT)
748KERN: googlefs: std_ops(UNINIT)
749KERN: KDiskDeviceManager::_AddDiskSystem() done: No error
750KERN: file system: file_systems/nfs/v1
751KERN: KDiskDeviceManager::_AddDiskSystem(file_systems/nfs/v1)
752KERN: KDiskDeviceManager::_AddDiskSystem() done: No error
753KERN: file system: file_systems/ntfs/v1
754KERN: KDiskDeviceManager::_AddDiskSystem(file_systems/ntfs/v1)
755KERN: KDiskDeviceManager::_AddDiskSystem() done: No error
756KERN: file system: file_systems/reiserfs/v1
757KERN: KDiskDeviceManager::_AddDiskSystem(file_systems/reiserfs/v1)
758KERN: KDiskDeviceManager::_AddDiskSystem() done: No error
759KERN: file system: file_systems/udf/v1
760KERN: KDiskDeviceManager::_AddDiskSystem(file_systems/udf/v1)
761KERN: KDiskDeviceManager::_AddDiskSystem() done: No error
762KERN: KDiskDeviceManager::_ScanPartition(/dev/disk/ata/2/master/0_0)
763KERN: trying: partitioning_systems/amiga_rdb/v1
764KERN: con_init: trying module console/frame_buffer/v1
765KERN: loaded driver /boot/system/add-ons/kernel/drivers/dev/console
766KERN: loaded driver /boot/system/add-ons/kernel/drivers/dev/dprintf
767KERN: loaded driver /boot/system/add-ons/kernel/drivers/dev/null
768KERN: loaded driver /boot/system/add-ons/kernel/drivers/dev/random
769KERN: loaded driver /boot/system/add-ons/kernel/drivers/dev/tty
770KERN: loaded driver /boot/system/add-ons/kernel/drivers/dev/zero
771KERN: ahci: ahci_supports_device
772Last message repeated 1 time
773KERN: returned: -1
774KERN: trying: partitioning_systems/apple/v1
775KERN: returned: -1
776KERN: trying: partitioning_systems/efi_gpt/v1
777KERN: returned: -1
778KERN: trying: file_systems/btrfs/v1
779KERN: [34mbtrfs:[0m invalid super block!
780KERN: returned: -1
781KERN: trying: file_systems/cdda/v1
782KERN: raw_command:
783KERN: returned: -1
784KERN: trying: file_systems/exfat/v1
785KERN: [34mexfat:[0m invalid super block!
786KERN: returned: -1
787KERN: trying: file_systems/ext2/v1
788KERN: [34mext2:[0m invalid super block!
789KERN: returned: -1
790KERN: trying: file_systems/fat/v1
791KERN: returned: -1
792KERN: googlefs: std_ops(INIT)
793KERN: trying: file_systems/googlefs/v1
794KERN: returned: -1
795KERN: googlefs: std_ops(UNINIT)
796KERN: trying: file_systems/nfs/v1
797KERN: returned: -1
798KERN: trying: file_systems/ntfs/v1
799KERN: returned: 0.8
800KERN: trying: file_systems/reiserfs/v1
801KERN: returned: -1
802KERN: trying: file_systems/udf/v1
803KERN: udf_recognize: Invalid sequence. status = -1
804KERN: returned: -1
805KERN: scanning with: file_systems/ntfs/v1
806KERN: KDiskDeviceManager::_ScanPartition(/dev/disk/ata/2/master/0_1)
807KERN: trying: partitioning_systems/amiga_rdb/v1
808KERN: returned: -1
809KERN: trying: partitioning_systems/apple/v1
810KERN: returned: -1
811KERN: trying: partitioning_systems/efi_gpt/v1
812KERN: returned: -1
813KERN: trying: file_systems/btrfs/v1
814KERN: [34mbtrfs:[0m invalid super block!
815KERN: returned: -1
816KERN: trying: file_systems/cdda/v1
817KERN: raw_command:
818KERN: returned: -1
819KERN: trying: file_systems/exfat/v1
820KERN: [34mexfat:[0m invalid super block!
821KERN: returned: -1
822KERN: trying: file_systems/ext2/v1
823KERN: [34mext2:[0m invalid super block!
824KERN: returned: -1
825KERN: trying: file_systems/fat/v1
826KERN: returned: -1
827KERN: googlefs: std_ops(INIT)
828KERN: trying: file_systems/googlefs/v1
829KERN: returned: -1
830KERN: googlefs: std_ops(UNINIT)
831KERN: trying: file_systems/nfs/v1
832KERN: returned: -1
833KERN: trying: file_systems/ntfs/v1
834KERN: fs_identify_partition: boot signature NTFS doesn't match
835KERN: returned: -1
836KERN: trying: file_systems/reiserfs/v1
837KERN: returned: -1
838KERN: trying: file_systems/udf/v1
839KERN: read_pos(pos:802547348570112, len:2048) failed with: 0xffffffff
840KERN: udf_recognize: Invalid sequence. status = -1
841KERN: returned: -1
842KERN: KDiskDeviceManager::_ScanPartition(/dev/disk/ata/2/slave/raw)
843KERN: trying: partitioning_systems/amiga_rdb/v1
844KERN: returned: -1
845KERN: trying: partitioning_systems/apple/v1
846KERN: returned: -1
847KERN: trying: partitioning_systems/efi_gpt/v1
848KERN: returned: -1
849KERN: trying: file_systems/btrfs/v1
850KERN: [34mbtrfs:[0m invalid super block!
851KERN: returned: -1
852KERN: trying: file_systems/cdda/v1
853KERN: raw_command:
854KERN: returned: -1
855KERN: trying: file_systems/exfat/v1
856KERN: [34mexfat:[0m invalid super block!
857KERN: returned: -1
858KERN: trying: file_systems/extKERN: 2/v1
859KERN: [34mext2:[0m invalid super block!
860KERN: returned: -1
861KERN: trying: file_systems/fat/v1
862KERN: returned: -1
863KERN: googlefs: std_ops(INIT)
864KERN: trying: file_systems/googlefs/v1
865KERN: returned: -1
866KERN: googlefs: std_ops(UNINIT)
867KERN: trying: file_systems/nfs/v1
868KERN: returned: -1
869KERN: trying: file_systems/ntfs/v1
870KERN: fs_identify_partition: boot signature NTFS doesn't match
871KERN: returned: -1
872KERN: trying: file_systems/reiserfs/v1
873KERN: returned: -1
874KERN: trying: file_systems/udf/v1
875KERN: udf_recognize: Invalid sequence. status = -1
876KERN: returned: -1
877KERN: KDiskDeviceManager::_ScanPartition(/dev/disk/ata/5/slave/0)
878KERN: trying: partitioning_systems/amiga_rdb/v1
879KERN: returned: -1
880KERN: trying: partitioning_systems/apple/v1
881KERN: returned: -1
882KERN: trying: partitioning_systems/efi_gpt/v1
883KERN: returned: -1
884KERN: trying: file_systems/btrfs/v1
885KERN: [34mbtrfs:[0m invalid super block!
886KERN: returned: -1
887KERN: trying: file_systems/cdda/v1
888KERN: raw_command:
889KERN: returned: -1
890KERN: trying: file_systems/exfat/v1
891KERN: [34mexfat:[0m invalid super block!
892KERN: returned: -1
893KERN: trying: file_systems/ext2/v1
894KERN: [34mext2:[0m invalid super block!
895KERN: returned: -1
896KERN: trying: file_systems/fat/v1
897KERN: returned: -1
898KERN: googlefs: std_ops(INIT)
899KERN: trying: file_systems/googlefs/v1
900KERN: returned: -1
901KERN: googlefs: std_ops(UNINIT)
902KERN: trying: file_systems/nfs/v1
903KERN: returned: -1
904KERN: trying: file_systems/ntfs/v1
905KERN: fs_identify_partition: mount failed
906KERN: returned: -1
907KERN: trying: file_systems/reiserfs/v1
908KERN: returned: -1
909KERN: trying: file_systems/udf/v1
910KERN: udf_recognize: Invalid sequence. status = -1
911KERN: returned: -1
912KERN: KDiskDeviceManager::_ScanPartition(/dev/disk/ata/5/slave/1)
913KERN: trying: partitioning_systems/amiga_rdb/v1
914KERN: returned: -1
915KERN: trying: partitioning_systems/apple/v1
916KERN: returned: -1
917KERN: trying: partitioning_systems/efi_gpt/v1
918KERN: returned: -1
919KERN: trying: file_systems/btrfs/v1
920KERN: [34mbtrfs:[0m invalid super block!
921KERN: returned: -1
922KERN: trying: file_systems/cdda/v1
923KERN: raw_command:
924KERN: returned: -1
925KERN: trying: file_systems/exfat/v1
926KERN: [34mexfat:[0m invalid super block!
927KERN: returned: -1
928KERN: trying: file_systems/ext2/v1
929KERN: [34mext2:[0m invalid super block!
930KERN: returned: -1
931KERN: trying: file_systems/fat/v1
932KERN: returned: -1
933KERN: googlefs: std_ops(INIT)
934KERN: trying: file_systems/googlefs/v1
935KERN: returned: -1
936KERN: googlefs: std_ops(UNINIT)
937KERN: trying: file_systems/nfs/v1
938KERN: returned: -1
939KERN: trying: file_systems/ntfs/v1
940KERN: returned: 0.8
941KERN: trying: file_systems/reiserfs/v1
942KERN: returned: -1
943KERN: trying: file_systems/udf/v1
944KERN: read_pos(pos:226827164721152, len:512) failed with: 0xffffffff
945KERN: udf_recognize: Invalid sequence. status = -1
946KERN: returned: -1
947KERN: scanning with: file_systems/ntfs/v1
948KERN: KDiskDeviceManager::_ScanPartition(/dev/disk/ata/5/slave/2)
949KERN: trying: partitioning_systems/amiga_rdb/v1
950KERN: returned: -1
951KERN: trying: partitioning_systems/apple/v1
952KERN: returned: -1
953KERN: trying: partitioning_systems/efi_gpt/v1
954KERN: returned: -1
955KERN: trying: file_systems/btrfs/v1
956KERN: [34mbtrfs:[0m invalid super block!
957KERN: returned: -1
958KERN: trying: file_systems/cdda/v1
959KERN: raw_command:
960KERN: returned: -1
961KERN: trying: file_systems/exfat/v1
962KERN: [34mexfat:[0m invalid super block!
963KERN: returned: -1
964KERN: trying: file_systems/ext2/v1
965KERN: [34mext2:[0m invalid super block!
966KERN: returned: -1
967KERN: trying: file_systems/fat/v1
968KERN: returned: -1
969KERN: googlefs: std_ops(INIT)
970KERN: trying: file_systems/googlefs/v1
971KERN: returned: -1
972KERN: googlefs: std_ops(UNINIT)
973KERN: trying: file_systems/nfs/v1
974KERN: returned: -1
975KERN: trying: file_systems/ntfs/v1
976KERN: fs_identify_partition: boot signature NTFS doesn't match
977KERN: returned: -1
978KERN: trying: file_systems/reiserfs/v1
979KERN: returned: -1
980KERN: trying: file_systems/udf/v1
981KERN: read_pos(pos:1128235731550208, len:2048) failed with: 0xffffffff
982KERN: udf_recognize: Invalid sequence. status = -1
983KERN: returned: -1
984KERN: KDiskDeviceManager::_Scan(/dev/disk)
985KERN: KDiskDeviceManager::_Scan(/dev/disk/ata)
986KERN: KDiskDeviceManager::_Scan(/dev/disk/ata/2)
987KERN: KDiskDeviceManager::_Scan(/dev/disk/ata/2/master)
988KERN: KDiskDeviceManager::_Scan(/dev/disk/ata/2/master/0)
989KERN: KDiskDeviceManager::_Scan(/dev/disk/ata/2/master/0_0)
990KERN: KDiskDeviceManager::_Scan(/dev/disk/ata/2/master/0_1)
991KERN: KDiskDeviceManager::_Scan(/dev/disk/ata/2/master/raw)
992KERN: KDiskDeviceManager::_Scan(/dev/disk/ata/2/slave)
993KERN: KDiskDeviceManager::_Scan(/dev/disk/ata/2/slave/raw)
994KERN: KDiskDeviceManager::_Scan(/dev/disk/ata/5)
995KERN: KDiskDeviceManager::_Scan(/dev/disk/ata/5/slave)
996KERN: KDiskDeviceManager::_Scan(/dev/disk/ata/5/slave/0)
997KERN: KDiskDeviceManager::_Scan(/dev/disk/ata/5/slave/1)
998KERN: KDiskDeviceManager::_Scan(/dev/disk/ata/5/slave/2)
999KERN: KDiskDeviceManager::_Scan(/dev/disk/ata/5/slave/raw)
1000KERN: KDiskDeviceManager::_Scan(/dev/disk/atapi)
1001KERN: KDiskDeviceManager::_Scan(/dev/disk/atapi/0)
1002KERN: KDiskDeviceManager::_Scan(/dev/disk/atapi/0/master)
1003KERN: KDiskDeviceManager::_Scan(/dev/disk/atapi/0/master/raw)
1004KERN: KDiskDeviceManager::_Scan(/dev/disk/atapi/0/slave)
1005KERN: KDiskDeviceManager::_Scan(/dev/disk/atapi/0/slave/raw)
1006KERN: KDiskDeviceManager::_Scan(/dev/disk/atapi/4)
1007KERN: KDiskDeviceManager::_Scan(/dev/disk/atapi/4/master)
1008KERN: KDiskDeviceManager::_Scan(/dev/disk/atapi/4/master/raw)
1009KERN: KDiskDeviceManager::_Scan(/dev/disk/atapi/5)
1010KERN: KDiskDeviceManager::_Scan(/dev/disk/atapi/5/master)
1011KERN: KDiskDeviceManager::_Scan(/dev/disk/atapi/5/master/raw)
1012KERN: KDiskDeviceManager::_Scan(/dev/disk/floppy)
1013KERN: config_manager: driver module: init
1014KERN: driver_get_next_device_info(bus = 0, cookie = 0)
1015KERN: loaded driver /boot/system/add-ons/kernel/drivers/dev/disk/floppy/pc_floppy
1016KERN: KDiskDeviceManager::_Scan(/dev/disk/usb)
1017KERN: loaded driver /boot/system/add-ons/kernel/drivers/dev/disk/usb/usb_disk
1018KERN: [35musb_floppy[0m: no valid CBI interface found
1019KERN: Last message repeated 7 times.
1020KERN: loaded driver /boot/system/add-ons/kernel/drivers/dev/disk/usb/usb_floppy
1021KERN: KDiskDeviceManager::_Scan(/dev/disk/virtual)
1022KERN: nbd:>init_hardware()
1023KERN: nbd:>init_driver()
1024KERN: KDiskDeviceManager::_ScanPartition(/dev/disk/ata/2/master/0_0)
1025KERN: trying: partitioning_systems/intel/extended/v1
1026KERN: intel: ep_identify_partition(2, 8257536, 391860532224, 512)
1027KERN: returned: -1
1028KERN: trying: partitioning_systems/intel/map/v1
1029KERN: intel: pm_identify_partition(2, 8: 8257536, 391860532224, 512)
1030KERN: returned: -1
1031KERN: trying: partitioning_systems/session/v1
1032KERN: returned: -1
1033KERN: trying: file_systems/write_overlay/v1
1034KERN: returned: -1
1035KERN: trying: file_systems/bfs/v1
1036KERN: returned: -1
1037KERN: trying: file_systems/devfs/v1
1038KERN: returned: -1
1039KERN: trying: file_systems/attribute_overlay/v1
1040KERN: returned: -1
1041KERN: trying: file_systems/iso9660/v1
1042KERN: identify(2, 0x8897e190)
1043KERN: returned: -1
1044KERN: trying: file_systems/rootfs/v1
1045KERN: returned: -1
1046KERN: trying: partitioning_systems/amiga_rdb/v1
1047KERN: returned: -1
1048KERN: trying: partitioning_systems/apple/v1
1049KERN: returned: -1
1050KERN: trying: partitioning_systems/efi_gpt/v1
1051KERN: returned: -1
1052KERN: trying: file_systems/btrfs/v1
1053KERN: [34mbtrfs:[0m invalid super block!
1054KERN: returned: -1
1055KERN: trying: file_systems/cdda/v1
1056KERN: raw_command:
1057KERN: returned: -1
1058KERN: trying: file_systems/exfat/v1
1059KERN: [34mexfat:[0m invalid super block!
1060KERN: returned: -1
1061KERN: trying: file_systems/ext2/v1
1062KERN: [34mext2:[0m invalid super block!
1063KERN: returned: -1
1064KERN: trying: file_systems/fat/v1
1065KERN: returned: -1
1066KERN: googlefs: std_ops(INIT)
1067KERN: trying: file_systems/googlefs/v1
1068KERN: returned: -1
1069KERN: googlefs: std_ops(UNINIT)
1070KERN: trying: file_systems/nfs/v1
1071KERN: returned: -1
1072KERN: trying: file_systems/ntfs/v1
1073KERN: fs_identify_partition: mount failed
1074KERN: returned: -1
1075KERN: trying: file_systems/reiserfs/v1
1076KERN: returned: -1
1077KERN: trying: file_systems/udf/v1
1078KERN: udf_recognize: Invalid sequence. status = -1
1079KERN: returned: -1
1080KERN: KDiskDeviceManager::_ScanPartition(/dev/disk/ata/2/master/0_1)
1081KERN: trying: partitioning_systems/intel/extended/v1
1082KERN: intel: ep_identify_partition(2, 391868822528, 108236111872, 2048)
1083KERN: returned: -1
1084KERN: trying: partitioning_systems/intel/map/v1
1085KERN: intel: pm_identify_partition(2, 9: 391868822528, 108236111872, 2048)
1086KERN: returned: -1
1087KERN: trying: partitioning_systems/session/v1
1088KERN: returned: -1
1089KERN: trying: file_systems/write_overlay/v1
1090KERN: returned: -1
1091KERN: trying: file_systems/bfs/v1
1092KERN: returned: 0.8
1093KERN: trying: file_systems/devfs/v1
1094KERN: returned: -1
1095KERN: trying: file_systems/attribute_overlay/v1
1096KERN: returned: -1
1097KERN: trying: file_systems/iso9660/v1
1098KERN: identify(2, 0x8897e3c0)
1099KERN: returned: -1
1100KERN: trying: file_systems/rootfs/v1
1101KERN: returned: -1
1102KERN: trying: partitioning_systems/amiga_rdb/v1
1103KERN: returned: -1
1104KERN: trying: partitioning_systems/apple/v1
1105KERN: returned: -1
1106KERN: trying: partitioning_systems/efi_gpt/v1
1107KERN: returned: -1
1108KERN: trying: file_systems/btrfs/v1
1109KERN: [34mbtrfs:[0m invalid super block!
1110KERN: returned: -1
1111KERN: trying: file_systems/cdda/v1
1112KERN: raw_command:
1113KERN: returned: -1
1114KERN: trying: file_systems/exfat/v1
1115KERN: [34mexfat:[0m invalid super block!
1116KERN: returned: -1
1117KERN: KERN: trying: file_systems/ext2/v1
1118KERN: [34mext2:[0m invalid super block!
1119KERN: returned: -1
1120KERN: trying: file_systems/fat/v1
1121KERN: returned: -1
1122KERN: googlefs: std_ops(INIT)
1123KERN: trying: file_systems/googlefs/v1
1124KERN: returned: -1
1125KERN: googlefs: std_ops(UNINIT)
1126KERN: trying: file_systems/nfs/v1
1127KERN: returned: -1
1128KERN: trying: file_systems/ntfs/v1
1129KERN: fs_identify_partition: boot signature NTFS doesn't match
1130KERN: returned: -1
1131KERN: trying: file_systems/reiserfs/v1
1132KERN: returned: -1
1133KERN: trying: file_systems/udf/v1
1134KERN: read_pos(pos:802547348570112, len:2048) failed with: 0xffffffff
1135KERN: udf_recognize: Invalid sequence. status = -1
1136KERN: returned: -1
1137KERN: KDiskDeviceManager::_ScanPartition(/dev/disk/ata/2/slave/raw)
1138KERN: trying: partitioning_systems/intel/extended/v1
1139KERN: returned: -1
1140KERN: trying: partitioning_systems/intel/map/v1
1141KERN: intel: pm_identify_partition(2, 1: 0, 1000204886016, 512)
1142KERN: returned: 0.5
1143KERN: trying: partitioning_systems/session/v1
1144KERN: returned: -1
1145KERN: trying: file_systems/write_overlay/v1
1146KERN: returned: -1
1147KERN: trying: file_systems/bfs/v1
1148KERN: returned: -1
1149KERN: trying: file_systems/devfs/v1
1150KERN: returned: -1
1151KERN: trying: file_systems/attribute_overlay/v1
1152KERN: returned: -1
1153KERN: trying: file_systems/iso9660/v1
1154KERN: identify(2, 0x8897e140)
1155KERN: returned: -1
1156KERN: trying: file_systems/rootfs/v1
1157KERN: returned: -1
1158KERN: trying: partitioning_systems/amiga_rdb/v1
1159KERN: returned: -1
1160KERN: trying: partitioning_systems/apple/v1
1161KERN: returned: -1
1162KERN: trying: partitioning_systems/efi_gpt/v1
1163KERN: returned: -1
1164KERN: trying: file_systems/btrfs/v1
1165KERN: [34mbtrfs:[0m invalid super block!
1166KERN: returned: -1
1167KERN: trying: file_systems/cdda/v1
1168KERN: raw_command:
1169KERN: returned: -1
1170KERN: trying: file_systems/exfat/v1
1171KERN: [34mexfat:[0m invalid super block!
1172KERN: returned: -1
1173KERN: trying: file_systems/ext2/v1
1174KERN: [34mext2:[0m invalid super block!
1175KERN: returned: -1
1176KERN: trying: file_systems/fat/v1
1177KERN: returned: -1
1178KERN: googlefs: std_ops(INIT)
1179KERN: trying: file_systems/googlefs/v1
1180KERN: returned: -1
1181KERN: googlefs: std_ops(UNINIT)
1182KERN: trying: file_systems/nfs/v1
1183KERN: returned: -1
1184KERN: trying: file_systems/ntfs/v1
1185KERN: fs_identify_partition: boot signature NTFS doesn't match
1186KERN: returned: -1
1187KERN: trying: file_systems/reiserfs/v1
1188KERN: returned: -1
1189KERN: trying: file_systems/udf/v1
1190KERN: udf_recognize: Invalid sequence. status = -1
1191KERN: returned: -1
1192KERN: KDiskDeviceManager::_ScanPartition(/dev/disk/ata/5/slave/0)
1193KERN: trying: partitioning_systems/intel/extended/v1
1194KERN: intel: ep_identify_partition(2, 32256, 443021773824, 512)
1195KERN: returned: -1
1196KERN: trying: partitioning_systems/intel/map/v1
1197KERN: intel: pm_identify_partition(2, 10: 32256, 443021773824, 512)
1198KERN: returned: -1
1199KERN: trying: partitioning_systems/session/v1
1200KERN: returned: -1
1201KERN: trying: file_systems/write_overlay/v1
1202KERN: returned: -1
1203KERN: trying: file_systems/bfs/v1
1204KERN: returned: -1
1205KERN: trying: file_systems/devfs/v1
1206KERN: returned: -1
1207KERN: trying: file_systems/attribute_overlay/v1
1208KERN: returned: -1
1209KERN: trying: file_systems/iso9660/v1
1210KERN: identify(2, 0x8897e190)
1211KERN: returned: -1
1212KERN: trying: file_systems/rootfs/v1
1213KERN: returned: -1
1214KERN: trying: partitioning_systems/amiga_rdb/v1
1215KERN: returned: -1
1216KERN: trying: partitioning_systems/apple/v1
1217KERN: returned: -1
1218KERN: trying: partitioning_systems/efi_gpt/v1
1219KERN: returned: -1
1220KERN: trying: file_systems/btrfs/v1
1221KERN: [34mbtrfs:[0m invalid super block!
1222KERN: returned: -1
1223KERN: trying: file_systems/cdda/v1
1224KERN: raw_command:
1225KERN: returned: -1
1226KERN: trying: file_systems/exfat/v1
1227KERN: [34mexfat:[0m invalid super block!
1228KERN: returned: -1
1229KERN: trying: file_systems/ext2/v1
1230KERN: [34mext2:[0m invalid super block!
1231KERN: returned: -1
1232KERN: trying: file_systems/fat/v1
1233KERN: returned: -1
1234KERN: googlefs: std_ops(INIT)
1235KERN: trying: file_systems/googlefs/v1
1236KERN: returned: -1
1237KERN: googlefs: std_ops(UNINIT)
1238KERN: trying: file_systems/nfs/v1
1239KERN: returned: -1
1240KERN: trying: file_systems/ntfs/v1
1241KERN: fs_identify_partition: mount failed
1242KERN: returned: -1
1243KERN: trying: file_systems/reiserfs/v1
1244KERN: returned: -1
1245KERN: trying: file_systems/udf/v1
1246KERN: udf_recognize: Invalid sequence. status = -1
1247KERN: returned: -1
1248KERN: KDiskDeviceManager::_ScanPartition(/dev/disk/ata/5/slave/1)
1249KERN: trying: partitioning_systems/intel/extended/v1
1250KERN: intel: ep_identify_partition(2, 443021806080, 107874547200, 512)
1251KERN: returned: -1
1252KERN: trying: partitioning_systems/intel/map/v1
1253KERN: intel: pm_identify_partition(2, 11: 443021806080, 107874547200, 512)
1254KERN: returned: -1
1255KERN: trying: partitioning_systems/session/v1
1256KERN: returned: -1
1257KERN: trying: file_systems/write_overlay/v1
1258KERN: returned: -1
1259KERN: trying: file_systems/bfs/v1
1260KERN: returned: -1
1261KERN: trying: file_systems/devfs/v1
1262KERN: returned: -1
1263KERN: trying: file_systems/attribute_overlay/v1
1264KERN: returned: -1
1265KERN: trying: file_systems/iso9660/v1
1266KERN: identify(2, 0x8897e3c0)
1267KERN: returned: -1
1268KERN: trying: file_systems/rootfs/v1
1269KERN: returned: -1
1270KERN: trying: partitioning_systems/amiga_rdb/v1
1271KERN: returned: -1
1272KERN: trying: partitioning_systems/apple/v1
1273KERN: returned: -1
1274KERN: trying: partitioning_systems/efi_gpt/v1
1275KERN: returned: -1
1276KERN: trying: file_systems/btrfs/v1
1277KERN: [34mbtrfs:[0m invalid super block!
1278KERN: returned: -1
1279KERN: trying: file_systems/cdda/v1
1280KERN: raw_command:
1281KERN: returned: -1
1282KERN: trying: file_systems/exfat/v1
1283KERN: [34mexfat:[0m invalid super block!
1284KERN: returned: -1
1285KERN: trying: file_systems/ext2/v1
1286KERN: [34mext2:[0m invalid super block!
1287KERN: returned: -1
1288KERN: trying: file_systems/fat/v1
1289KERN: returned: -1
1290KERN: googlefs: std_ops(INIT)
1291KERN: trying: file_systems/googlefs/v1
1292KERN: returned: -1
1293KERN: googlefs: std_ops(UNINIT)
1294KERN: trying: file_systems/nfs/v1
1295KERN: returned: -1
1296KERN: trying: file_systems/ntfs/v1
1297KERN: fs_identify_partition: mount failed
1298KERN: returned: -1
1299KERN: trying: file_systems/reiserfs/v1
1300KERN: returned: -1
1301KERN: trying: file_systems/udf/v1
1302KERN: read_pos(pos:226827164721152, len:512) failed with: 0xffffffff
1303KERN: udf_recognize: Invalid sequence. status = -1
1304KERN: returned: -1
1305KERN: KDiskDeviceManager::_ScanPartition(/dev/disk/ata/5/slave/2)
1306KERN: trying: partitioning_systems/intel/extended/v1
1307KERN: intel: ep_identify_partition(2, 550896353280, 89238011904, 2048)
1308KERN: returned: -1
1309KERN: trying: partitioning_systems/intel/map/v1
1310KERN: intel: pm_identify_partition(2, 12: 550896353280, 89238011904, 2048)
1311KERN: returned: -1
1312KERN: trying: partitioning_systems/session/v1
1313KERN: returned: -1
1314KERN: trying: file_systems/write_overlay/v1
1315KERN: returned: -1
1316KERN: trying: file_systems/bfs/v1
1317KERN: returned: 0.8
1318KERN: trying: file_systems/devfs/v1
1319KERN: returned: -1
1320KERN: trying: file_systems/attribute_overlay/v1
1321KERN: returned: -1
1322KERN: trying: file_systems/iso9660/v1
1323KERN: identify(2, 0x8897e140)
1324KERN: returned: -1
1325KERN: trying: file_systems/rootfs/v1
1326KERN: returned: -1
1327KERN: trying: partitioning_systems/amiga_rdb/v1
1328KERN: returned: -1
1329KERN: trying: partitioning_systems/apple/v1
1330KERN: returned: -1
1331KERN: trying: partitioning_systems/efi_gpt/v1
1332KERN: returned: -1
1333KERN: trying: file_systems/btrfs/v1
1334KERN: [34mbtrfs:[0m invalid super block!
1335KERN: returned: -1
1336KERN: trying: file_systems/cdda/v1
1337KERN: raw_command:
1338KERN: returned: -1
1339KERN: trying: file_systems/exfat/v1
1340KERN: [34mexfat:[0m invalid super block!
1341KERN: returned: -1
1342KERN: trying: file_systems/ext2/v1
1343KERN: [34mext2:[0m invalid super block!
1344KERN: returned: -1
1345KERN: trying: file_systems/fat/v1
1346KERN: returned: -1
1347KERN: googlefs: std_ops(INIT)
1348KERN: trying: file_systems/googlefs/v1
1349KERN: returned: -1
1350KERN: googlefs: std_ops(UNINIT)
1351KERN: trying: file_systems/nfs/v1
1352KERN: returned: -1
1353KERN: trying: file_systems/ntfs/v1
1354KERN: fs_identify_partition: boot signature NTFS doesn't match
1355KERN: returned: -1
1356KERN: trying: file_systems/reiserfs/v1
1357KERN: returned: -1
1358KERN: trying: file_systems/udf/v1
1359KERN: read_pos(pos:1128235731550208, len:2048) failed with: 0xffffffff
1360KERN: udf_recognize: Invalid sequence. status = -1
1361KERN: returned: -1
1362KERN: allocate_commpage_entry(4, 34) -> 0xffff0118
1363KERN: allocate_commpage_entry(5, 74) -> 0xffff0140
1364KERN: add_memory_type_range(-1, 0x100000, 0xcfe90000, 6)
1365KERN: set MTRRs to:
1366KERN: mtrr: 0: base: 0xd0000000, size: 0x10000000, type: 0
1367KERN: mtrr: 1: base: 0xe0000000, size: 0x20000000, type: 0
1368KERN: add_memory_type_range(-1, 0x100000000, 0x30000000, 6)
1369KERN: set MTRRs to:
1370KERN: mtrr: 0: base: 0xd0000000, size: 0x10000000, type: 0
1371KERN: mtrr: 1: base: 0xe0000000, size: 0x20000000, type: 0
1372KERN: kernel debugger extension "debugger/disasm/v1": loaded
1373KERN: kernel debugger extension "debugger/invalidate_on_exit/v1": loaded
1374KERN: kernel debugger extension "debugger/run_on_exit/v1": loaded
1375KERN: kernel debugger extension "debugger/usb_keyboard/v1": loaded
1376KERN: add_memory_type_range(82, 0xd0000000, 0x500000, 1)
1377KERN: set MTRRs to:
1378KERN: devfs: reload driver "usb_disk" (-1, -1)
1379KERN: mtrr: 0: base: 0xe0000000, size: 0x20000000, type: 0
1380KERN: mtrr: 1: base: 0xd0000000, size: 0x10000000, type: 1
1381KERN: add_memory_type_range(791, 0x0, 0x1000, 0)
1382KERN: set MTRRs to:
1383KERN: mtrr: 0: base: 0x0, size: 0x1000, type: 0
1384KERN: mtrr: 1: base: 0xe0000000, size: 0x20000000, type: 0
1385KERN: mtrr: 2: base: 0xd0000000, KERN: size: 0x10000000, type: 1
1386KERN: remove_memory_type_range(791, 0x0, 0x1000, 0)
1387KERN: set MTRRs to:
1388KERN: mtrr: 0: base: 0xe0000000, size: 0x20000000, type: 0
1389KERN: mtrr: 1: base: 0xd0000000, size: 0x10000000, type: 1
1390KERN: add_memory_type_range(792, 0x9f000, 0x1000, 0)
1391KERN: set MTRRs to:
1392KERN: mtrr: 0: base: 0x9f000, size: 0x1000, type: 0
1393KERN: mtrr: 1: base: 0xe0000000, size: 0x20000000, type: 0
1394KERN: mtrr: 2: base: 0xd0000000, size: 0x10000000, type: 1
1395KERN: remove_memory_type_range(792, 0x9f000, 0x1000, 0)
1396KERN: set MTRRs to:
1397KERN: mtrr: 0: base: 0xe0000000, size: 0x20000000, type: 0
1398KERN: mtrr: 1: base: 0xd0000000, size: 0x10000000, type: 1
1399KERN: add_memory_type_range(793, 0xe0000, 0x20000, 0)
1400KERN: set MTRRs to:
1401KERN: mtrr: 0: base: 0xe0000, size: 0x20000, type: 0
1402KERN: mtrr: 1: base: 0xe0000000, size: 0x20000000, type: 0
1403KERN: mtrr: 2: base: 0xd0000000, size: 0x10000000, type: 1
1404KERN: remove_memory_type_range(793, 0xe0000, 0x20000, 0)
1405KERN: set MTRRs to:
1406KERN: mtrr: 0: base: 0xe0000000, size: 0x20000000, type: 0
1407KERN: mtrr: 1: base: 0xd0000000, size: 0x10000000, type: 1
1408KERN: add_memory_type_range(794, 0xfa000, 0x1000, 0)
1409KERN: set MTRRs to:
1410KERN: mtrr: 0: base: 0xfa000, size: 0x1000, type: 0
1411KERN: mtrr: 1: base: 0xe0000000, size: 0x20000000, type: 0
1412KERN: mtrr: 2: base: 0xd0000000, size: 0x10000000, type: 1
1413KERN: ACPI: RSDP 0x000faa30 00014 (v00 ACPIAM)
1414KERN: remove_memory_type_range(794, 0xfa000, 0x1000, 0)
1415KERN: set MTRRs to:
1416KERN: mtrr: 0: base: 0xe0000000, size: 0x20000000, type: 0
1417KERN: mtrr: 1: base: 0xd0000000, size: 0x10000000, type: 1
1418KERN: add_memory_type_range(795, 0xcff90000, 0x1000, 0)
1419KERN: set MTRRs to:
1420KERN: mtrr: 0: base: 0xcff90000, size: 0x10000, type: 0
1421KERN: mtrr: 1: base: 0xe0000000, size: 0x20000000, type: 0
1422KERN: mtrr: 2: base: 0xd0000000, size: 0x10000000, type: 1
1423KERN: ACPI: RSDT 0xcff90000 0003C (v01 7599MS A7599300 20110110 MSFT 00000097)
1424KERN: remove_memory_type_range(795, 0xcff90000, 0x1000, 0)
1425KERN: set MTRRs to:
1426KERN: mtrr: 0: base: 0xe0000000, size: 0x20000000, type: 0
1427KERN: mtrr: 1: base: 0xd0000000, size: 0x10000000, type: 1
1428KERN: add_memory_type_range(796, 0xcff90000, 0x1000, 0)
1429KERN: set MTRRs to:
1430KERN: mtrr: 0: base: 0xcff90000, size: 0x10000, type: 0
1431KERN: mtrr: 1: base: 0xe0000000, size: 0x20000000, type: 0
1432KERN: mtrr: 2: base: 0xd0000000, size: 0x10000000, type: 1
1433KERN: remove_memory_type_range(796, 0xcff90000, 0x1000, 0)
1434KERN: set MTRRs to:
1435KERN: mtrr: 0: base: 0xe0000000, size: 0x20000000, type: 0
1436KERN: mtrr: 1: base: 0xd0000000, size: 0x10000000, type: 1
1437KERN: add_memory_type_range(797, 0xcff90000, 0x1000, 0)
1438KERN: set MTRRs to:
1439KERN: mtrr: 0: base: 0xcff90000, size: 0x10000, type: 0
1440KERN: mtrr: 1: base: 0xe0000000, size: 0x20000000, type: 0
1441KERN: mtrr: 2: base: 0xd0000000, size: 0x10000000, type: 1
1442KERN: ACPI: FACP 0xcff90200 00084 (v01 7599MS A7599300 20110110 MSFT 00000097)
1443KERN: remove_memory_type_range(797, 0xcff90000, 0x1000, 0)
1444KERN: set MTRRs to:
1445KERN: mtrr: 0: base: 0xe0000000, size: 0x20000000, type: 0
1446KERN: mtrr: 1: base: 0xd0000000, size: 0x10000000, type: 1
1447KERN: add_memory_type_range(798, 0xcff90000, 0x1000, 0)
1448KERN: set MTRRs to:
1449KERN: mtrr: 0: base: 0xcff90000, size: 0x10000, type: 0
1450KERN: mtrr: 1: base: 0xe0000000, size: 0x20000000, type: 0
1451KERN: mtrr: 2: base: 0xd0000000, size: 0x10000000, type: 1
1452KERN: remove_memory_type_range(798, 0xcff90000, 0x1000, 0)
1453KERN: set MTRRs to:
1454KERN: mtrr: 0: base: 0xe0000000, size: 0x20000000, type: 0
1455KERN: mtrr: 1: base: 0xd0000000, size: 0x10000000, type: 1
1456KERN: add_memory_type_range(799, 0xcff90000, 0x1000, 0)
1457KERN: set MTRRs to:
1458KERN: mtrr: 0: base: 0xcff90000, size: 0x10000, type: 0
1459KERN: mtrr: 1: base: 0xe0000000, size: 0x20000000, type: 0
1460KERN: mtrr: 2: base: 0xd0000000, size: 0x10000000, type: 1
1461KERN: ACPI: DSDT 0xcff905d0 05910 (v01 A7599 A7599300 00000300 INTL 20051117)
1462KERN: remove_memory_type_range(799, 0xcff90000, 0x1000, 0)
1463KERN: set MTRRs to:
1464KERN: mtrr: 0: base: 0xe0000000, size: 0x20000000, type: 0
1465KERN: mtrr: 1: base: 0xd0000000, size: 0x10000000, type: 1
1466KERN: add_memory_type_range(800, 0xcff9e000, 0x1000, 0)
1467KERN: set MTRRs to:
1468KERN: mtrr: 0: base: 0xcff90000, size: 0x10000, type: 0
1469KERN: mtrr: 1: base: 0xe0000000, size: 0x20000000, type: 0
1470KERN: mtrr: 2: base: 0xd0000000, size: 0x10000000, type: 1
1471KERN: ACPI: FACS 0xcff9e000 00040
1472KERN: remove_memory_type_range(800, 0xcff9e000, 0x1000, 0)
1473KERN: set MTRRs to:
1474KERN: mtrr: 0: base: 0xe0000000, size: 0x20000000, type: 0
1475KERN: mtrr: 1: base: 0xd0000000, size: 0x10000000, type: 1
1476KERN: add_memory_type_range(801, 0xcff90000, 0x1000, 0)
1477KERN: set MTRRs to:
1478KERN: mtrr: 0: base: 0xcff90000, size: 0x10000, type: 0
1479KERN: mtrr: 1: base: 0xe0000000, size: 0x20000000, type: 0
1480KERN: mtrr: 2: base: 0xd0000000, size: 0x10000000, type: 1
1481KERN: ACPI: APIC 0xcff90390 0007C (v01 7599MS A7599300 20110110 MSFT 00000097)
1482KERN: remove_memory_type_range(801, 0xcff90000, 0x1000, 0)
1483KERN: set MTRRs to:
1484KERN: mtrr: 0: base: 0xe0000000, size: 0x20000000, type: 0
1485KERN: mtrr: 1: base: 0xd0000000, size: 0x10000000, type: 1
1486KERN: add_memory_type_range(802, 0xcff90000, 0x1000, 0)
1487KERN: set MTRRs to:
1488KERN: mtrr: 0: base: 0xcff90000, size: 0x10000, type: 0
1489KERN: mtrr: 1: base: 0xe0000000, size: 0x20000000, type: 0
1490KERN: mtrr: 2: base: 0xd0000000, size: 0x10000000, type: 1
1491KERN: ACPI: MCFG 0xcff90410 0003C (v01 7599MS OEMMCFG 20110110 MSFT 00000097)
1492KERN: remove_memory_type_range(802, 0xcff90000, 0x1000, 0)
1493KERN: set MTRRs to:
1494KERN: mtrr: 0: base: 0xe0000000, size: 0x20000000, type: 0
1495KERN: mtrr: 1: base: 0xd0000000, size: 0x10000000, type: 1
1496KERN: add_memory_type_range(803, 0xcff9e000, 0x1000, 0)
1497KERN: set MTRRs to:
1498KERN: mtrr: 0: base: 0xcff90000, size: 0x10000, type: 0
1499KERN: mtrr: 1: base: 0xe0000000, size: 0x20000000, type: 0
1500KERN: mtrr: 2: base: 0xd0000000, size: 0x10000000, type: 1
1501KERN: ACPI: OEMB 0xcff9e040 00072 (v01 7599MS A7599300 20110110 MSFT 00000097)
1502KERN: remove_memory_type_range(803, 0xcff9e000, 0x1000, 0)
1503KERN: set MTRRs to:
1504KERN: mtrr: 0: base: 0xe0000000, size: 0x20000000, type: 0
1505KERN: mtrr: 1: base: 0xd0000000, size: 0x10000000, type: 1
1506KERN: add_memory_type_range(804, 0xcff9a000, 0x1000, 0)
1507KERN: set MTRRs to:
1508KERN: mtrr: 0: base: 0xcff90000, size: 0x10000, type: 0
1509KERN: mtrr: 1: base: 0xe0000000, size: 0x20000000, type: 0
1510KERN: mtrr: 2: base: 0xd0000000, size: 0x10000000, type: 1
1511KERN: ACPI: SRAT 0xcff9a5d0 00108 (v03 AMD FAM_F_10 00000002 AMD 00000001)
1512KERN: remove_memory_type_range(804, 0xcff9a000, 0x1000, 0)
1513KERN: set MTRRs to:
1514KERN: mtrr: 0: base: 0xe0000000, size: 0x20000000, type: 0
1515KERN: mtrr: 1: base: 0xd0000000, size: 0x10000000, type: 1
1516KERN: add_memory_type_range(805, 0xcff9a000, 0x1000, 0)
1517KERN: set MTRRs to:
1518KERN: mtrr: 0: base: 0xcff90000, size: 0x10000, type: 0
1519KERN: mtrr: 1: base: 0xe0000000, size: 0x20000000, type: 0
1520KERN: mtrr: 2: base: 0xd0000000, size: 0x10000000, type: 1
1521KERN: ACPI: HPET 0xcff9a6e0 00038 (v01 7599MS OEMHPET 20110110 MSFT 00000097)
1522KERN: remove_memory_type_range(805, 0xcff9a000, 0x1000, 0)
1523KERN: set MTRRs to:
1524KERN: mtrr: 0: base: 0xe0000000, size: 0x20000000, type: 0
1525KERN: mtrr: 1: base: 0xd0000000, size: 0x10000000, type: 1
1526KERN: add_memory_type_range(806, 0xcff90000, 0x6000, 0)
1527KERN: set MTRRs to:
1528KERN: mtrr: 0: base: 0xcff90000, size: 0x10000, type: 0
1529KERN: mtrr: 1: base: 0xe0000000, size: 0x20000000, type: 0
1530KERN: mtrr: 2: base: 0xd0000000, size: 0x10000000, type: 1
1531KERN: add_memory_type_range(807, 0xcff9e000, 0x1000, 0)
1532KERN: set MTRRs to:
1533KERN: mtrr: 0: base: 0xcff90000, size: 0x10000, type: 0
1534KERN: mtrr: 1: base: 0xe0000000, size: 0x20000000, type: 0
1535KERN: mtrr: 2: base: 0xd0000000, size: 0x10000000, type: 1
1536KERN: add_memory_type_range(808, 0xef000, 0x1000, 0)
1537KERN: set MTRRs to:
1538KERN: mtrr: 0: base: 0xef000, size: 0x1000, type: 0
1539KERN: mtrr: 1: base: 0xcff90000, size: 0x10000, type: 0
1540KERN: mtrr: 2: base: 0xe0000000, size: 0x20000000, type: 0
1541KERN: mtrr: 3: base: 0xd0000000, size: 0x10000000, type: 1
1542KERN: add_memory_type_range(809, 0xe0088000, 0x1000, 0)
1543KERN: set MTRRs to:
1544KERN: mtrr: 0: base: 0xef000, size: 0x1000, type: 0
1545KERN: mtrr: 1: base: 0xcff90000, size: 0x10000, type: 0
1546KERN: mtrr: 2: base: 0xe0000000, size: 0x20000000, type: 0
1547KERN: mtrr: 3: base: 0xd0000000, size: 0x10000000, type: 1
1548KERN: add_memory_type_range(810, 0xcff9e000, 0x1000, 0)
1549KERN: set MTRRs to:
1550KERN: mtrr: 0: base: 0xef000, size: 0x1000, type: 0
1551KERN: mtrr: 1: base: 0xcff90000, size: 0x10000, type: 0
1552KERN: mtrr: 2: base: 0xe0000000, size: 0x20000000, type: 0
1553KERN: mtrr: 3: base: 0xd0000000, size: 0x10000000, type: 1
1554KERN: ACPI: Executed 3 blocks of module-level executable AML code
1555KERN: remove_memory_type_range(809, 0xe0088000, 0x1000, 0)
1556KERN: set MTRRs to:
1557KERN: mtrr: 0: base: 0xef000, size: 0x1000, type: 0
1558KERN: mtrr: 1: base: 0xcff90000, size: 0x10000,KERN: type: 0
1559KERN: mtrr: 2: base: 0xe0000000, size: 0x20000000, type: 0
1560KERN: mtrr: 3: base: 0xd0000000, size: 0x10000000, type: 1
1561KERN: add_memory_type_range(811, 0xe00a0000, 0x1000, 0)
1562KERN: set MTRRs to:
1563KERN: mtrr: 0: base: 0xef000, size: 0x1000, type: 0
1564KERN: mtrr: 1: base: 0xcff90000, size: 0x10000, type: 0
1565KERN: mtrr: 2: base: 0xe0000000, size: 0x20000000, type: 0
1566KERN: mtrr: 3: base: 0xd0000000, size: 0x10000000, type: 1
1567KERN: publish device: node 0x88afe758, path acpi/namespace, module bus_managers/acpi/namespace/device_v1
1568KERN: est: cpu_type: 4602 vendor 4352 model 250
1569KERN: Last message repeated 11 times.
1570KERN: ahci: ahci_supports_device
1571KERN: prevent_allow:
1572KERN: periph_simple_exec:
1573KERN: REG: Failed to open shadow passwd DB file "/etc/shadow": No such file or directory
1574KERN: register_domain(1, internet)
1575KERN: unregister_domain(0x88cff7c0, 1, internet)
1576KERN: register_domain(9, unix)
1577KERN: unregister_domain(0x88cfff40, 9, unix)
1578KERN: register_domain(1, internet)
1579KERN: unregister_domain(0x88cff640, 1, internet)
1580KERN: register_domain(1, internet)
1581KERN: unregister_domain(0x83016880, 1, internet)
1582KERN: register_domain(9, unix)
1583KERN: unregister_domain(0x83016880, 9, unix)
1584KERN: register_domain(1, internet)
1585KERN: unregister_domain(0x88cff4c0, 1, internet)
1586KERN: register_domain(1, internet)
1587KERN: unregister_domain(0x88cffa80, 1, internet)
1588KERN: register_domain(9, unix)
1589KERN: unregister_domain(0x88cffa80, 9, unix)
1590KERN: register_domain(1, internet)
1591KERN: unregister_domain(0x88cffc80, 1, internet)
1592KERN: register_domain(1, internet)
1593KERN: unregister_domain(0x88cffa40, 1, internet)
1594KERN: register_domain(9, unix)
1595KERN: unregister_domain(0x88cffa40, 9, unix)
1596KERN: register_domain(1, internet)
1597KERN: unregister_domain(0x88cff380, 1, internet)
1598KERN: register_domain(1, internet)
1599KERN: unregister_domain(0x88cff680, 1, internet)
1600KERN: register_domain(9, unix)
1601KERN: unregister_domain(0x88cff680, 9, unix)
1602KERN: register_domain(1, internet)
1603KERN: register_domain(4, link)
1604KERN: 3dfx: init_hardware() - no supported devices
1605KERN: ati: init_hardware() - no supported devices
1606KERN: intel_extreme: init_hardware()
1607KERN: etherpci: init_driver init_driver: etherpci not found
1608KERN: Radeon - init_hardware: Version: 5.1.6.0
1609KERN: Radeon - Radeon_CardDetect: no supported devices found
1610KERN: S3: init_hardware() - no supported devices
1611KERN: vesa: init_hardware()
1612KERN: vesa: init_driver()
1613KERN: vesa: publish_devices()
1614KERN: vesa: find_device()
1615KERN: loaded driver /boot/system/add-ons/kernel/drivers/dev/graphics/vesa
1616KERN: add_memory_type_range(2400, 0xd0000000, 0x10000000, 0)
1617KERN: set MTRRs to:
1618KERN: mtrr: 0: base: 0xef000, size: 0x1000, type: 0
1619KERN: mtrr: 1: base: 0xcff90000, size: 0x10000, type: 0
1620KERN: mtrr: 2: base: 0xd0000000, size: 0x10000000, type: 0
1621KERN: mtrr: 3: base: 0xe0000000, size: 0x20000000, type: 0
1622KERN: remove_memory_type_range(82, 0xd0000000, 0x500000, 1)
1623KERN: set MTRRs to:
1624KERN: mtrr: 0: base: 0xef000, size: 0x1000, type: 0
1625KERN: mtrr: 1: base: 0xcff90000, size: 0x10000, type: 0
1626KERN: mtrr: 2: base: 0xd0000000, size: 0x10000000, type: 0
1627KERN: mtrr: 3: base: 0xe0000000, size: 0x20000000, type: 0
1628KERN: add_memory_type_range(2400, 0xd0000000, 0x10000000, 1)
1629KERN: set MTRRs to:
1630KERN: mtrr: 0: base: 0xef000, size: 0x1000, type: 0
1631KERN: mtrr: 1: base: 0xcff90000, size: 0x10000, type: 0
1632KERN: mtrr: 2: base: 0xe0000000, size: 0x20000000, type: 0
1633KERN: mtrr: 3: base: 0xd0000000, size: 0x10000000, type: 1
1634KERN: add_memory_type_range(2403, 0x0, 0x1000, 0)
1635KERN: set MTRRs to:
1636KERN: mtrr: 0: base: 0x0, size: 0x1000, type: 0
1637KERN: mtrr: 1: base: 0xef000, size: 0x1000, type: 0
1638KERN: mtrr: 2: base: 0xcff90000, size: 0x10000, type: 0
1639KERN: mtrr: 3: base: 0xe0000000, size: 0x20000000, type: 0
1640KERN: mtrr: 4: base: 0xd0000000, size: 0x10000000, type: 1
1641KERN: remove_memory_type_range(2403, 0x0, 0x1000, 0)
1642KERN: set MTRRs to:
1643KERN: mtrr: 0: base: 0xef000, size: 0x1000, type: 0
1644KERN: mtrr: 1: base: 0xcff90000, size: 0x10000, type: 0
1645KERN: mtrr: 2: base: 0xe0000000, size: 0x20000000, type: 0
1646KERN: mtrr: 3: base: 0xd0000000, size: 0x10000000, type: 1
1647KERN: add_memory_type_range(2405, 0xa0000, 0x60000, 0)
1648KERN: set MTRRs to:
1649KERN: mtrr: 0: base: 0xa0000, size: 0x20000, type: 0
1650KERN: mtrr: 1: base: 0xc0000, size: 0x40000, type: 0
1651KERN: mtrr: 2: base: 0xcff90000, size: 0x10000, type: 0
1652KERN: mtrr: 3: base: 0xe0000000, size: 0x20000000, type: 0
1653KERN: mtrr: 4: base: 0xd0000000, size: 0x10000000, type: 1
1654KERN: remove_memory_type_range(2405, 0xa0000, 0x60000, 0)
1655KERN: set MTRRs to:
1656KERN: mtrr: 0: base: 0xef000, size: 0x1000, type: 0
1657KERN: mtrr: 1: base: 0xcff90000, size: 0x10000, type: 0
1658KERN: mtrr: 2: base: 0xe0000000, size: 0x20000000, type: 0
1659KERN: mtrr: 3: base: 0xd0000000, size: 0x10000000, type: 1
1660KERN: vesa: vesa_init() completed successfully!
1661KERN: vesa: acc: vesa.accelerant
1662KERN: loaded driver /boot/system/add-ons/kernel/drivers/dev/net/pegasus
1663KERN: rtl81xx: init_driver(0x8204d82c)
1664KERN: [rtl81xx] (re) bus_alloc_resource(3, [24], 0x0, 0xffffffff, 0x1,0x2)
1665KERN: add_memory_type_range(2438, 0xfdfff000, 0x20000, 0)
1666KERN: set MTRRs to:
1667KERN: mtrr: 0: base: 0xef000, size: 0x1000, type: 0
1668KERN: mtrr: 1: base: 0xcff90000, size: 0x10000, type: 0
1669KERN: mtrr: 2: base: 0xe0000000, size: 0x20000000, type: 0
1670KERN: mtrr: 3: base: 0xd0000000, size: 0x10000000, type: 1
1671KERN: [rtl81xx] (re) MSI count : 1
1672KERN: msi_allocate_vectors: allocated 1 vectors starting from 24
1673KERN: [rtl81xx] (re) Using 1 MSI messages
1674KERN: [rtl81xx] (re) bus_alloc_resource(1, [1], 0x0, 0xffffffff, 0x1,0x2)
1675KERN: [rtl81xx] (re) Chip rev. 0x28000000
1676KERN: [rtl81xx] (re) MAC rev. 0x00000000
1677KERN: [rtl81xx] () Found MII: rgephy
1678KERN: [rtl81xx] () BSD_IFMEDIA_DEBUG: ifmedia_add: Adding Entry...
1679KERN: BSD_IFMEDIA_DEBUG: Type: Ethernet
1680KERN: BSD_IFMEDIA_DEBUG: SubType: none
1681KERN: BSD_IFMEDIA_DEBUG: ifmedia_add: Adding Entry...
1682KERN: BSD_IFMEDIA_DEBUG: Type: Ethernet
1683KERN: BSD_IFMEDIA_DEBUG: SubType: 10baseT/UTP
1684KERN: 10baseTBSD_IFMEDIA_DEBUG: ifmedia_add: Adding Entry...
1685KERN: BSD_IFMEDIA_DEBUG: Type: Ethernet
1686KERN: BSD_IFMEDIA_DEBUG: SubType: 10baseT/UTP
1687KERN: BSD_IFMEDIA_DEBUG: Shared Option[0]: full-duplex
1688KERN: , 10baseT-FDXBSD_IFMEDIA_DEBUG: ifmedia_add: Adding Entry...
1689KERN: BSD_IFMEDIA_DEBUG: Type: Ethernet
1690KERN: BSD_IFMEDIA_DEBUG: SubType: 100baseTX
1691KERN: , 100baseTXBSD_IFMEDIA_DEBUG: ifmedia_add: Adding Entry...
1692KERN: BSD_IFMEDIA_DEBUG: Type: Ethernet
1693KERN: BSD_IFMEDIA_DEBUG: SubType: 100baseTX
1694KERN: BSD_IFMEDIA_DEBUG: Shared Option[0]: full-duplex
1695KERN: , 100baseTX-FDXBSD_IFMEDIA_DEBUG: ifmedia_add: Adding Entry...
1696KERN: BSD_IFMEDIA_DEBUG: Type: Ethernet
1697KERN: BSD_IFMEDIA_DEBUG: SubType: 1000baseT
1698KERN: , 1000baseTBSD_IFMEDIA_DEBUG: ifmedia_add: Adding Entry...
1699KERN: BSD_IFMEDIA_DEBUG: Type: Ethernet
1700KERN: BSD_IFMEDIA_DEBUG: SubType: 1000baseT
1701KERN: BSD_IFMEDIA_DEBUG: Shared Option[0]: full-duplex
1702KERN: , 1000baseT-FDXBSD_IFMEDIA_DEBUG: ifmedia_add: Adding Entry...
1703KERN: BSD_IFMEDIA_DEBUG: Type: Ethernet
1704KERN: BSD_IFMEDIA_DEBUG: SubType: autoselect
1705KERN: , auto
1706KERN: BSD_IFMEDIA_DEBUG: ifmedia_set: target BSD_IFMEDIA_DEBUG: Type: Ethernet
1707KERN: BSD_IFMEDIA_DEBUG: SubType: autoselect
1708KERN: BSD_IFMEDIA_DEBUG: ifmedia_set: setting to BSD_IFMEDIA_DEBUG: Type: Ethernet
1709KERN: BSD_IFMEDIA_DEBUG: SubType: autoselect
1710KERN: if_initname(0x89ccf000, re, 3)
1711KERN: [rtl81xx] rtl81xx: /dev/net/rtl81xx/0
1712KERN: msi enabled: 0x0081
1713KERN: loaded driver /boot/system/add-ons/kernel/drivers/dev/net/rtl81xx
1714KERN: [33musb_asix:[0m01.21.994:init_driver::ver.0.8.3
1715KERN: loaded driver /boot/system/add-ons/kernel/drivers/dev/net/usb_asix
1716KERN: loaded driver /boot/system/add-ons/kernel/drivers/dev/net/usb_ecm
1717KERN: [net/rtl81xx/0] compat_open(0x2)
1718KERN: BSD_IFMEDIA_DEBUG: ifmedia_ioctl: switching re to BSD_IFMEDIA_DEBUG: Type: Ethernet
1719KERN: BSD_IFMEDIA_DEBUG: SubType: autoselect
1720KERN: /dev/net/rtl81xx/0: media change, media 0x22 quality 1000 speed 10000000
1721KERN: add_memory_type_range(2847, 0x0, 0x1000, 0)
1722KERN: set MTRRs to:
1723KERN: mtrr: 0: base: 0x0, size: 0x1000, type: 0
1724KERN: mtrr: 1: base: 0xef000, size: 0x1000, type: 0
1725KERN: mtrr: 2: base: 0xcff90000, size: 0x10000, type: 0
1726KERN: mtrr: 3: base: 0xe0000000, size: 0x20000000, type: 0
1727KERN: mtrr: 4: base: 0xd0000000, size: 0x10000000, type: 1
1728KERN: remove_memory_type_range(2847, 0x0, 0x1000, 0)
1729KERN: set MTRRs to:
1730KERN: mtrr: 0: base: 0xef000, size: 0x1000, type: 0
1731KERN: mtrr: 1: base: 0xcff90000, size: 0x10000, type: 0
1732KERN: mtrr: 2: base: 0xe0000000, size: 0x20000000, type: 0
1733KERN: mtrr: 3: base: 0xd0000000, size: 0x10000000, type: 1
1734KERN: add_memory_type_range(2848, 0xa0000, 0x60000, 0)
1735KERN: set MTRRs to:
1736KERN: mtrr: 0: base: 0xa0000, size: 0x20000, type: 0
1737KERN: mtrr: 1: base: 0xc0000, size: 0x40000, type: 0
1738KERN: mtrr: 2: base: 0xcff90000, size: 0x10000, type: 0
1739KERN: mtrr: 3: base: 0xe0000000, size: 0x20000000, type: 0
1740KERN: mtrr: 4: basKERN: e: 0xd0000000, size: 0x10000000, type: 1
1741KERN: remove_memory_type_range(2848, 0xa0000, 0x60000, 0)
1742KERN: set MTRRs to:
1743KERN: mtrr: 0: base: 0xef000, size: 0x1000, type: 0
1744KERN: mtrr: 1: base: 0xcff90000, size: 0x10000, type: 0
1745KERN: mtrr: 2: base: 0xe0000000, size: 0x20000000, type: 0
1746KERN: mtrr: 3: base: 0xd0000000, size: 0x10000000, type: 1
1747KERN: module: Search for network/protocols/ipv6/v1 failed.
1748KERN: slab memory manager: created area 0x9b001000 (3007)
1749USER: failed to create the required index for attribute BEOS:LOCALE_LANGUAGE (General system error)
1750USER: failed to create the required index for attribute BEOS:LOCALE_SIGNATURE (General system error)
1751KERN: /dev/net/rtl81xx/0: media change, media 0x900026 quality 1000 speed 10000000
1752DAEMON 'DHCP': /dev/net/rtl81xx/0: Timeout shift: 4 secs (try 0)
1753DAEMON 'DHCP': /dev/net/rtl81xx/0: Send DHCP_DISCOVER to 255.255.255.255:67
1754DAEMON 'DHCP': /dev/net/rtl81xx/0: Received DHCP_OFFER from 192.168.2.1
1755DAEMON 'DHCP': your_address: 192.168.2.4
1756DAEMON 'DHCP': server: 192.168.2.1
1757DAEMON 'DHCP': lease time: 4294967295 seconds
1758DAEMON 'DHCP': subnet: 255.255.255.0
1759DAEMON 'DHCP': gateway: 192.168.2.1
1760DAEMON 'DHCP': domain name: "Belkin"
1761DAEMON 'DHCP': nameserver[0]: 192.168.2.1
1762DAEMON 'DHCP': /dev/net/rtl81xx/0: Send DHCP_REQUEST for 192.168.2.4 to 255.255.255.255:67
1763DAEMON 'DHCP': /dev/net/rtl81xx/0: Received DHCP_ACK from 192.168.2.1
1764DAEMON 'DHCP': server: 192.168.2.1
1765DAEMON 'DHCP': lease time: 4294967295 seconds
1766DAEMON 'DHCP': subnet: 255.255.255.0
1767DAEMON 'DHCP': gateway: 192.168.2.1
1768DAEMON 'DHCP': domain name: "Belkin"
1769DAEMON 'DHCP': nameserver[0]: 192.168.2.1
1770DAEMON 'DHCP': /dev/net/rtl81xx/0: DHCP status = No error
1771DAEMON 'DHCP': /dev/net/rtl81xx/0: Send DHCP_REQUEST for 192.168.2.4 to 255.255.255.255:67
1772DAEMON 'DHCP': /dev/net/rtl81xx/0: Received DHCP_ACK from 192.168.2.1
1773DAEMON 'DHCP': server: 192.168.2.1
1774DAEMON 'DHCP': lease time: 4294967295 seconds
1775DAEMON 'DHCP': subnet: 255.255.255.0
1776DAEMON 'DHCP': gateway: 192.168.2.1
1777DAEMON 'DHCP': domain name: "Belkin"
1778DAEMON 'DHCP': nameserver[0]: 192.168.2.1
1779DAEMON 'DHCP': /dev/net/rtl81xx/0: DHCP status = No error
1780USER: failed to create the required index for attribute BEOS:LOCALE_LANGUAGE (General system error)
1781USER: failed to create the required index for attribute BEOS:LOCALE_SIGNATURE (General system error)
1782KERN: ps2_hid: init_hardware
1783KERN: ps2_hid: init_driver
1784KERN: ps2_hid: publish_devices
1785KERN: ps2_hid: uninit_driver
1786KERN: loaded driver /boot/system/add-ons/kernel/drivers/dev/input/ps2_hid
1787KERN: loaded driver /boot/system/add-ons/kernel/drivers/dev/input/usb_hid
1788KERN: loaded driver /boot/system/add-ons/kernel/drivers/dev/input/wacom
1789KERN: ps2: reset failed
1790KERN: ps2: devfs_publish_device input/mouse/ps2/0, status = 0xffffffff
1791KERN: ps2: devfs_publish_device input/keyboard/at/0, status = 0x00000000
1792KERN: ps2: keyboard found
1793USER: failed to create the required index for attribute BEOS:LOCALE_LANGUAGE (General system error)
1794USER: failed to create the required index for attribute BEOS:LOCALE_SIGNATURE (General system error)
1795USER: Image /boot/system/servers/mount_server (address 20922c) requested catalog with mimetype x-vnd.Haiku-mount_server
1796USER: failed to create the required index for attribute BEOS:LOCALE_LANGUAGE (General system error)
1797USER: failed to create the required index for attribute BEOS:LOCALE_SIGNATURE (General system error)
1798USER: failed to create the required index for attribute BEOS:LOCALE_LANGUAGE (General system error)
1799USER: failed to create the required index for attribute BEOS:LOCALE_SIGNATURE (General system error)
1800USER: failed to create the required index for attribute BEOS:LOCALE_LANGUAGE (General system error)
1801USER: failed to create the required index for attribute BEOS:LOCALE_SIGNATURE (General system error)
1802USER: failed to create the required index for attribute BEOS:LOCALE_LANGUAGE (General system error)
1803USER: failed to create the required index for attribute BEOS:LOCALE_SIGNATURE (General system error)
1804USER: failed to create the required index for attribute BEOS:LOCALE_LANGUAGE (General system error)
1805USER: failed to create the required index for attribute BEOS:LOCALE_SIGNATURE (General system error)
1806USER: failed to create the required index for attribute BEOS:LOCALE_LANGUAGE (General system error)
1807USER: failed to create the required index for attribute BEOS:LOCALE_SIGNATURE (General system error)
1808KERN: emuxki: init_hardware()
1809KERN: loaded driver /boot/system/add-ons/kernel/drivers/dev/midi/usb_midi
1810KERN: Running post install script /boot/common/boot/post_install/add_catalog_entry_attributes.sh ...
1811KERN: cx23882: init_hardware()
1812KERN: ahci: ahci_supports_device
1813Last message repeated 1 time
1814KERN: firewire: fw_module_init
1815KERN: VIA Fire II (VT6306)
1816KERN: vendor=1106, device=3044, revision = 80
1817KERN: firewire: found 1 cards
1818KERN: firewire: latency timer 80 -> 80.
1819KERN: firewire: cache size 10 -> 10.
1820KERN: firewire: IRQ 11
1821KERN: firewire: hardware register address fe8fb800
1822KERN: firewire: mapping physical address 0xfe8fb800 with 2048 bytes for fw ohci register
1823KERN: add_memory_type_range(4153, 0xfe8fb000, 0x1000, 0)
1824KERN: set MTRRs to:
1825KERN: mtrr: 0: base: 0xef000, size: 0x1000, type: 0
1826KERN: mtrr: 1: base: 0xcff90000, size: 0x10000, type: 0
1827KERN: mtrr: 2: base: 0xe0000000, size: 0x20000000, type: 0
1828KERN: mtrr: 3: base: 0xd0000000, size: 0x10000000, type: 1
1829KERN: firewire: physical = 0xfe8fb800, virtual = 0x82bff800, offset = 2048, phyadr = 0xfe8fb000, mapadr = 0x82bff000, size = 4096, area = 0x00001039
1830KERN: firewire: mapped registers to 0x82bff800
1831KERN: firewire:OHCI version 1.0 (ROM=1)
1832KERN: firewire:No. of Isochronous channels is 4.
1833KERN: firewire: allocating 3076 bytes for fwohci config etc. buf
1834KERN: firewire: area = 4183, size = 4096, virt = 0x8017a000, phy = 14219000
1835KERN: firewire: allocating 4096 bytes for fw multi dma buf
1836KERN: firewire: area = 4201, size = 4096, virt = 0x8017b000, phy = 14548000
1837KERN: firewire: allocating 4096 bytes for fw multi dma buf
1838KERN: firewire: area = 4215, size = 4096, virt = 0x8017c000, phy = 1454b000
1839KERN: firewire: allocating 16384 bytes for fw multi dma buf
1840KERN: firewire: area = 4230, size = 16384, virt = 0x880d5000, phy = 14569000
1841KERN: firewire: allocating 4096 bytes for fw multi dma buf
1842KERN: firewire: area = 4251, size = 4096, virt = 0x8017d000, phy = 1480c000
1843KERN: firewire:EUI64 00:08:00:08:00:08:09:4d
1844KERN: firewire:resetting OHCI...KERN: done (loop=0)
1845KERN: firewire:Phy 1394a available S400, 2 ports.
1846KERN: firewire:Enable 1394a Enhancements
1847KERN: firewire:Link S400, max_rec 2048 bytes.
1848KERN: firewire:BUS_OPT 0xf800a202 -> 0xf800a202
1849KERN: firewire: allocating 524288 bytes for fw rx Area
1850KERN: firewire: area = 4310, size = 524288, virt = 0x801b6000, phy = 157bb000
1851KERN: firewire: allocating 262144 bytes for fw rx Area
1852KERN: firewire: area = 4328, size = 262144, virt = 0x877fe000, phy = 1583b000
1853KERN: firewire:fwohci_set_intr: 1
1854KERN: firewire:Initiate bus reset
1855KERN: firewire:fwohci_intr_core: BUS reset
1856KERN: loaded driver /boot/system/add-ons/kernel/drivers/dev/bus/fw_raw
1857KERN: firewire:fwohci_intr_core: node_id=0x00000000, SelfID Count=1, CYCLEMASTER mode
1858KERN: node:0 link:1 gap:63 spd:2 con:1 pwr:1 p0:1 p1:1 p2:0 i:1 m:0
1859KERN: firewire:1 nodes, maxhop <= 0 cable IRM irm(0) (me)
1860KERN: firewire:fwohci_set_bus_manager: 0->0 (loop=0)
1861KERN: firewire:bus manager 0
1862KERN: firewire:fw_phy_config: root_node=-1 gap_count=5
1863KERN: fwohci_start: maxdesc 2
1864KERN: firewire:start AT DMA status=0
1865KERN: loaded driver /boot/system/add-ons/kernel/drivers/dev/bus/usb_raw
1866KERN: auich: init_hardware()
1867KERN: auvia: init_hardware()
1868KERN: echo3g: init_hardware()
1869KERN: echo3g: no card found
1870KERN: loaded driver /boot/system/add-ons/kernel/drivers/dev/audio/hmulti/emuxki
1871KERN: firewire:fw_bus_probe:iterate and invalidate all nodes
1872KERN: firewire:fw_explore: found myself node(0) fc->nodeid(0) fc->max_node(0)
1873KERN: bus_explore done
1874KERN: devfs: reload driver "emuxki" (3, 1652488667796)
1875KERN: emuxki: init_hardware()
1876KERN: HDA: Detected controller @ PCI:1:0:1, IRQ:11, type 1002/aa58 (1682/aa58)
1877KERN: HDA: Detected controller @ PCI:0:20:2, IRQ:10, type 1002/4383 (1462/7599)
1878KERN: IRA: publish_devices
1879KERN: IRA: find_device
1880Last message repeated 1 time
1881KERN: loaded driver /boot/system/add-ons/kernel/drivers/dev/audio/hmulti/hda
1882KERN: sis7018:init_hardware:ver:2.0.2
1883KERN: add_memory_type_range(5289, 0xfe7bc000, 0x4000, 0)
1884KERN: set MTRRs to:
1885KERN: mtrr: 0: base: 0xef000, size: 0x1000, type: 0
1886KERN: mtrr: 1: base: 0xcff90000, size: 0x10000, type: 0
1887KERN: mtrr: 2: base: 0xe0000000, size: 0x20000000, type: 0
1888KERN: mtrr: 3: base: 0xd0000000, size: 0x10000000, type: 1
1889KERN: hda: HDA v1.0, O:1/I:0/B:0, #SDO:1, 64bit:yes
1890KERN: Codec 0 Vendor: 1002 Product: aa01, Revision: 1.0.2.0
1891KERN: hda: Audio Group: Output delay: 0 samples, Input delay: 0 samples, Beep Generator: no
1892KERN: hda: #GPIO: 0, #GPO: 0, #GPI: 0, unsol: no, wake: no
1893KERN: Supported formats: 16bits
1894KERN: Supported rates: 32khz 44khz 48khz
1895KERN: hda: widget start 2, count 2
1896KERN: 2: Audio output
1897KERN: Supported formats: 16bits
1898KERN: Supported rates: 32khz 44khz 48khz
1899KERN: Supported power states:
1900KERN: [Digital] [Stereo]
1901KERN: 3: Pin complex
1902KERN: [Output]
1903KERN: Jack, HDMI Digital other out, Other digital, N/A, Association:1
1904KERN: Supported power states:
1905KERN: [Digital] [Conn. list] [Unsol. responses] [Stereo]
1906KERN: Inputs: <2>
1907KERN: build output tree: use mixer
1908KERN: try without mixer!
1909KERN: build output tree: don't use mixer
1910KERN: hda: Failed to setup new audio function group (No such device)!
1911KERN: hda: no active codec
1912KERN: remove_memory_type_range(5289, 0xfe7bc000, 0x4000, 0)
1913KERN: set MTRRs to:
1914KERN: mtrr: 0: base: 0xef000, size: 0x1000, type: 0
1915KERN: mtrr: 1: base: 0xcff90000, size: 0x10000, type: 0
1916KERN: mtrr: 2: base: 0xe0000000, size: 0x20000000, type: 0
1917KERN: mtrr: 3: base: 0xd0000000, size: 0x10000000, type: 1
1918KERN: hda: ERROR: No such device(-2147454969)
1919KERN: add_memory_type_range(5416, 0xfe6f8000, 0x4000, 0)
1920KERN: set MTRRs to:
1921KERN: mtrr: 0: base: 0xef000, size: 0x1000, type: 0
1922KERN: mtrr: 1: base: 0xcff90000, size: 0x10000, type: 0
1923KERN: mtrr: 2: base: 0xe0000000, size: 0x20000000, type: 0
1924KERN: mtrr: 3: base: 0xd0000000, size: 0x10000000, type: 1
1925KERN: hda: HDA v1.0, O:4/I:4/B:0, #SDO:1, 64bit:yes
1926KERN: Codec 0 Vendor: 10ec Product: 0892, Revision: 1.0.3.2
1927KERN: hda: Audio Group: Output delay: 15 samples, Input delay: 15 samples, Beep Generator: yes
1928KERN: hda: #GPIO: 2, #GPO: 0, #GPI: 0, unsol: yes, wake: no
1929KERN: Supported formats: 16bits 20bits 24bits
1930KERN: Supported rates: 32khz 44khz 48khz 88khz 96khz 192khz
1931KERN: hda: widget start 2, count 37
1932KERN: 2: Audio output
1933KERN: Supported formats: 16bits 20bits 24bits
1934KERN: Supported rates: 44khz 48khz 96khz 192khz
1935KERN: Supported power states: D0 D1 D2 D3
1936KERN: [Power] [Format override] [Amplifier override] [Out amplifier] [Stereo]
1937KERN: Out Amp: step size: 1 dB, # steps: 64, offset to 0 dB: 64
1938KERN: 3: Audio output
1939KERN: Supported formats: 16bits 20bits 24bits
1940KERN: Supported rates: 44khz 48khz 96khz 192khz
1941KERN: Supported power states: D0 D1 D2 D3
1942KERN: [Power] [Format override] [Amplifier override] [Out amplifier] [Stereo]
1943KERN: Out Amp: step size: 1 dB, # steps: 64, offset to 0 dB: 64
1944KERN: 4: Audio output
1945KERN: Supported formats: 16bits 20bits 24bits
1946KERN: Supported rates: 44khz 48khz 96khz 192khz
1947KERN: Supported power states: D0 D1 D2 D3
1948KERN: [Power] [Format override] [Amplifier override] [Out amplifier] [Stereo]
1949KERN: Out Amp: step size: 1 dB, # steps: 64, offset to 0 dB: 64
1950KERN: 5: Audio output
1951KERN: Supported formats: 16bits 20bits 24bits
1952KERN: Supported rates: 44khz 48khz 96khz 192khz
1953KERN: Supported power states: D0 D1 D2 D3
1954KERN: [Power] [Format override] [Amplifier override] [Out amplifier] [Stereo]
1955KERN: Out Amp: step size: 1 dB, # steps: 64, offset to 0 dB: 64
1956KERN: 6: Audio output
1957KERN: Supported formats: 16bits 20bits 24bits
1958KERN: Supported rates: 32khz 44khz 48khz 88khz 96khz 192khz
1959KERN: Supported power states: D0 D1 D2 D3
1960KERN: [Power] [Digital] [Format override] [Stereo]
1961KERN: 7: Vendor defined
1962KERN: Supported power states: D0
1963KERN: 8: Audio input
1964KERN: Supported formats: 16bits 20bits 24bits
1965KERN: Supported rates: 44khz 48khz 96khz 192khz
1966KERN: Supported power states: D0 D1 D2 D3
1967KERN: [Power] [Conn. list] [Format override] [Amplifier override] [In amplifier] [Stereo]
1968KERN: In Amp: supports mute, step size: 1 dB, # steps: 46, offset to 0 dB: 16
1969KERN: Inputs: <35>
1970KERN: 9: Audio input
1971KERN: Supported formats: 16bits 20bits 24bits
1972KERN: Supported rates: 44khz 48khz 96khz 192khz
1973KERN: Supported power states: D0 D1 D2 D3
1974KERN: [Power] [Conn. list] [Format override] [Amplifier override] [In amplifier] [Stereo]
1975KERN: In Amp: supports mute, step size: 1 dB, # steps: 46, offset to 0 dB: 16
1976KERN: Inputs: <34>
1977KERN: 10: Audio input
1978KERN: Supported formats: 16bits 20bits 24bits
1979KERN: Supported rates: 44khz 48khz 96khz 192khz
1980KERN: Supported power states: D0 D1 D2 D3
1981KERN: [Power] [Digital] [Conn. list] [Format override] [Stereo]
1982KERN: Inputs: <31>
1983KERN: 11: Audio mixer
1984KERN: Supported power states: D0
1985KERN: [Conn. list] [Amplifier override] [In amplifier] [Stereo]
1986KERN: In Amp: supports mute, step size: 1.5 dB, # steps: 31, offset to 0 dB: 23
1987KERN: Inputs: 24 25 26 27 28 29 20 21 22 23
1988KERN: 12: Audio mixer
1989KERN: Supported power states: D0
1990KERN: [Conn. list] [Amplifier override] [In amplifier] [Stereo]
1991KERN: In Amp: supports mute, step size: 0.25 dB, # steps: 0, offset to 0 dB: 0
1992KERN: Inputs: 2 11
1993KERN: 13: Audio mixer
1994KERN: Supported power states: D0
1995KERN: [Conn. list] [Amplifier override] [In amplifier] [Stereo]
1996KERN: In Amp: supports mute, step size: 0.25 dB, # steps: 0, offset to 0 dB: 0
1997KERN: Inputs: 3 11
1998KERN: 14: Audio mixer
1999KERN: Supported power states: D0
2000KERN: [Conn. list] [Amplifier override] [In amplifier] [Stereo]
2001KERN: In Amp: supports mute, step size: 0.25 dB, # steps: 0, offset to 0 dB: 0
2002KERN: Inputs: 4 11
2003KERN: 15: Audio mixer
2004KERN: Supported power states: D0
2005KERN: [Conn. list] [Amplifier override] [In amplifier] [Stereo]
2006KERN: In Amp: supports mute, step size: 0.25 dB, # steps: 0, offset to 0 dB: 0
2007KERN: Inputs: 5 11
2008KERN: 16: Audio output
2009KERN: Supported formats: 16bits 20bits 24bits
2010KERN: Supported rates: 32khz 44khz 48khz 88khz 96khz 192khz
2011KERN: Supported power states: D0 D1 D2 D3
2012KERN: [Power] [Digital] [Format override] [Stereo]
2013KERN: 17: Pin complex
2014KERN: [Output]
2015KERN: Fixed, SPDIF out, ATAPI internal, N/A, Association:4
2016KERN: Supported power states: D0 D1 D2 D3
2017KERN: [Power] [Digital] [Conn. list] [Unsol. responses] [Stereo]
2018KERN: Inputs: <16>
2019KERN: 18: Pin complex
2020KERN: [Input]
2021KERN: None, Speaker, 1/8", Black, Association:15
2022KERN: Supported power states: D0 D1 D2 D3
2023KERN: [Power] [Stereo]
2024KERN: 19: Vendor defined
2025KERN: Supported power states: D0
2026KERN: 20: Pin complex
2027KERN: [Input] [Output]
2028KERN: Jack, Line out, 1/8", Green, Association:1
2029KERN: Supported power states: D0 D1 D2 D3
2030KERN: [Power] [Conn. list] [Unsol. responses] [Amplifier override] [Out amplifier] [Stereo]
2031KERN: Out Amp: supports mute, step size: 0.25 dB, # steps: 0, offset to 0 dB: 0
2032KERN: Inputs: <12>
2033KERN: 21: Pin complex
2034KERN: [Input] [Output]
2035KERN: Jack, Line out, 1/8", Black, Association:1
2036KERN: Supported power states: D0 D1 D2 D3
2037KERN: [Power] [Conn. list] [Unsol. responses] [Amplifier override] [Out amplifier] [Stereo]
2038KERN: Out Amp: supports mute, step size: 0.25 dB, # steps: 0, offset to 0 dB: 0
2039KERN: Inputs: <13>
2040KERN: 22: Pin complex
2041KERN: [Input] [Output]
2042KERN: Jack, Line out, 1/8", Orange, Association:1
2043KERN: Supported power states: D0 D1 D2 D3
2044KERN: [Power] [Conn. list] [Unsol. responses] [Amplifier override] [Out amplifier] [Stereo]
2045KERN: Out Amp: supports mute, step size: 0.25 dB, # steps: 0, offset to 0 dB: 0
2046KERN: Inputs: <14>
2047KERN: 23: Pin complex
2048KERN: [Input] [Output]
2049KERN: Jack, Line out, 1/8", Grey, Association:1
2050KERN: Supported power states: D0 D1 D2 D3
2051KERN: [Power] [Conn. list] [Unsol. responses] [Amplifier override] [Out amplifier] [Stereo]
2052KERN: Out Amp: supports mute, step size: 0.25 dB, # steps: 0, offset to 0 dB: 0
2053KERN: Inputs: <15>
2054KERN: 24: Pin complex
2055KERN: [Input] [Output]
2056KERN: Jack, Mic in, 1/8", Pink, Association:5
2057KERN: Supported power states: D0 D1 D2 D3
2058KERN: [Power] [Conn. list] [Unsol. responses] [Amplifier override] [Out amplifier] [In amplifier] [Stereo]
2059KERN: In Amp: step size: 10 dB, # steps: 3, offset to 0 dB: 0
2060KERN: Out Amp: supports mute, step size: 0.25 dB, # steps: 0, offset to 0 dB: 0
2061KERN: Inputs: 12 13 14 15 38
2062KERN: 25: Pin complex
2063KERN: [Input] [Output]
2064KERN: Jack, Front Mic in, 1/8", Pink, Association:6
2065KERN: Supported power states: D0 D1 D2 D3
2066KERN: [Power] [Conn. list] [Unsol. responses] [Amplifier override] [Out amplifier] [In amplifier] [Stereo]
2067KERN: In Amp: step size: 10 dB, # steps: 3, offset to 0 dB: 0
2068KERN: Out Amp: supports mute, step size: 0.25 dB, # steps: 0, offset to 0 dB: 0
2069KERN: Inputs: 12 13 14 15 38
2070KERN: 26: Pin complex
2071KERN: [Input] [Output]
2072KERN: Jack, Line in, 1/8", Blue, Association:5
2073KERN: Supported power states: D0 D1 D2 D3
2074KERN: [Power] [Conn. list] [Unsol. responses] [Amplifier override] [Out amplifier] [In amplifier] [Stereo]
2075KERN: In Amp: step size: 10 dB, # steps: 3, offset to 0 dB: 0
2076KERN: Out Amp: supports mute, step size: 0.25 dB, # steps: 0, offset to 0 dB: 0
2077KERN: Inputs: 12 13 14 15 38
2078KERN: 27: Pin complex
2079KERN: [Input] [Output]
2080KERN: Jack, Front HP out, 1/8", Green, Association:2
2081KERN: Supported power states: D0 D1 D2 D3
2082KERN: [Power] [Conn. list] [Unsol. responses] [Amplifier override] [Out amplifier] [In amplifier] [Stereo]
2083KERN: In Amp: step size: 10 dB, # steps: 3, offset to 0 dB: 0
2084KERN: Out Amp: supports mute, step size: 0.25 dB, # steps: 0, offset to 0 dB: 0
2085KERN: Inputs: 12 13 14 15 38
2086KERN: 28: Pin complex
2087KERN: [Input]
2088KERN: None, CD, ATAPI internal, N/A, Association:15
2089KERN: Supported power states: D0 D1 D2 D3
2090KERN: [Power] [Unsol. responses] [Stereo]
2091KERN: 29: Pin complex
2092KERN: [Input]
2093KERN: None, Line out, Other analog, Other, Association:0
2094KERN: Supported power states: D0 D1 D2 D3
2095KERN: [Power]
2096KERN: 30: Pin complex
2097KERN: [Output]
2098KERN: Jack, SPDIF out, Combination, Black, Association:3
2099KERN: Supported power states: D0 D1 D2 D3
2100KERN: [Power] [Digital] [Conn. list] [Unsol. responses] [Stereo]
2101KERN: Inputs: <6>
2102KERN: 31: Pin complex
2103KERN: [Input]
2104KERN: None, Speaker, 1/8", Black, Association:15
2105KERN: Supported power states: D0 D1 D2 D3
2106KERN: [Power] [Digital] [Unsol. responses] [Stereo]
2107KERN: 32: Vendor defined
2108KERN: Supported power states: D0
2109KERN: [Proc widget]
2110KERN: 33: Vendor defined
2111KERN: Supported power states: D0
2112KERN: 34: Audio mixer
2113KERN: Supported power states: D0
2114KERN: [Conn. list] [Amplifier override] [In amplifier] [Stereo]
2115KERN: In Amp: supports mute, step size: 0.25 dB, # steps: 0, offset to 0 dB: 0
2116KERN: Inputs: 24 25 26 27 28 29 20 21 22 23 11 18
2117KERN: 35: Audio mixer
2118KERN: Supported power states: D0
2119KERN: [Conn. list] [Amplifier override] [In amplifier] [Stereo]
2120KERN: In Amp: supports mute, step size: 0.25 dB, # steps: 0, offset to 0 dB: 0
2121KERN: Inputs: 24 25 26 27 28 29 20 21 22 23 11
2122KERN: 36: Vendor defined
2123KERN: Supported power states: D0
2124KERN: 37: Audio output
2125KERN: Supported formats: 16bits 20bits 24bits
2126KERN: Supported rates: 44khz 48khz 96khz 192khz
2127KERN: Supported power states: D0 D1 D2 D3
2128KERN: [Power] [Format override] [Amplifier override] [Out amplifier] [Stereo]
2129KERN: Out Amp: step size: 1 dB, # steps: 64, offset to 0 dB: 64
2130KERN: 38: Audio mixer
2131KERN: Supported power states: D0
2132KERN: [Conn. list] [Amplifier override] [In amplifier] [Stereo]
2133KERN: In Amp: supports mute, step size: 0.25 dB, # steps: 0, offset to 0 dB: 0
2134KERN: Inputs: 37 11
2135KERN: build output tree: use mixer
2136KERN: look at pin widget 20 (1 inputs)
2137KERN: try widget 12: 0x831bbcb8
2138KERN: widget 12 is candidate
2139KERN: output: added output widget 2
2140KERN: output: added mixer/selector widget 12
2141KERN: output: not added mixer/selector widget 11
2142KERN: add pin widget 20
2143KERN: look at pin widget 21 (1 inputs)
2144KERN: try widget 13: 0x831bbd64
2145KERN: widget 13 is candidate
2146KERN: output: added output widget 3
2147KERN: output: added mixer/selector widget 13
2148KERN: output: not added mixer/selector widget 11
2149KERN: add pin widget 21
2150KERN: look at pin widget 22 (1 inputs)
2151KERN: try widget 14: 0x831bbe10
2152KERN: widget 14 is candidate
2153KERN: output: added output widget 4
2154KERN: output: added mixer/selector widget 14
2155KERN: output: not added mixer/selector widget 11
2156KERN: add pin widget 22
2157KERN: look at pin widget 23 (1 inputs)
2158KERN: try widget 15: 0x831bbebc
2159KERN: widget 15 is candidate
2160KERN: output: added output widget 5
2161KERN: output: added mixer/selector widget 15
2162KERN: output: not added mixer/selector widget 11
2163KERN: add pin widget 23
2164KERN: look at pin widget 27 (5 inputs)
2165KERN: try widget 12: 0x831bbcb8
2166KERN: widget 12 is candidate
2167KERN: add pin widget 27
2168KERN: build input tree
2169KERN: look at input widget 8 (1 inputs)
2170KERN: try widget 35: 0x831bcc2c
2171KERN: widget 35 is candidate
2172KERN: input: added input widget 24
2173KERN: input: added mixer/selector widget 35
2174KERN: input: added input widget 25
2175KERN: input: added mixer/selector widget 35
2176KERN: input: added input widget 26
2177KERN: input: added mixer/selector widget 35
2178KERN: input: added input widget 28
2179KERN: input: added mixer/selector widget 35
2180KERN: input: not added mixer/selector widget 11
2181KERN: add pin widget 8
2182KERN: look at input widget 9 (1 inputs)
2183KERN: try widget 34: 0x831bcb80
2184KERN: widget 34 is candidate
2185KERN: input: not added mixer/selector widget 11
2186KERN: input: not added mixer/selector widget 34
2187KERN: look at input widget 10 (1 inputs)
2188KERN: try widget 31: 0x831bc97c
2189KERN: widget 31 is candidate
2190KERN: build tree!
2191KERN: Audiogroup:
2192KERN: 2: Audio output
2193KERN: Supported power states: D0 D1 D2 D3
2194KERN: [Power] [Format override] [Amplifier override] [Out amplifier] [Stereo]
2195KERN: Out Amp: step size: 1 dB, # steps: 64, offset to 0 dB: 64
2196KERN: 3: Audio output
2197KERN: Supported power states: D0 D1 D2 D3
2198KERN: [Power] [Format override] [Amplifier override] [Out amplifier] [Stereo]
2199KERN: Out Amp: step size: 1 dB, # steps: 64, offset to 0 dB: 64
2200KERN: 4: Audio output
2201KERN: Supported power states: D0 D1 D2 D3
2202KERN: [Power] [Format override] [Amplifier override] [Out amplifier] [Stereo]
2203KERN: Out Amp: step size: 1 dB, # steps: 64, offset to 0 dB: 64
2204KERN: 5: Audio output
2205KERN: Supported power states: D0 D1 D2 D3
2206KERN: [Power] [Format override] [Amplifier override] [Out amplifier] [Stereo]
2207KERN: Out Amp: step size: 1 dB, # steps: 64, offset to 0 dB: 64
2208KERN: 6: Audio output
2209KERN: Supported power states: D0 D1 D2 D3
2210KERN: [Power] [Digital] [Format override] [Stereo]
2211KERN: 7: Vendor defined
2212KERN: Supported power states: D0
2213KERN: 8: Audio input
2214KERN: Supported power states: D0 D1 D2 D3
2215KERN: [Power] [Conn. list] [Format override] [Amplifier override] [In amplifier] [Stereo]
2216KERN: In Amp: supports mute, step size: 1 dB, # steps: 46, offset to 0 dB: 16
2217KERN: Inputs: <35>
2218KERN: 9: Audio input
2219KERN: Supported power states: D0 D1 D2 D3
2220KERN: [Power] [Conn. list] [Format override] [Amplifier override] [In amplifier] [Stereo]
2221KERN: In Amp: supports mute, step size: 1 dB, # steps: 46, offset to 0 dB: 16
2222KERN: Inputs: <34>
2223KERN: 10: Audio input
2224KERN: Supported power states: D0 D1 D2 D3
2225KERN: [Power] [Digital] [Conn. list] [Format override] [Stereo]
2226KERN: Inputs: <31>
2227KERN: 11: Audio mixer
2228KERN: Supported power states: D0
2229KERN: [Conn. list] [Amplifier override] [In amplifier] [Stereo]
2230KERN: In Amp: supports mute, step size: 1.5 dB, # steps: 31, offset to 0 dB: 23
2231KERN: Inputs: <24> 25 26 27 28 29 20 21 22 23
2232KERN: 12: Audio mixer
2233KERN: Supported power states: D0
2234KERN: [Conn. list] [Amplifier override] [In amplifier] [Stereo]
2235KERN: In Amp: supports mute, step size: 0.25 dB, # steps: 0, offset to 0 dB: 0
2236KERN: Inputs: <2> 11
2237KERN: 13: Audio mixer
2238KERN: Supported power states: D0
2239KERN: [Conn. list] [Amplifier override] [In amplifier] [Stereo]
2240KERN: In Amp: supports mute, step size: 0.25 dB, # steps: 0, offset to 0 dB: 0
2241KERN: Inputs: <3> 11
2242KERN: 14: Audio mixer
2243KERN: Supported power states: D0
2244KERN: [Conn. list] [Amplifier override] [In amplifier] [Stereo]
2245KERN: In Amp: supports mute, step size: 0.25 dB, # steps: 0, offset to 0 dB: 0
2246KERN: Inputs: <4> 11
2247KERN: 15: Audio mixer
2248KERN: Supported power states: D0
2249KERN: [Conn. list] [Amplifier override] [In amplifier] [Stereo]
2250KERN: In Amp: supports mute, step size: 0.25 dB, # steps: 0, offset to 0 dB: 0
2251KERN: Inputs: <5> 11
2252KERN: 16: Audio output
2253KERN: Supported power states: D0 D1 D2 D3
2254KERN: [Power] [Digital] [Format override] [Stereo]
2255KERN: 17: Pin complex
2256KERN: [Output]
2257KERN: Supported power states: D0 D1 D2 D3
2258KERN: [Power] [Digital] [Conn. list] [Unsol. responses] [Stereo]
2259KERN: Inputs: <16>
2260KERN: 18: Pin complex
2261KERN: [Input]
2262KERN: Supported power states: D0 D1 D2 D3
2263KERN: [Power] [Stereo]
2264KERN: 19: Vendor defined
2265KERN: Supported power states: D0
2266KERN: 20: Pin complex
2267KERN: [Trigger Req][Pres Detect][HP Drive][Output][Input][EAPD]
2268KERN: Supported power states: D0 D1 D2 D3
2269KERN: [Power] [Conn. list] [Unsol. responses] [Amplifier override] [Out amplifier] [Stereo]
2270KERN: Out Amp: supports mute, step size: 0.25 dB, # steps: 0, offset to 0 dB: 0
2271KERN: Inputs: <12>
2272KERN: 21: Pin complex
2273KERN: [Trigger Req][Pres Detect][Output][Input]
2274KERN: Supported power states: D0 D1 D2 D3
2275KERN: [Power] [Conn. list] [Unsol. responses] [Amplifier override] [Out amplifier] [Stereo]
2276KERN: Out Amp: supports mute, step size: 0.25 dB, # steps: 0, offset to 0 dB: 0
2277KERN: Inputs: <13>
2278KERN: 22: Pin complex
2279KERN: [Trigger Req][Pres Detect][Output][Input]
2280KERN: Supported power states: D0 D1 D2 D3
2281KERN: [Power] [Conn. list] [Unsol. responses] [Amplifier override] [Out amplifier] [Stereo]
2282KERN: Out Amp: supports mute, step size: 0.25 dB, # steps: 0, offset to 0 dB: 0
2283KERN: Inputs: <14>
2284KERN: 23: Pin complex
2285KERN: [Trigger Req][Pres Detect][Output][Input]
2286KERN: Supported power states: D0 D1 D2 D3
2287KERN: [Power] [Conn. list] [Unsol. responses] [Amplifier override] [Out amplifier] [Stereo]
2288KERN: Out Amp: supports mute, step size: 0.25 dB, # steps: 0, offset to 0 dB: 0
2289KERN: Inputs: <15>
2290KERN: 24: Pin complex
2291KERN: [Trigger Req][Pres Detect][Output][Input][VRef HIZ][VRef 50][VRef Gr][VRef 80][VRef 100]
2292KERN: Supported power states: D0 D1 D2 D3
2293KERN: [Power] [Conn. list] [Unsol. responses] [Amplifier override] [Out amplifier] [In amplifier] [Stereo]
2294KERN: In Amp: step size: 10 dB, # steps: 3, offset to 0 dB: 0
2295KERN: Out Amp: supports mute, step size: 0.25 dB, # steps: 0, offset to 0 dB: 0
2296KERN: Inputs: <12> 13 14 15 38
2297KERN: 25: Pin complex
2298KERN: [Trigger Req][Pres Detect][HP Drive][Output][Input][VRef HIZ][VRef 50][VRef Gr][VRef 80][VRef 100]
2299KERN: Supported power states: D0 D1 D2 D3
2300KERN: [Power] [Conn. list] [Unsol. responses] [Amplifier override] [Out amplifier] [In amplifier] [Stereo]
2301KERN: In Amp: step size: 10 dB, # steps: 3, offset to 0 dB: 0
2302KERN: Out Amp: supports mute, step size: 0.25 dB, # steps: 0, offset to 0 dB: 0
2303KERN: Inputs: <12> 13 14 15 38
2304KERN: 26: Pin complex
2305KERN: [Trigger Req][Pres Detect][Output][Input][VRef HIZ][VRef 50][VRef Gr][VRef 80][VRef 100]
2306KERN: Supported power states: D0 D1 D2 D3
2307KERN: Running post install script /boot/common/boot/post_install/default_deskbar_items.sh ...
2308KERN: [Power] [Conn. list] [Unsol. responses] [Amplifier override] [Out amplifier] [In amplifier] [Stereo]
2309KERN: In Amp: step size: 10 dB, # steps: 3, offset to 0 dB: 0
2310KERN: Out Amp: supports mute, step size: 0.25 dB, # steps: 0, offset to 0 dB: 0
2311KERN: Inputs: <12> 13 14 15 38
2312KERN: 27: Pin complex
2313KERN: [Trigger Req][Pres Detect][HP Drive][Output][Input][VRef HIZ][VRef 50][VRef Gr][VRef 80][VRef 100][EAPD]
2314KERN: Supported power states: D0 D1 D2 D3
2315KERN: [Power] [Conn. list] [Unsol. responses] [Amplifier override] [Out amplifier] [In amplifier] [Stereo]
2316KERN: In Amp: step size: 10 dB, # steps: 3, offset to 0 dB: 0
2317KERN: Out Amp: supports mute, step size: 0.25 dB, # steps: 0, offset to 0 dB: 0
2318KERN: Inputs: <12> 13 14 15 38
2319KERN: 28: Pin complex
2320KERN: [Pres Detect][Input]
2321KERN: Supported power states: D0 D1 D2 D3
2322KERN: [Power] [Unsol. responses] [Stereo]
2323KERN: 29: Pin complex
2324KERN: [Input]
2325KERN: Supported power states: D0 D1 D2 D3
2326KERN: [Power]
2327KERN: 30: Pin complex
2328KERN: [Output]
2329KERN: Supported power states: D0 D1 D2 D3
2330KERN: [Power] [Digital] [Conn. list] [Unsol. responses] [Stereo]
2331KERN: Inputs: <6>
2332KERN: 31: Pin complex
2333KERN: [Input]
2334KERN: Supported power states: D0 D1 D2 D3
2335KERN: [Power] [Digital] [Unsol. responses] [Stereo]
2336KERN: 32: Vendor defined
2337KERN: Supported power states: D0
2338KERN: [Proc widget]
2339KERN: 33: Vendor defined
2340KERN: Supported power states: D0
2341KERN: 34: Audio mixer
2342KERN: Supported power states: D0
2343KERN: [Conn. list] [Amplifier override] [In amplifier] [Stereo]
2344KERN: In Amp: supports mute, step size: 0.25 dB, # steps: 0, offset to 0 dB: 0
2345KERN: Inputs: <24> 25 26 27 28 29 20 21 22 23 11 18
2346KERN: 35: Audio mixer
2347KERN: Supported power states: D0
2348KERN: [Conn. list] [Amplifier override] [In amplifier] [Stereo]
2349KERN: In Amp: supports mute, step size: 0.25 dB, # steps: 0, offset to 0 dB: 0
2350KERN: Inputs: <24> 25 26 27 28 29 20 21 22 23 11
2351KERN: 36: Vendor defined
2352KERN: Supported power states: D0
2353KERN: 37: Audio output
2354KERN: Supported power states: D0 D1 D2 D3
2355KERN: [Power] [Format override] [Amplifier override] [Out amplifier] [Stereo]
2356KERN: Out Amp: step size: 1 dB, # steps: 64, offset to 0 dB: 64
2357KERN: 38: Audio mixer
2358KERN: Supported power states: D0
2359KERN: [Conn. list] [Amplifier override] [In amplifier] [Stereo]
2360KERN: In Amp: supports mute, step size: 0.25 dB, # steps: 0, offset to 0 dB: 0
2361KERN: Inputs: <37> 11
2362KERN: hda: Enabled unsolicited responses on widget 20
2363KERN: hda: Enabled unsolicited responses on widget 21
2364KERN: hda: Enabled unsolicited responses on widget 22
2365KERN: hda: Enabled unsolicited responses on widget 23
2366KERN: hda: Enabled unsolicited responses on widget 24
2367KERN: hda: Enabled unsolicited responses on widget 25
2368KERN: hda: Enabled unsolicited responses on widget 26
2369KERN: hda: Enabled unsolicited responses on widget 27
2370KERN: UNMUTE/SET OUTPUT GAIN widget 2 (offset 64)
2371KERN: UNMUTE/SET OUTPUT GAIN widget 3 (offset 64)
2372KERN: UNMUTE/SET OUTPUT GAIN widget 4 (offset 64)
2373KERN: UNMUTE/SET OUTPUT GAIN widget 5 (offset 64)
2374KERN: UNMUTE/SET INPUT GAIN widget 12 (offset 0)
2375KERN: UNMUTE/SET INPUT GAIN widget 13 (offset 0)
2376KERN: UNMUTE/SET INPUT GAIN widget 14 (offset 0)
2377KERN: UNMUTE/SET INPUT GAIN widget 15 (offset 0)
2378KERN: ENABLE pin widget 20
2379KERN: ENABLE EAPD pin widget 20
2380KERN: UNMUTE/SET OUTPUT GAIN widget 20 (offset 0)
2381KERN: ENABLE pin widget 21
2382KERN: UNMUTE/SET OUTPUT GAIN widget 21 (offset 0)
2383KERN: ENABLE pin widget 22
2384KERN: UNMUTE/SET OUTPUT GAIN widget 22 (offset 0)
2385KERN: ENABLE pin widget 23
2386KERN: UNMUTE/SET OUTPUT GAIN widget 23 (offset 0)
2387KERN: ENABLE pin widget 27
2388KERN: ENABLE EAPD pin widget 27
2389KERN: UNMUTE/SET OUTPUT GAIN widget 27 (offset 0)
2390KERN: UNMUTE/SET INPUT GAIN widget 27 (offset 0)
2391KERN: UNMUTE/SET INPUT GAIN widget 8 (offset 16)
2392KERN: input vref 50 enabled
2393KERN: input vref 80 enabled
2394KERN: input vref 100 enabled
2395KERN: ENABLE pin widget 24
2396KERN: UNMUTE/SET OUTPUT GAIN widget 24 (offset 0)
2397KERN: UNMUTE/SET INPUT GAIN widget 24 (offset 0)
2398KERN: input vref 50 enabled
2399KERN: input vref 80 enabled
2400KERN: input vref 100 enabled
2401KERN: ENABLE pin widget 25
2402KERN: UNMUTE/SET OUTPUT GAIN widget 25 (offset 0)
2403KERN: UNMUTE/SET INPUT GAIN widget 25 (offset 0)
2404KERN: input vref 50 enabled
2405KERN: input vref 80 enabled
2406KERN: input vref 100 enabled
2407KERN: ENABLE pin widget 26
2408KERN: UNMUTE/SET OUTPUT GAIN widget 26 (offset 0)
2409KERN: UNMUTE/SET INPUT GAIN widget 26 (offset 0)
2410KERN: ENABLE pin widget 28
2411KERN: UNMUTE/SET INPUT GAIN widget 35 (offset 0)
2412KERN: hda: streams playback 0x9b049ce0, record 0x9b049920
2413KERN: get_description: request_channel_count: 16
2414KERN: HDA: sample size 4, num channels 2, buffer length 10240, **********
2415KERN: IRA: hda_stream_setup_buffers: setup stream 1: SR=192000, SF=24 F=0x1831 (0x100)
2416KERN: hda_stream_setup_buffers(Playback): Allocated 163840 bytes for 2 buffers
2417KERN: hda_stream_setup_buffers(Playback): Allocated 4096 bytes for 2 BDLEs
2418KERN: hda: stream: 1 fifo size: 1024 num_io_widgets: 4
2419KERN: hda: widgets: KERN: 2 KERN: 3 KERN: 4 KERN: 5
2420KERN: HDA: sample size 4, num channels 2, buffer length 10240, **********
2421KERN: IRA: hda_stream_setup_buffers: setup stream 2: SR=192000, SF=24 F=0x1831 (0x100)
2422KERN: hda_stream_setup_buffers(Recording): Allocated 163840 bytes for 2 buffers
2423KERN: hda_stream_setup_buffers(Recording): Allocated 4096 bytes for 2 BDLEs
2424KERN: hda: stream: 2 fifo size: 256 num_io_widgets: 1
2425KERN: hda: widgets: KERN: 8 KERN:
2426KERN: hda_stream_start() offset 80
2427KERN: hda_stream_start() offset 0
2428USER: failed to create the required index for attribute BEOS:LOCALE_LANGUAGE (General system error)
2429USER: failed to create the required index for attribute BEOS:LOCALE_SIGNATURE (General system error)
2430USER: Image /boot/system/apps/ProcessController (address 221804) requested catalog with mimetype x-vnd.Haiku-ProcessController
2431USER: failed to create the required index for attribute BEOS:LOCALE_LANGUAGE (General system error)
2432USER: failed to create the required index for attribute BEOS:LOCALE_SIGNATURE (General system error)
2433USER: Image /boot/system/apps/NetworkStatus (address 20ec50) requested catalog with mimetype x-vnd.Haiku-NetworkStatus
2434KERN: hda: DMA position for stream (id:1) seems to be broken. Switching to using LPIB.
2435KERN: hda: DMA position for stream (id:2) seems to be broken. Switching to using LPIB.
2436KERN: Running post install script /boot/common/boot/post_install/mime_update.sh ...
2437USER: failed to create the required index for attribute BEOS:LOCALE_LANGUAGE (General system error)
2438USER: failed to create the required index for attribute BEOS:LOCALE_SIGNATURE (General system error)
2439USER: Image /boot/system/add-ons/Translators/BMPTranslator (address 7960e0) requested catalog with mimetype x-vnd.Haiku-BMPTranslator
2440USER: failed to create the required index for attribute BEOS:LOCALE_LANGUAGE (General system error)
2441USER: failed to create the required index for attribute BEOS:LOCALE_SIGNATURE (General system error)
2442USER: Image /boot/system/add-ons/Translators/BMPTranslator (address 7960e0) requested catalog with mimetype x-vnd.Haiku-BMPTranslator
2443USER: failed to create the required index for attribute BEOS:LOCALE_LANGUAGE (General system error)
2444USER: failed to create the required index for attribute BEOS:LOCALE_SIGNATURE (General system error)
2445USER: Image /boot/system/add-ons/Translators/BMPTranslator (address 7960e0) requested catalog with mimetype x-vnd.Haiku-BMPTranslator
2446USER: failed to create the required index for attribute BEOS:LOCALE_LANGUAGE (General system error)
2447USER: failed to create the required index for attribute BEOS:LOCALE_SIGNATURE (General system error)
2448USER: Image /boot/system/add-ons/Translators/BMPTranslator (address 7960e0) requested catalog with mimetype x-vnd.Haiku-BMPTranslator
2449USER: failed to create the required index for attribute BEOS:LOCALE_LANGUAGE (General system error)
2450USER: failed to create the required index for attribute BEOS:LOCALE_SIGNATURE (General system error)
2451USER: Image /boot/system/add-ons/Translators/BMPTranslator (address 7960e0) requested catalog with mimetype x-vnd.Haiku-BMPTranslator
2452USER: failed to create the required index for attribute BEOS:LOCALE_LANGUAGE (General system error)
2453USER: failed to create the required index for attribute BEOS:LOCALE_SIGNATURE (General system error)
2454USER: Image /boot/system/add-ons/Translators/BMPTranslator (address 7960e0) requested catalog with mimetype x-vnd.Haiku-BMPTranslator
2455USER: failed to create the required index for attribute BEOS:LOCALE_LANGUAGE (General system error)
2456USER: failed to create the required index for attribute BEOS:LOCALE_SIGNATURE (General system error)
2457USER: Image /boot/system/add-ons/Translators/BMPTranslator (address 7960e0) requested catalog with mimetype x-vnd.Haiku-BMPTranslator
2458USER: failed to create the required index for attribute BEOS:LOCALE_LANGUAGE (General system error)
2459USER: failed to create the required index for attribute BEOS:LOCALE_SIGNATURE (General system error)
2460USER: failed to create the required index for attribute BEOS:LOCALE_LANGUAGE (General system error)
2461USER: failed to create the required index for attribute BEOS:LOCALE_SIGNATURE (General system error)
2462USER: Image /boot/system/add-ons/Translators/BMPTranslator (address 7960e0) requested catalog with mimetype x-vnd.Haiku-BMPTranslator
2463KERN: Running post install script /boot/common/boot/post_install/sshd_keymaker.sh ...
2464USER: failed to create the required index for attribute BEOS:LOCALE_LANGUAGE (General system error)
2465USER: failed to create the required index for attribute BEOS:LOCALE_SIGNATURE (General system error)
2466USER: Image /boot/system/add-ons/Translators/BMPTranslator (address 7960e0) requested catalog with mimetype x-vnd.Haiku-BMPTranslator
2467USER: failed to create the required index for attribute BEOS:LOCALE_LANGUAGE (General system error)
2468USER: failed to create the required index for attribute BEOS:LOCALE_SIGNATURE (General system error)
2469USER: Image /boot/system/add-ons/Translators/BMPTranslator (address 7960e0) requested catalog with mimetype x-vnd.Haiku-BMPTranslator
2470USER: failed to create the required index for attribute BEOS:LOCALE_LANGUAGE (General system error)
2471USER: failed to create the required index for attribute BEOS:LOCALE_SIGNATURE (General system error)
2472USER: Image /boot/system/add-ons/Translators/BMPTranslator (address 7960e0) requested catalog with mimetype x-vnd.Haiku-BMPTranslator
2473USER: failed to create the required index for attribute BEOS:LOCALE_LANGUAGE (General system error)
2474USER: failed to create the required index for attribute BEOS:LOCALE_SIGNATURE (General system error)
2475USER: Image /boot/system/add-ons/Translators/BMPTranslator (address 7960e0) requested catalog with mimetype x-vnd.Haiku-BMPTranslator
2476USER: failed to create the required index for attribute BEOS:LOCALE_LANGUAGE (General system error)
2477USER: failed to create the required index for attribute BEOS:LOCALE_SIGNATURE (General system error)
2478USER: Image /boot/system/add-ons/Translators/BMPTranslator (address 7960e0) requested catalog with mimetype x-vnd.Haiku-BMPTranslator
2479KERN: sync: device 3 couldn't sync: Operation not supported
2480USER: failed to create the required index for attribute BEOS:LOCALE_LANGUAGE (General system error)
2481USER: failed to create the required index for attribute BEOS:LOCALE_SIGNATURE (General system error)
2482USER: failed to create the required index for attribute BEOS:LOCALE_LANGUAGE (General system error)
2483USER: failed to create the required index for attribute BEOS:LOCALE_SIGNATURE (General system error)
2484USER: Image /boot/system/apps/Devices (address 310690) requested catalog with mimetype x-vnd.Haiku-Devices
2485USER: failed to create the required index for attribute BEOS:LOCALE_LANGUAGE (General system error)
2486USER: failed to create the required index for attribute BEOS:LOCALE_SIGNATURE (General system error)
2487USER: Image /boot/system/apps/Terminal (address 24fefc) requested catalog with mimetype x-vnd.Haiku-Terminal
2488USER: failed to create the required index for attribute BEOS:LOCALE_LANGUAGE (General system error)
2489USER: failed to create the required index for attribute BEOS:LOCALE_SIGNATURE (General system error)
2490KERN: usb hub 27: port 4: new device connected
2491KERN: usb error control pipe 36: timeout waiting for queued request to complete
2492Last message repeated 1 time
2493KERN: usb error ehci -1: KERN: qtd (0x05b7f580) error: 0x00080248
2494KERN: usb error control pipe 36: timeout waiting for queued request to complete
2495KERN: usb error ehci -1: qtd (0x05b7f780) error: 0x00080248
2496KERN: usb error ehci -1: error while setting device address
2497KERN: usb error control pipe 36: timeout waiting for queued request to complete
2498Last message repeated 1 time
2499KERN: usb error ehci -1: qtd (0x05b7fb80) error: 0x00080248
2500KERN: usb error control pipe 36: timeout waiting for queued request to complete
2501KERN: usb error ehci -1: qtd (0x05b7fd80) error: 0x00080248
2502KERN: usb error ehci -1: error while setting device address
2503USER: failed to create the required index for attribute BEOS:LOCALE_LANGUAGE (General system error)
2504USER: failed to create the required index for attribute BEOS:LOCALE_SIGNATURE (General system error)
2505USER: Image /boot/system/apps/Terminal (address 24fefc) requested catalog with mimetype x-vnd.Haiku-Terminal
2506USER: failed to create the required index for attribute BEOS:LOCALE_LANGUAGE (General system error)
2507USER: failed to create the required index for attribute BEOS:LOCALE_SIGNATURE (General system error)
2508USER: Image /boot/system/add-ons/Translators/BMPTranslator (address 1c600e0) requested catalog with mimetype x-vnd.Haiku-BMPTranslator
2509KERN: slab memory manager: created area 0x9b801000 (49742)
2510KERN: vm_soft_fault: va 0x0 not covered by area in address space
2511KERN: vm_page_fault: vm_soft_fault returned error 'Bad address' on fault at 0x0, ip 0x358f7f, write 1, user 1, thread 0x1d7
2512KERN: vm_page_fault: thread "bash" (471) in team "bash" (471) tried to write address 0x0, ip 0x358f7f ("libroot.so_seg0ro" +0xa1f7f)
2513KERN: debug_server: Thread 471 entered the debugger: Segment violation
2514KERN: stack trace, current PC 0x358f7f _ZN8BPrivate11processHeap4freeEPv + 0x16d:
2515KERN: (0x7ffed9d8) 0x35a811 free + 0x154
2516KERN: (0x7ffed9f8) 0x2307a7 dispose_word + 0x23
2517KERN: (0x7ffeda18) 0x230900 dispose_words + 0x32
2518KERN: (0x7ffeda58) 0x235ff2 execute_simple_command + 0xe89
2519KERN: (0x7ffedab8) 0x23282d execute_command_internal + 0x5ab
2520KERN: (0x7ffedb48) 0x232e53 execute_command_internal + 0xbd1
2521KERN: (0x7ffedbe8) 0x233754 execute_command + 0x58
2522KERN: (0x7ffedc38) 0x232e02 execute_command_internal + 0xb80
2523KERN: (0x7ffedcc8) 0x233754 execute_command + 0x58
2524KERN: (0x7ffedd18) 0x232e02 execute_command_internal + 0xb80
2525KERN: (0x7ffedda8) 0x233754 execute_command + 0x58
2526KERN: (0x7ffeddf8) 0x232e02 execute_command_internal + 0xb80
2527KERN: (0x7ffede88) 0x232c68 execute_command_internal + 0x9e6
2528KERN: (0x7ffedf28) 0x234e44 execute_function + 0x4f5
2529KERN: (0x7ffedf98) 0x235b26 execute_simple_command + 0x9bd
2530KERN: (0x7ffedff8) 0x23282d execute_command_internal + 0x5ab
2531KERN: (0x7ffee088) 0x232e53 execute_command_internal + 0xbd1
2532KERN: (0x7ffee128) 0x233754 execute_command + 0x58
2533KERN: (0x7ffee178) 0x232e02 execute_command_internal + 0xb80
2534KERN: (0x7ffee208) 0x233754 execute_command + 0x58
2535KERN: (0x7ffee258) 0x232e02 execute_command_internal + 0xb80
2536KERN: (0x7ffee2e8) 0x233754 execute_command + 0x58
2537KERN: (0x7ffee338) 0x2347e8 execute_while_or_until + 0xe2
2538KERN: (0x7ffee378) 0x232bbe execute_command_internal + 0x93c
2539KERN: (0x7ffee3f8) 0x232e53 execute_command_internal + 0xbd1
2540KERN: (0x7ffee498) 0x233754 execute_command + 0x58
2541KERN: (0x7ffee4e8) 0x232e02 execute_command_internal + 0xb80
2542KERN: (0x7ffee578) 0x232c68 execute_command_internal + 0x9e6
2543KERN: (0x7ffee618) 0x234e44 execute_function + 0x4f5
2544KERN: (0x7ffee688) 0x235b26 execute_simple_command + 0x9bd
2545KERN: (0x7ffee6e8) 0x23282d execute_command_internal + 0x5ab
2546KERN: (0x7ffee778) 0x232e53 execute_command_internal + 0xbd1
2547KERN: (0x7ffee818) 0x233754 execute_command + 0x58
2548KERN: (0x7ffee868) 0x232e02 execute_command_internal + 0xb80
2549KERN: (0x7ffee8f8) 0x233754 execute_command + 0x58
2550KERN: (0x7ffee948) 0x2348f3 execute_if_command + 0x89
2551KERN: (0x7ffee978) 0x232c03 execute_command_internal + 0x981
2552KERN: (0x7ffee9f8) 0x232c68 execute_command_internal + 0x9e6
2553KERN: (0x7ffeea98) 0x234e44 execute_function + 0x4f5
2554KERN: (0x7ffeeb08) 0x235b26 execute_simple_command + 0x9bd
2555KERN: (0x7ffeeb68) 0x23282d execute_command_internal + 0x5ab
2556KERN: (0x7ffeebf8) 0x232e53 execute_command_internal + 0xbd1
2557KERN: (0x7ffeec98) 0x233754 execute_command + 0x58
2558KERN: (0x7ffeece8) 0x232e02 execute_command_internal + 0xb80
2559KERN: (0x7ffeed78) 0x233754 execute_command + 0x58
2560KERN: (0x7ffeedc8) 0x2348f3 execute_if_command + 0x89
2561KERN: (0x7ffeedf8) 0x232c03 execute_command_internal + 0x981
2562KERN: (0x7ffeee78) 0x233754 execute_command + 0x58
2563KERN: (0x7ffeeec8) 0x22c533 reader_loop + 0x1f5
2564KERN: (0x7ffeef08) 0x22c07a main + 0x1307
2565USER: failed to create the required index for attribute BEOS:LOCALE_LANGUAGE (General system error)
2566USER: failed to create the required index for attribute BEOS:LOCALE_SIGNATURE (General system error)
2567KERN: debug_server: Killing team 471 (/bin/bash /bin/installoptionalpackage -a webpositive)
2568KERN: debug_server: TeamDebugHandler::Init(): Failed to get info for team 471: Operation on invalid team
2569KERN: debug_server: KillTeam(): Error getting info for team 471: Operation on invalid team
2570KERN: debug_server: Killing team 471 ()
2571KERN: runtime_loader: /boot/common/lib/libxml2.so.2.7.8: No version information available (required by /boot/apps/WebPositive/lib/libwebcore.so)
2572USER: failed to create the required index for attribute BEOS:LOCALE_LANGUAGE (General system error)
2573USER: failed to create the required index for attribute BEOS:LOCALE_SIGNATURE (General system error)
2574KERN: Last message repeated 2 times.
2575KERN: module: Search for network/protocols/ipv6/v1 failed.
2576KERN: Last message repeated 2 times.
2577KERN: module: Search for network/protocols/ipv6/v1 failed.
2578Last message repeated 5 times
2579USER: failed to create the required index for attribute BEOS:LOCALE_LANGUAGE (General system error)
2580USER: failed to create the required index for attribute BEOS:LOCALE_SIGNATURE (General system error)
2581USER: Image /boot/system/apps/AboutSystem (address 21ebc4) requested catalog with mimetype x-vnd.Haiku-About