Opened 2 years ago

Closed 11 months ago

#15272 closed bug (duplicate)

POSIX sem test failures

Reported by: cocobean Owned by: nobody
Priority: normal Milestone: Unscheduled
Component: System/POSIX Version: R1/Development
Keywords: Cc:
Blocked By: #4947 Blocking: #15273, #15274, #15275, #15276, #15277, #15278, #15279
Platform: All

Description (last modified by waddlesplash)

Various POSIX semaphore API tests from the Open POSIX Testsuite fail, including some for sem_init, sem_open, sem_unlink, sem_post, and sem_timedwait.

Change History (12)

comment:1 by waddlesplash, 2 years ago

Description: modified (diff)
Summary: sem_unlink 3-1 posix tests failsPOSIX sem test failures

comment:2 by waddlesplash, 2 years ago

Blocking: 15273 added

comment:3 by waddlesplash, 2 years ago

Blocking: 15274 added

comment:4 by waddlesplash, 2 years ago

Blocking: 15275 added

comment:5 by waddlesplash, 2 years ago

Blocking: 15276 added

comment:6 by waddlesplash, 2 years ago

Blocking: 15277 added

comment:7 by waddlesplash, 2 years ago

Blocking: 15278 added

comment:8 by waddlesplash, 2 years ago

Blocking: 15279 added

comment:9 by cocobean, 2 years ago

conformance/interfaces/sem_open/1-2: build: FAILED 
conformance/interfaces/sem_post/8-1: build: FAILED 
conformance/interfaces/sem_timedwait/9-1: build: FAILED 
conformance/interfaces/sem_wait/7-1: build: FAILED 
Version 3, edited 2 years ago by cocobean (previous) (next) (diff)

comment:10 by cocobean, 12 months ago

Last edited 11 months ago by cocobean (previous) (diff)

comment:11 by cocobean, 11 months ago

Please close this ticket. Consolidating to ticket #4947.

comment:12 by korli, 11 months ago

Blocked By: 4947 added
Resolution: duplicate
Status: newclosed
Note: See TracTickets for help on using tickets.