Opened 12 months ago

Last modified 12 months ago

#15281 new bug

POSIX sig test failures

Reported by: cocobean Owned by: nobody
Priority: normal Milestone: Unscheduled
Component: System/POSIX Version: R1/Development
Keywords: posix Cc:
Blocked By: Blocking:
Platform: All

Description

open_posix_testsuite 1.5.2 SIG test failures and hangs

Ref: https://github.com/haiku/open_posix_testsuite

NOTE: issues with pthread and sigwait

conformance/interfaces/sigprocmask/17-core-buildonly: build: FAILED 
conformance/interfaces/sigprocmask/17-1: execution: FAILED 
conformance/interfaces/sigprocmask/17-2: execution: FAILED 
conformance/interfaces/sigprocmask/17-3: execution: FAILED 
conformance/interfaces/sigprocmask/17-4: execution: FAILED
 
conformance/interfaces/pthread_kill/6-1: execution: FAILED 

conformance/interfaces/sigwait/6-1: execution: HUNG 

Change History (1)

comment:1 by cocobean, 12 months ago

conformance/definitions/signal_h test results:

conformance/definitions/signal_h/17-1: build: FAILED 
conformance/definitions/signal_h/18-1: build: FAILED
conformance/definitions/signal_h/20-1: build: FAILED
conformance/definitions/signal_h/23-1: build: FAILED 
conformance/definitions/signal_h/24-1: build: FAILED 
conformance/definitions/signal_h/25-1: build: FAILED 
conformance/definitions/signal_h/26-1: build: FAILED 
conformance/definitions/signal_h/27-1: build: FAILED 
conformance/definitions/signal_h/28-1: build: FAILED 
conformance/definitions/signal_h/29-1: build: FAILED 

conformance/definitions/signal_h/30-1: build: FAILED 
conformance/definitions/signal_h/31-1: build: FAILED 
conformance/definitions/signal_h/32-1: build: FAILED 
conformance/definitions/signal_h/33-1: build: FAILED 
conformance/definitions/signal_h/34-1: build: FAILED 
conformance/definitions/signal_h/35-1: build: FAILED 
conformance/definitions/signal_h/36-1: build: FAILED 
conformance/definitions/signal_h/37-1: build: FAILED 
conformance/definitions/signal_h/38-1: build: FAILED 
conformance/definitions/signal_h/39-1: build: FAILED 

conformance/definitions/signal_h/40-1: build: FAILED 
conformance/definitions/signal_h/41-1: build: FAILED 
conformance/definitions/signal_h/42-1: build: FAILED 
conformance/definitions/signal_h/43-1: build: FAILED 
conformance/definitions/signal_h/44-1: build: FAILED 
conformance/definitions/signal_h/45-1: build: FAILED 
conformance/definitions/signal_h/46-1: build: FAILED 
conformance/definitions/signal_h/47-1: build: FAILED 
conformance/definitions/signal_h/48-1: build: FAILED 
conformance/definitions/signal_h/49-1: build: FAILED   
Version 0, edited 12 months ago by cocobean (next)
Note: See TracTickets for help on using tickets.