Ticket #13216: syslog

File syslog, 230.3 KB (added by Premislaus, 3 years ago)
Line 
1KERN: entry size: 128
2KERN: entry count: 128
3KERN: entries CRC: e01fb6fd
4KERN: EFI header: EFI PART
5KERN: EFI revision: 10000
6KERN: header size: 92
7KERN: header CRC: 1c8b382d
8KERN: absolute block: 976773167
9KERN: alternate block: 1
10KERN: first usable block: 34
11KERN: last usable block: 976773134
12KERN: disk GUID: f833fb81-5eef-47c0-abcf-f5302dd5f92d
13KERN: entries block: 976773135
14KERN: entry size: 128
15KERN: entry count: 128
16KERN: entries CRC: e01fb6fd
17KERN: [ 0] partition type: c12a7328-f81f-11d2-ba4b-00a0c93ec93b
18KERN: unique id: 9834b71a-2e0a-4ba8-a235-fa58d78feb21
19KERN: start block: 2048
20KERN: end block: 321535
21KERN: size: 155.999 MB
22KERN: attributes: 0
23KERN: name: primary
24KERN: [ 1] partition type: 0fc63daf-8483-4772-8e79-3d69d8477de4
25KERN: unique id: 029eb528-2cbe-4b66-832a-23d25a6b590f
26KERN: start block: 321536
27KERN: end block: 11855871
28KERN: size: 5631.999 MB
29KERN: attributes: 0
30KERN: name: primary
31KERN: [ 2] partition type: 0fc63daf-8483-4772-8e79-3d69d8477de4
32KERN: unique id: 6770c84c-cdc1-4240-bc69-bd9271dbb834
33KERN: start block: 11855872
34KERN: end block: 95748095
35KERN: size: 40962.999 MB
36KERN: attributes: 0
37KERN: name: primary
38KERN: [ 3] partition type: 0fc63daf-8483-4772-8e79-3d69d8477de4
39KERN: unique id: e84cffe1-3f2d-4f81-8530-62f51e7c84eb
40KERN: start block: 95748096
41KERN: end block: 976773119
42KERN: size: 430187.999 MB
43KERN: attributes: 0
44KERN: name: primary
45KERN: returned: 0.959
46KERN: intel: pm_std_ops(0x1)
47KERN: trying: partitioning_systems/intel/map/v1
48KERN: intel: pm_identify_partition(0, 0: 0, 500107862016, 512)
49KERN: intel: Found GPT signature, ignoring.
50KERN: returned: -1
51KERN: intel: pm_std_ops(0x2)
52KERN: trying: file_systems/devfs/v1
53KERN: returned: -1
54KERN: trying: file_systems/rootfs/v1
55KERN: returned: -1
56KERN: trying: file_systems/packagefs/v1
57KERN: returned: -1
58KERN: trying: file_systems/bfs/v1
59KERN: returned: -1
60KERN: scanning with: partitioning_systems/efi_gpt/v1
61KERN: efi_gpt_scan_partition(cookie = 0xffffffff8280ed20)
62KERN: KDiskDeviceManager::_ScanPartition(/dev/disk/scsi/0/0/0/0)
63KERN: intel: ep_std_ops(0x1)
64KERN: trying: partitioning_systems/intel/extended/v1
65KERN: returned: -1
66KERN: intel: ep_std_ops(0x2)
67KERN: trying: partitioning_systems/efi_gpt/v1
68KERN: returned: -1
69KERN: intel: pm_std_ops(0x1)
70KERN: trying: partitioning_systems/intel/map/v1
71KERN: intel: pm_identify_partition(0, 3: 1048576, 163577856, 512)
72KERN: returned: -1
73KERN: intel: pm_std_ops(0x2)
74KERN: trying: file_systems/devfs/v1
75KERN: returned: -1
76KERN: trying: file_systems/rootfs/v1
77KERN: returned: -1
78KERN: trying: file_systems/packagefs/v1
79KERN: returned: -1
80KERN: trying: file_systems/bfs/v1
81KERN: returned: -1
82KERN: KDiskDeviceManager::_ScanPartition(/dev/disk/scsi/0/0/0/1)
83KERN: intel: ep_std_ops(0x1)
84KERN: trying: partitioning_systems/intel/extended/v1
85KERN: intel: ep_identify_partition(0, 164626432, 5905580032, 512)
86KERN: returned: -1
87KERN: intel: ep_std_ops(0x2)
88KERN: trying: partitioning_systems/efi_gpt/v1
89KERN: returned: -1
90KERN: intel: pm_std_ops(0x1)
91KERN: trying: partitioning_systems/intel/map/v1
92KERN: intel: pm_identify_partition(0, 4: 164626432, 5905580032, 512)
93KERN: returned: -1
94KERN: intel: pm_std_ops(0x2)
95KERN: trying: file_systems/devfs/v1
96KERN: returned: -1
97KERN: trying: file_systems/rootfs/v1
98KERN: returned: -1
99KERN: trying: file_systems/packagefs/v1
100KERN: returned: -1
101KERN: trying: file_systems/bfs/v1
102KERN: returned: -1
103KERN: KDiskDeviceManager::_ScanPartition(/dev/disk/scsi/0/0/0/2)
104KERN: intel: ep_std_ops(0x1)
105KERN: trying: partitioning_systems/intel/extended/v1
106KERN: intel: ep_identify_partition(0, 6070206464, 42952818688, 512)
107KERN: returned: -1
108KERN: intel: ep_std_ops(0x2)
109KERN: trying: partitioning_systems/efi_gpt/v1
110KERN: returned: -1
111KERN: intel: pm_std_ops(0x1)
112KERN: trying: partitioning_systems/intel/map/v1
113KERN: intel: pm_identify_partition(0, 5: 6070206464, 42952818688, 512)
114KERN: returned: -1
115KERN: intel: pm_std_ops(0x2)
116KERN: trying: file_systems/devfs/v1
117KERN: returned: -1
118KERN: trying: file_systems/rootfs/v1
119KERN: returned: -1
120KERN: trying: file_systems/packagefs/v1
121KERN: returned: -1
122KERN: trying: file_systems/bfs/v1
123KERN: returned: -1
124KERN: KDiskDeviceManager::_ScanPartition(/dev/disk/scsi/0/0/0/3)
125KERN: intel: ep_std_ops(0x1)
126KERN: trying: partitioning_systems/intel/extended/v1
127KERN: intel: ep_identify_partition(0, 49023025152, 451084812288, 512)
128KERN: returned: -1
129KERN: intel: ep_std_ops(0x2)
130KERN: trying: partitioning_systems/efi_gpt/v1
131KERN: returned: -1
132KERN: intel: pm_std_ops(0x1)
133KERN: trying: partitioning_systems/intel/map/v1
134KERN: intel: pm_identify_partition(0, 6: 49023025152, 451084812288, 512)
135KERN: returned: -1
136KERN: intel: pm_std_ops(0x2)
137KERN: trying: file_systems/devfs/v1
138KERN: returned: -1
139KERN: trying: file_systems/rootfs/v1
140KERN: returned: -1
141KERN: trying: file_systems/packagefs/v1
142KERN: returned: -1
143KERN: trying: file_systems/bfs/v1
144KERN: returned: -1
145KERN: KDiskDeviceManager::_ScanPartition(/dev/disk/usb/0/0/raw)
146KERN: intel: ep_std_ops(0x1)
147KERN: trying: partitioning_systems/intel/extended/v1
148KERN: returned: -1
149KERN: intel: ep_std_ops(0x2)
150KERN: trying: partitioning_systems/efi_gpt/v1
151KERN: gpt: alternate header not in last block (2047999 vs. 30529535)
152KERN: EFI header: EFI PART
153KERN: EFI revision: 10000
154KERN: header size: 92
155KERN: header CRC: 5b9c07f6
156KERN: absolute block: 1
157KERN: alternate block: 2047999
158KERN: first usable block: 34
159KERN: last usable block: 2047966
160KERN: disk GUID: 7329509a-b888-1649-8d3c-c4150a3f43da
161KERN: entries block: 2
162KERN: entry size: 128
163KERN: entry count: 128
164KERN: entries CRC: 6facae30
165KERN: EFI header: EFI PART
166KERN: EFI revision: 10000
167KERN: header size: 92
168KERN: header CRC: 5b9c07f6
169KERN: absolute block: 2047999
170KERN: alternate block: 1
171KERN: first usable block: 34
172KERN: last usable block: 2047966
173KERN: disk GUID: 7329509a-b888-1649-8d3c-c4150a3f43da
174KERN: entries block: 2047967
175KERN: entry size: 128
176KERN: entry count: 128
177KERN: entries CRC: 6facae30
178KERN: [ 0] partition type: c12a7328-f81f-11d2-ba4b-00a0c93ec93b
179KERN: unique id: cbf355f4-7e44-9844-9158-60fc603a6c82
180KERN: start block: 40
181KERN: end block: 102439
182KERN: size: 49.999 MB
183KERN: attributes: 0
184KERN: name: efi
185KERN: [ 1] partition type: 42465331-3ba3-10f1-802a-4861696b7521
186KERN: unique id: e4e596bc-c9fe-3942-ad32-776db4408f61
187KERN: start block: 102440
188KERN: end block: 2045991
189KERN: size: 948.999 MB
190KERN: attributes: 0
191KERN: name: Haiku
192KERN: returned: 0.959
193KERN: intel: pm_std_ops(0x1)
194KERN: trying: partitioning_systems/intel/map/v1
195KERN: intel: pm_identify_partition(0, 2: 0, 1563KERN: 1122432, 512)
196KERN: intel: Found GPT signature, ignoring.
197KERN: returned: -1
198KERN: intel: pm_std_ops(0x2)
199KERN: trying: file_systems/devfs/v1
200KERN: returned: -1
201KERN: trying: file_systems/rootfs/v1
202KERN: returned: -1
203KERN: trying: file_systems/packagefs/v1
204KERN: returned: -1
205KERN: trying: file_systems/bfs/v1
206KERN: returned: -1
207KERN: scanning with: partitioning_systems/efi_gpt/v1
208KERN: efi_gpt_scan_partition(cookie = 0xffffffff8280ec40)
209KERN: KDiskDeviceManager::_ScanPartition(/dev/disk/usb/0/0/0)
210KERN: intel: ep_std_ops(0x1)
211KERN: trying: partitioning_systems/intel/extended/v1
212KERN: returned: -1
213KERN: intel: ep_std_ops(0x2)
214KERN: trying: partitioning_systems/efi_gpt/v1
215KERN: returned: -1
216KERN: intel: pm_std_ops(0x1)
217KERN: trying: partitioning_systems/intel/map/v1
218KERN: intel: pm_identify_partition(0, 7: 20480, 52428800, 512)
219KERN: returned: -1
220KERN: intel: pm_std_ops(0x2)
221KERN: trying: file_systems/devfs/v1
222KERN: returned: -1
223KERN: trying: file_systems/rootfs/v1
224KERN: returned: -1
225KERN: trying: file_systems/packagefs/v1
226KERN: returned: -1
227KERN: trying: file_systems/bfs/v1
228KERN: returned: -1
229KERN: KDiskDeviceManager::_ScanPartition(/dev/disk/usb/0/0/1)
230KERN: intel: ep_std_ops(0x1)
231KERN: trying: partitioning_systems/intel/extended/v1
232KERN: intel: ep_identify_partition(0, 52449280, 995098624, 512)
233KERN: returned: -1
234KERN: intel: ep_std_ops(0x2)
235KERN: trying: partitioning_systems/efi_gpt/v1
236KERN: returned: -1
237KERN: intel: pm_std_ops(0x1)
238KERN: trying: partitioning_systems/intel/map/v1
239KERN: intel: pm_identify_partition(0, 8: 52449280, 995098624, 512)
240KERN: returned: -1
241KERN: intel: pm_std_ops(0x2)
242KERN: trying: file_systems/devfs/v1
243KERN: returned: -1
244KERN: trying: file_systems/rootfs/v1
245KERN: returned: -1
246KERN: trying: file_systems/packagefs/v1
247KERN: returned: -1
248KERN: trying: file_systems/bfs/v1
249KERN: returned: 0.8
250KERN: scanning with: file_systems/bfs/v1
251KERN: device 0: /dev/disk/scsi/0/0/0/raw
252KERN: media status: No error
253KERN: device flags: 2
254KERN: offset: 0
255KERN: size: 500107862016 (476940.23 MB)
256KERN: content size: 500107862016
257KERN: block size: 512
258KERN: child count: 4
259KERN: index: -1
260KERN: status: 0
261KERN: flags: 5
262KERN: volume: -1
263KERN: disk system: partitioning_systems/efi_gpt/v1
264KERN: name: ST500LM0 12 HN-M500MBB
265KERN: content name: <NULL>
266KERN: type: <NULL>
267KERN: content type: GUID Partition Map
268KERN: params: <NULL>
269KERN: content params: <NULL>
270KERN: partition 3: /dev/disk/scsi/0/0/0/0
271KERN: offset: 1048576
272KERN: size: 163577856 (156 MB)
273KERN: content size: 0
274KERN: block size: 512
275KERN: child count: 0
276KERN: index: 0
277KERN: status: 2
278KERN: flags: 0
279KERN: volume: -1
280KERN: disk system: <NULL>
281KERN: name: primary
282KERN: content name: <NULL>
283KERN: type: EFI system data
284KERN: content type: <NULL>
285KERN: params: <NULL>
286KERN: content params: <NULL>
287KERN: partition 4: /dev/disk/scsi/0/0/0/1
288KERN: offset: 164626432
289KERN: size: 5905580032 (5632 MB)
290KERN: content size: 0
291KERN: block size: 512
292KERN: child count: 0
293KERN: index: 1
294KERN: status: 2
295KERN: flags: 0
296KERN: volume: -1
297KERN: disk system: <NULL>
298KERN: name: primary
299KERN: content name: <NULL>
300KERN: type: Linux data
301KERN: content type: <NULL>
302KERN: params: <NULL>
303KERN: content params: <NULL>
304KERN: partition 5: /dev/disk/scsi/0/0/0/2
305KERN: offset: 6070206464
306KERN: size: 42952818688 (40963 MB)
307KERN: content size: 0
308KERN: block size: 512
309KERN: child count: 0
310KERN: index: 2
311KERN: status: 2
312KERN: flags: 0
313KERN: volume: -1
314KERN: disk system: <NULL>
315KERN: name: primary
316KERN: content name: <NULL>
317KERN: type: Linux data
318KERN: content type: <NULL>
319KERN: params: <NULL>
320KERN: content params: <NULL>
321KERN: partition 6: /dev/disk/scsi/0/0/0/3
322KERN: offset: 49023025152
323KERN: size: 451084812288 (430188 MB)
324KERN: content size: 0
325KERN: block size: 512
326KERN: child count: 0
327KERN: index: 3
328KERN: status: 2
329KERN: flags: 0
330KERN: volume: -1
331KERN: disk system: <NULL>
332KERN: name: primary
333KERN: content name: <NULL>
334KERN: type: Linux data
335KERN: content type: <NULL>
336KERN: params: <NULL>
337KERN: content params: <NULL>
338KERN: device 1: /dev/disk/scsi/0/2/0/raw
339KERN: media status: No media present
340KERN: device flags: 5
341KERN: device 2: /dev/disk/usb/0/0/raw
342KERN: media status: No error
343KERN: device flags: 3
344KERN: offset: 0
345KERN: size: 15631122432 (14907 MB)
346KERN: content size: 15631122432
347KERN: block size: 512
348KERN: child count: 2
349KERN: index: -1
350KERN: status: 0
351KERN: flags: 5
352KERN: volume: -1
353KERN: disk system: partitioning_systems/efi_gpt/v1
354KERN: name: SanDisk Cruzer Edge 1.27
355KERN: content name: <NULL>
356KERN: type: <NULL>
357KERN: content type: GUID Partition Map
358KERN: params: <NULL>
359KERN: content params: <NULL>
360KERN: partition 7: /dev/disk/usb/0/0/0
361KERN: offset: 20480
362KERN: size: 52428800 (50 MB)
363KERN: content size: 0
364KERN: block size: 512
365KERN: child count: 0
366KERN: index: 0
367KERN: status: 2
368KERN: flags: 0
369KERN: volume: -1
370KERN: disk system: <NULL>
371KERN: name: efi
372KERN: content name: <NULL>
373KERN: type: EFI system data
374KERN: content type: <NULL>
375KERN: params: <NULL>
376KERN: content params: <NULL>
377KERN: partition 8: /dev/disk/usb/0/0/1
378KERN: offset: 52449280
379KERN: size: 995098624 (949 MB)
380KERN: content size: 995098624
381KERN: block size: 2048
382KERN: child count: 0
383KERN: index: 1
384KERN: status: 0
385KERN: flags: 2
386KERN: volume: -1
387KERN: disk system: file_systems/bfs/v1
388KERN: name: Haiku
389KERN: content name: Haiku
390KERN: type: Be File System
391KERN: content type: Be File System
392KERN: params: <NULL>
393KERN: content params: <NULL>
394KERN: Identified boot partition by partition offset.
395KERN: slab memory manager: created area 0xffffffff9e001000 (674)
396KERN: bfs: mounted "Haiku" (root node at 131072, device = /dev/disk/usb/0/0/1)
397KERN: Mounted boot partition: /dev/disk/usb/0/0/1
398KERN: packagefs [8686927: 16] Adding packages from "/boot/system/packages"
399KERN: slab memory manager: created area 0xffffffff9e801000 (746)
400KERN: slab memory manager: created area 0xffffffff9f001000 (984)
401KERN: packagefs [10296353: 16] StringPool usage:
402KERN: packagefs [10296485: 16] total unique strings: 23355, 286587 bytes, overhead: 537165 bytes
403KERN: packagefs [10296765: 16] total strings with dups: 108113, 1146645 bytes
404KERN: packagefs [10296983: 16] unshared strings: 960
405KERN: packagefs [10297156: 16] bytes saved: 322893
406KERN: packagefs [10307829: 16] Adding packages from "/boot/home/config/packages"
407KERN: packagefs [10310365: 16] Failed to open packages activation file: No such file or directory
408KERN: packagefs [10310627: 16] Loading packages from activation file failed. Loading all packages in packages directory.
409KERN: packagefs [10318620: 16] StringPool usage:
410KERN: packagefs [10318765: 16] total unique strings: 23355, 286587 bytes, overhead: 537165 bytes
411KERN: packagefs [10319051: 16] total strings with dups: 108124, 1146710 bytes
412KERN: packagefs [10319266: 16] unshared strings: 957
413KERN: packagefs [10319438: 16] bytes saved: 322958
414KERN: module: Search for file_cache/launch_speedup/v1 failed.
415KERN: partitioning system: partitioning_systems/session/v1
416KERN: KDiskDeviceManager::_AddDiskSystem(partitioning_systems/session/v1)
417KERN: KDiskDeviceManager::_AddDiskSystem() done: No error
418KERN: file system: file_systems/nfs/v1
419KERN: KDiskDeviceManager::_AddDiskSystem(file_systems/nfs/v1)
420KERN: KDiskDeviceManager::_AddDiskSystem() done: No error
421KERN: file system: file_systems/bindfs/v1
422KERN: KDiskDeviceManager::_AddDiskSystem(file_systems/bindfs/v1)
423KERN: KDiskDeviceManager::_AddDiskSystem() done: No error
424KERN: file system: file_systems/cdda/v1
425KERN: KDiskDeviceManager::_AddDiskSystem(file_systems/cdda/v1)
426KERN: KDiskDeviceManager::_AddDiskSystem() done: No error
427KERN: file system: file_systems/exfat/v1
428KERN: KDiskDeviceManager::_AddDiskSystem(file_systems/exfat/v1)
429KERN: KDiskKERN: DeviceManager::_AddDiskSystem() done: No error
430KERN: file system: file_systems/nfs4/v1
431KERN: KDiskDeviceManager::_AddDiskSystem(file_systems/nfs4/v1)
432KERN: KDiskDeviceManager::_AddDiskSystem() done: No error
433KERN: file system: file_systems/log_overlay/v1
434KERN: KDiskDeviceManager::_AddDiskSystem(file_systems/log_overlay/v1)
435KERN: KDiskDeviceManager::_AddDiskSystem() done: No error
436KERN: file system: file_systems/ntfs/v1
437KERN: KDiskDeviceManager::_AddDiskSystem(file_systems/ntfs/v1)
438KERN: KDiskDeviceManager::_AddDiskSystem() done: No error
439KERN: file system: file_systems/fat/v1
440KERN: KDiskDeviceManager::_AddDiskSystem(file_systems/fat/v1)
441KERN: dos_std_ops()
442Last message repeated 1 time
443KERN: KDiskDeviceManager::_AddDiskSystem() done: No error
444KERN: file system: file_systems/btrfs/v1
445KERN: KDiskDeviceManager::_AddDiskSystem(file_systems/btrfs/v1)
446KERN: KDiskDeviceManager::_AddDiskSystem() done: No error
447KERN: file system: file_systems/iso9660/v1
448KERN: KDiskDeviceManager::_AddDiskSystem(file_systems/iso9660/v1)
449KERN: KDiskDeviceManager::_AddDiskSystem() done: No error
450KERN: file system: file_systems/ext2/v1
451KERN: KDiskDeviceManager::_AddDiskSystem(file_systems/ext2/v1)
452KERN: KDiskDeviceManager::_AddDiskSystem() done: No error
453KERN: file system: file_systems/udf/v1
454KERN: KDiskDeviceManager::_AddDiskSystem(file_systems/udf/v1)
455KERN: KDiskDeviceManager::_AddDiskSystem() done: No error
456KERN: file system: file_systems/write_overlay/v1
457KERN: KDiskDeviceManager::_AddDiskSystem(file_systems/write_overlay/v1)
458KERN: KDiskDeviceManager::_AddDiskSystem() done: No error
459KERN: file system: file_systems/attribute_overlay/v1
460KERN: KDiskDeviceManager::_AddDiskSystem(file_systems/attribute_overlay/v1)
461KERN: KDiskDeviceManager::_AddDiskSystem() done: No error
462KERN: KDiskDeviceManager::_ScanPartition(/dev/disk/scsi/0/0/0/0)
463KERN: trying: partitioning_systems/session/v1
464KERN: publish device: node 0xffffffff9e8565b0, path disk/virtual/ram/control, module drivers/disk/virtual/ram_disk/control/device_v1
465KERN: usb_modeswitch: init_hardware()
466KERN: usb_modeswitch: init_driver()
467KERN: usb_modeswitch: trying module bus_managers/usb/v3
468KERN: usb_modeswitch: publish_devices()
469KERN: usb_modeswitch: uninit_driver()
470KERN: loaded driver /boot/system/add-ons/kernel/drivers/dev/usb_modeswitch
471KERN: loaded driver /boot/system/add-ons/kernel/drivers/dev/tty
472KERN: loaded driver /boot/system/add-ons/kernel/drivers/dev/null
473KERN: con_init: trying module console/frame_buffer/v1
474KERN: loaded driver /boot/system/add-ons/kernel/drivers/dev/console
475KERN: loaded driver /boot/system/add-ons/kernel/drivers/dev/zero
476KERN: loaded driver /boot/system/add-ons/kernel/drivers/dev/dprintf
477KERN: module: Search for bus_managers/ide/controller/driver_v1 failed.
478KERN: loading dependent module bus_managers/ide/controller/driver_v1 of busses/ata/silicon_image_3112/driver_v1 failed!
479KERN: module: Search for bus_managers/ide/controller/driver_v1 failed.
480KERN: loading dependent module bus_managers/ide/controller/driver_v1 of busses/ata/legacy_sata/driver_v1 failed!
481KERN: module: Search for bus_managers/ide/controller/driver_v1 failed.
482KERN: loading dependent module bus_managers/ide/controller/driver_v1 of busses/ata/generic_ide_pci/driver_v1 failed!
483KERN: module: Search for bus_managers/ide/controller/driver_v1 failed.
484KERN: loading dependent module bus_managers/ide/controller/driver_v1 of generic/ata_adapter/v1 failed!
485KERN: loading dependent module generic/ata_adapter/v1 of busses/ata/it8211/driver_v1 failed!
486KERN: module: Search for bus_managers/ide/controller/driver_v1 failed.
487KERN: loading dependent module bus_managers/ide/controller/driver_v1 of busses/ata/silicon_image_3112/driver_v1 failed!
488KERN: module: Search for bus_managers/ide/controller/driver_v1 failed.
489KERN: loading dependent module bus_managers/ide/controller/driver_v1 of busses/ata/legacy_sata/driver_v1 failed!
490KERN: module: Search for bus_managers/ide/controller/driver_v1 failed.
491KERN: loading dependent module bus_managers/ide/controller/driver_v1 of busses/ata/generic_ide_pci/driver_v1 failed!
492KERN: module: Search for bus_managers/ide/controller/driver_v1 failed.
493KERN: loading dependent module bus_managers/ide/controller/driver_v1 of generic/ata_adapter/v1 failed!
494KERN: loading dependent module generic/ata_adapter/v1 of busses/ata/it8211/driver_v1 failed!
495KERN: module: Search for bus_managers/ide/controller/driver_v1 failed.
496KERN: loading dependent module bus_managers/ide/controller/driver_v1 of busses/ata/silicon_image_3112/driver_v1 failed!
497KERN: module: Search for bus_managers/ide/controller/driver_v1 failed.
498KERN: loading dependent module bus_managers/ide/controller/driver_v1 of busses/ata/legacy_sata/driver_v1 failed!
499KERN: module: Search for bus_managers/ide/controller/driver_v1 failed.
500KERN: loading dependent module bus_managers/ide/controller/driver_v1 of busses/ata/generic_ide_pci/driver_v1 failed!
501KERN: module: Search for bus_managers/ide/controller/driver_v1 failed.
502KERN: loading dependent module bus_managers/ide/controller/driver_v1 of generic/ata_adapter/v1 failed!
503KERN: loading dependent module generic/ata_adapter/v1 of busses/ata/it8211/driver_v1 failed!
504KERN: returned: -1
505KERN: trying: file_systems/nfs/v1
506KERN: returned: -1
507KERN: trying: file_systems/bindfs/v1
508KERN: returned: -1
509KERN: trying: file_systems/cdda/v1
510KERN: raw_command:
511KERN: ahci: AHCIPort::ScsiExecuteRequest port 0 unsupported request opcode 0x43
512KERN: returned: -1
513KERN: trying: file_systems/exfat/v1
514KERN: [34mexfat:[0m invalid superblock!
515KERN: returned: -1
516KERN: trying: file_systems/nfs4/v1
517KERN: returned: -1
518KERN: trying: file_systems/log_overlay/v1
519KERN: returned: -1
520KERN: trying: file_systems/ntfs/v1
521KERN: fs_identify_partition: boot signature NTFS doesn't match
522KERN: returned: -1
523KERN: dos_std_ops()
524KERN: trying: file_systems/fat/v1
525KERN: returned: 0.8
526KERN: trying: file_systems/btrfs/v1
527KERN: [34mbtrfs:[0m invalid superblock!
528KERN: returned: -1
529KERN: trying: file_systems/iso9660/v1
530KERN: identify(7, 0xffffffff9e808398)
531KERN: returned: -1
532KERN: trying: file_systems/ext2/v1
533KERN: [34mext2:[0m invalid superblock!
534KERN: returned: -1
535KERN: trying: file_systems/udf/v1
536KERN: read_pos(pos:536879104, len:512) failed with: 0xffffffffffffffff
537KERN: udf_recognize: Invalid sequence. status = -1
538KERN: returned: -1
539KERN: trying: file_systems/write_overlay/v1
540KERN: returned: -1
541KERN: trying: file_systems/attribute_overlay/v1
542KERN: returned: -1
543KERN: scanning with: file_systems/fat/v1
544KERN: KDiskDeviceManager::_ScanPartition(/dev/disk/scsi/0/0/0/1)
545KERN: trying: partitioning_systems/session/v1
546KERN: returned: -1
547KERN: trying: file_systems/nfs/v1
548KERN: returned: -1
549KERN: trying: file_systems/bindfs/v1
550KERN: returned: -1
551KERN: trying: file_systems/cdda/v1
552KERN: raw_command:
553KERN: ahci: AHCIPort::ScsiExecuteRequest port 0 unsupported request opcode 0x43
554KERN: returned: -1
555KERN: trying: file_systems/exfat/v1
556KERN: [34mexfat:[0m invalid superblock!
557KERN: returned: -1
558KERN: trying: file_systems/nfs4/v1
559KERN: returned: -1
560KERN: trying: file_systems/log_overlay/v1
561KERN: returned: -1
562KERN: trying: file_systems/ntfs/v1
563KERN: fs_identify_partition: boot signature NTFS doesn't match
564KERN: returned: -1
565KERN: trying: file_systems/fat/v1
566KERN: returned: -1
567KERN: trying: file_systems/btrfs/v1
568KERN: [34mbtrfs:[0m invalid superblock!
569KERN: returned: -1
570KERN: trying: file_systems/iso9660/v1
571KERN: identify(7, 0xffffffff9e808398)
572KERN: returned: -1
573KERN: trying: file_systems/ext2/v1
574KERN: [34mext2:[0m invalid superblock!
575KERN: returned: -1
576KERN: trying: file_systems/udf/v1
577KERN: read_pos(pos:84288741376, len:512) failed with: 0xffffffffffffffff
578KERN: udf_recognize: Invalid sequence. status = -1
579KERN: returned: -1
580KERN: trying: file_systems/write_overlay/v1
581KERN: returned: -1
582KERN: trying: file_systems/attribute_overlay/v1
583KERN: returned: -1
584KERN: KDiskDeviceManager::_ScanPartition(/dev/disk/scsi/0/0/0/2)
585KERN: trying: partitioning_systems/session/v1
586KERN: returned: -1
587KERN: trying: file_systems/nfs/v1
588KERN: returned: -1
589KERN: trying: file_systems/bindfs/v1
590KERN: returned: -1
591KERN: trying: file_systems/cdda/v1
592KERN: raw_command:
593KERN: ahci: AHCIPort::ScsiExecuteRequest port 0 unsupported request opcode 0x43
594KERN: returned: -1
595KERN: trying: file_systems/exfat/v1
596KERN: [34mexfat:[0m invalid superblock!
597KERN: returned: -1
598KERN: trying: file_systems/nfs4/v1
599KERN: returned: -1
600KERN: trying: file_systems/log_overlay/v1
601KERN: returned: -1
602KERN: trying: file_systems/ntfs/v1
603KERN: fs_identify_partition: boot signature NTFS doesn't match
604KERN: returned: -1
605KERN: trying: file_systems/fat/v1
606KERN: returned: -1
607KERN: trying: file_systems/btrfs/v1
608KERN: returned: 0.8
609KERN: trying: file_systems/iso9660/v1
610KERN: identify(7, 0xffffffff9e808380)
611KERN: returned: -1
612KERN: trying: file_systems/ext2/v1
613KERN: [34mext2:[0m invalid superblock!
614KERN: returned: -1
615KERN: trying: file_systems/udf/v1
616KERN: read_pos(pos:3107945717760, len:512) failed with: 0xffffffffffffffff
617KERN: udf_recognize: Invalid sequence. status = -1
618KERN: returned: -1
619KERN: trying: file_systems/write_overlay/v1
620KERN: returned: -1
621KERN: KERN: trying: file_systems/attribute_overlay/v1
622KERN: returned: -1
623KERN: scanning with: file_systems/btrfs/v1
624KERN: KDiskDeviceManager::_ScanPartition(/dev/disk/scsi/0/0/0/3)
625KERN: trying: partitioning_systems/session/v1
626KERN: returned: -1
627KERN: trying: file_systems/nfs/v1
628KERN: returned: -1
629KERN: trying: file_systems/bindfs/v1
630KERN: returned: -1
631KERN: trying: file_systems/cdda/v1
632KERN: raw_command:
633KERN: ahci: AHCIPort::ScsiExecuteRequest port 0 unsupported request opcode 0x43
634KERN: returned: -1
635KERN: trying: file_systems/exfat/v1
636KERN: [34mexfat:[0m invalid superblock!
637KERN: returned: -1
638KERN: trying: file_systems/nfs4/v1
639KERN: returned: -1
640KERN: trying: file_systems/log_overlay/v1
641KERN: returned: -1
642KERN: trying: file_systems/ntfs/v1
643KERN: fs_identify_partition: boot signature NTFS doesn't match
644KERN: returned: -1
645KERN: trying: file_systems/fat/v1
646KERN: returned: -1
647KERN: trying: file_systems/btrfs/v1
648KERN: [34mbtrfs:[0m invalid superblock!
649KERN: returned: -1
650KERN: trying: file_systems/iso9660/v1
651KERN: identify(7, 0xffffffff9e808398)
652KERN: returned: -1
653KERN: trying: file_systems/ext2/v1
654KERN: [34mext2:[0m invalid superblock!
655KERN: returned: -1
656KERN: trying: file_systems/udf/v1
657KERN: read_pos(pos:25099788886016, len:512) failed with: 0xffffffffffffffff
658KERN: udf_recognize: Invalid sequence. status = -1
659KERN: returned: -1
660KERN: trying: file_systems/write_overlay/v1
661KERN: returned: -1
662KERN: trying: file_systems/attribute_overlay/v1
663KERN: returned: -1
664KERN: KDiskDeviceManager::_ScanPartition(/dev/disk/usb/0/0/0)
665KERN: trying: partitioning_systems/session/v1
666KERN: loaded driver /boot/system/add-ons/kernel/drivers/dev/disk/usb/usb_floppy
667KERN: loaded driver /boot/system/add-ons/kernel/drivers/dev/disk/usb/usb_disk
668KERN: returned: -1
669KERN: trying: file_systems/nfs/v1
670KERN: returned: -1
671KERN: trying: file_systems/bindfs/v1
672KERN: returned: -1
673KERN: trying: file_systems/cdda/v1
674KERN: usb_disk: unhandled ioctl 10102
675KERN: returned: -1
676KERN: trying: file_systems/exfat/v1
677KERN: [34mexfat:[0m invalid superblock!
678KERN: returned: -1
679KERN: trying: file_systems/nfs4/v1
680KERN: returned: -1
681KERN: trying: file_systems/log_overlay/v1
682KERN: returned: -1
683KERN: trying: file_systems/ntfs/v1
684KERN: fs_identify_partition: boot signature NTFS doesn't match
685KERN: returned: -1
686KERN: trying: file_systems/fat/v1
687KERN: returned: 0.8
688KERN: trying: file_systems/btrfs/v1
689KERN: [34mbtrfs:[0m invalid superblock!
690KERN: returned: -1
691KERN: trying: file_systems/iso9660/v1
692KERN: identify(7, 0xffffffff9e808398)
693KERN: returned: -1
694KERN: trying: file_systems/ext2/v1
695KERN: [34mext2:[0m invalid superblock!
696KERN: returned: -1
697KERN: trying: file_systems/udf/v1
698KERN: udf_recognize: Invalid sequence. status = -1
699KERN: returned: -1
700KERN: trying: file_systems/write_overlay/v1
701KERN: returned: -1
702KERN: trying: file_systems/attribute_overlay/v1
703KERN: returned: -1
704KERN: scanning with: file_systems/fat/v1
705KERN: KDiskDeviceManager::_Scan(/dev/disk)
706KERN: KDiskDeviceManager::_Scan(/dev/disk/scsi)
707KERN: KDiskDeviceManager::_Scan(/dev/disk/scsi/0)
708KERN: KDiskDeviceManager::_Scan(/dev/disk/scsi/0/0)
709KERN: KDiskDeviceManager::_Scan(/dev/disk/scsi/0/0/0)
710KERN: KDiskDeviceManager::_Scan(/dev/disk/scsi/0/0/0/0)
711KERN: KDiskDeviceManager::_Scan(/dev/disk/scsi/0/0/0/1)
712KERN: KDiskDeviceManager::_Scan(/dev/disk/scsi/0/0/0/2)
713KERN: KDiskDeviceManager::_Scan(/dev/disk/scsi/0/0/0/3)
714KERN: KDiskDeviceManager::_Scan(/dev/disk/scsi/0/0/0/raw)
715KERN: KDiskDeviceManager::_Scan(/dev/disk/scsi/0/2)
716KERN: KDiskDeviceManager::_Scan(/dev/disk/scsi/0/2/0)
717KERN: KDiskDeviceManager::_Scan(/dev/disk/scsi/0/2/0/raw)
718KERN: KDiskDeviceManager::_Scan(/dev/disk/usb)
719KERN: KDiskDeviceManager::_Scan(/dev/disk/usb/0)
720KERN: KDiskDeviceManager::_Scan(/dev/disk/usb/0/0)
721KERN: KDiskDeviceManager::_Scan(/dev/disk/usb/0/0/0)
722KERN: KDiskDeviceManager::_Scan(/dev/disk/usb/0/0/1)
723KERN: KDiskDeviceManager::_Scan(/dev/disk/usb/0/0/raw)
724KERN: KDiskDeviceManager::_Scan(/dev/disk/virtual)
725KERN: KDiskDeviceManager::_Scan(/dev/disk/virtual/ram)
726KERN: KDiskDeviceManager::_Scan(/dev/disk/virtual/ram/control)
727KERN: KDiskDeviceManager::_ScanPartition(/dev/disk/scsi/0/0/0/0)
728KERN: intel: ep_std_ops(0x1)
729KERN: trying: partitioning_systems/intel/extended/v1
730KERN: returned: -1
731KERN: intel: ep_std_ops(0x2)
732KERN: trying: partitioning_systems/efi_gpt/v1
733KERN: returned: -1
734KERN: intel: pm_std_ops(0x1)
735KERN: trying: partitioning_systems/intel/map/v1
736KERN: intel: pm_identify_partition(7, 3: 1048576, 163577856, 512)
737KERN: returned: -1
738KERN: intel: pm_std_ops(0x2)
739KERN: trying: file_systems/devfs/v1
740KERN: returned: -1
741KERN: trying: file_systems/rootfs/v1
742KERN: returned: -1
743KERN: trying: file_systems/packagefs/v1
744KERN: returned: -1
745KERN: trying: file_systems/bfs/v1
746KERN: returned: -1
747KERN: trying: partitioning_systems/session/v1
748KERN: returned: -1
749KERN: trying: file_systems/nfs/v1
750KERN: returned: -1
751KERN: trying: file_systems/bindfs/v1
752KERN: returned: -1
753KERN: trying: file_systems/cdda/v1
754KERN: raw_command:
755KERN: ahci: AHCIPort::ScsiExecuteRequest port 0 unsupported request opcode 0x43
756KERN: returned: -1
757KERN: trying: file_systems/exfat/v1
758KERN: [34mexfat:[0m invalid superblock!
759KERN: returned: -1
760KERN: trying: file_systems/nfs4/v1
761KERN: returned: -1
762KERN: trying: file_systems/log_overlay/v1
763KERN: returned: -1
764KERN: trying: file_systems/ntfs/v1
765KERN: fs_identify_partition: boot signature NTFS doesn't match
766KERN: returned: -1
767KERN: trying: file_systems/fat/v1
768KERN: returned: 0.8
769KERN: trying: file_systems/btrfs/v1
770KERN: [34mbtrfs:[0m invalid superblock!
771KERN: returned: -1
772KERN: trying: file_systems/iso9660/v1
773KERN: identify(7, 0xffffffff9e808380)
774KERN: returned: -1
775KERN: trying: file_systems/ext2/v1
776KERN: [34mext2:[0m invalid superblock!
777KERN: returned: -1
778KERN: trying: file_systems/udf/v1
779KERN: read_pos(pos:536879104, len:512) failed with: 0xffffffffffffffff
780KERN: udf_recognize: Invalid sequence. status = -1
781KERN: returned: -1
782KERN: trying: file_systems/write_overlay/v1
783KERN: returned: -1
784KERN: trying: file_systems/attribute_overlay/v1
785KERN: returned: -1
786KERN: KDiskDeviceManager::_ScanPartition(/dev/disk/scsi/0/0/0/1)
787KERN: intel: ep_std_ops(0x1)
788KERN: trying: partitioning_systems/intel/extended/v1
789KERN: intel: ep_identify_partition(7, 164626432, 5905580032, 512)
790KERN: returned: -1
791KERN: intel: ep_std_ops(0x2)
792KERN: trying: partitioning_systems/efi_gpt/v1
793KERN: returned: -1
794KERN: intel: pm_std_ops(0x1)
795KERN: trying: partitioning_systems/intel/map/v1
796KERN: intel: pm_identify_partition(7, 4: 164626432, 5905580032, 512)
797KERN: returned: -1
798KERN: intel: pm_std_ops(0x2)
799KERN: trying: file_systems/devfs/v1
800KERN: returned: -1
801KERN: trying: file_systems/rootfs/v1
802KERN: returned: -1
803KERN: trying: file_systems/packagefs/v1
804KERN: returned: -1
805KERN: trying: file_systems/bfs/v1
806KERN: returned: -1
807KERN: trying: partitioning_systems/session/v1
808KERN: returned: -1
809KERN: trying: file_systems/nfs/v1
810KERN: returned: -1
811KERN: trying: file_systems/bindfs/v1
812KERN: returned: -1
813KERN: trying: file_systems/cdda/v1
814KERN: raw_command:
815KERN: ahci: AHCIPort::ScsiExecuteRequest port 0 unsupported request opcode 0x43
816KERN: returned: -1
817KERN: trying: file_systems/exfat/v1
818KERN: [34mexfat:[0m invalid superblock!
819KERN: returned: -1
820KERN: trying: file_systems/nfs4/v1
821KERN: returned: -1
822KERN: trying: file_systems/log_overlay/v1
823KERN: returned: -1
824KERN: trying: file_systems/ntfs/v1
825KERN: fs_identify_partition: boot signature NTFS doesn't match
826KERN: returned: -1
827KERN: trying: file_systems/fat/v1
828KERN: returned: -1
829KERN: trying: file_systems/btrfs/v1
830KERN: [34mbtrfs:[0m invalid superblock!
831KERN: returned: -1
832KERN: trying: file_systems/iso9660/v1
833KERN: identify(7, 0xffffffff9e808278)
834KERN: returned: -1
835KERN: trying: file_systems/ext2/v1
836KERN: [34mext2:[0m invalid superblock!
837KERN: returned: -1
838KERN: trying: file_systems/udf/v1
839KERN: read_pos(pos:84288741376, len:512) failed with: 0xffffffffffffffff
840KERN: udf_recognize: Invalid sequence. status = -1
841KERN: returned: -1
842KERN: trying: file_systems/write_overlay/v1
843KERN: returned: -1
844KERN: trying: file_systems/attribute_overlay/v1
845KERN: returned: -1
846KERN: KDiskDeviceManager::_ScanPartition(/dev/disk/scsi/0/0/0/2)
847KERN: intel: ep_std_ops(0x1)
848KERN: trying: partitioning_systems/intel/extended/v1
849KERN: intel: ep_identify_partition(7, 6070206464, 42952818688, 4096)
850KERN: returned: -1
851KERN: intel: ep_std_ops(0x2)
852KERN: trying: partitioning_systems/efi_gpt/v1
853KERN: returned: -1
854KERN: intel: pm_std_ops(0x1)
855KERN: trying: partitioning_systems/intel/map/v1
856KERN: intel: pm_identify_partition(7, 5: 6070206464, 42952818688, 4096)
857KERN: returned: -1
858KERN: intel: pm_std_ops(0x2)
859KERN: trying: file_systems/devfs/v1
860KERN: returned: -1
861KERN: trying: file_systems/rootfs/v1
862KERN: returned: -1
863KERN: trying: file_systems/packagefs/v1
864KERN: returned: -1
865KERN: trying: file_systems/bfs/v1
866KERN: returned: -1
867KERN: trying: partitioning_systems/session/v1
868KERN: returned: -1
869KERN: trying: file_systems/nfs/v1
870KERN: returned: -1
871KERN: trying: file_systems/bindfs/v1
872KERN: returned: -1
873KERN: trying: file_systems/cdda/v1
874KERN: raw_command:
875KERN: ahci: AHCIPort::ScsiExecuteRequest port 0 unsupported request opcode 0x43
876KERN: returned: -1
877KERN: trying: file_systems/exfat/v1
878KERN: [34mexfat:[0m invalid superblock!
879KERN: returned: -1
880KERN: trying: file_systems/nfs4/v1
881KERN: returned: -1
882KERN: trying: file_systemKERN: s/log_overlay/v1
883KERN: returned: -1
884KERN: trying: file_systems/ntfs/v1
885KERN: fs_identify_partition: boot signature NTFS doesn't match
886KERN: returned: -1
887KERN: trying: file_systems/fat/v1
888KERN: returned: -1
889KERN: trying: file_systems/btrfs/v1
890KERN: returned: 0.8
891KERN: trying: file_systems/iso9660/v1
892KERN: identify(7, 0xffffffff9e808380)
893KERN: returned: -1
894KERN: trying: file_systems/ext2/v1
895KERN: [34mext2:[0m invalid superblock!
896KERN: returned: -1
897KERN: trying: file_systems/udf/v1
898KERN: read_pos(pos:24863565742080, len:4096) failed with: 0xffffffffffffffff
899KERN: udf_recognize: Invalid sequence. status = -1
900KERN: returned: -1
901KERN: trying: file_systems/write_overlay/v1
902KERN: returned: -1
903KERN: trying: file_systems/attribute_overlay/v1
904KERN: returned: -1
905KERN: KDiskDeviceManager::_ScanPartition(/dev/disk/scsi/0/0/0/3)
906KERN: intel: ep_std_ops(0x1)
907KERN: trying: partitioning_systems/intel/extended/v1
908KERN: intel: ep_identify_partition(7, 49023025152, 451084812288, 512)
909KERN: returned: -1
910KERN: intel: ep_std_ops(0x2)
911KERN: trying: partitioning_systems/efi_gpt/v1
912KERN: returned: -1
913KERN: intel: pm_std_ops(0x1)
914KERN: trying: partitioning_systems/intel/map/v1
915KERN: intel: pm_identify_partition(7, 6: 49023025152, 451084812288, 512)
916KERN: returned: -1
917KERN: intel: pm_std_ops(0x2)
918KERN: trying: file_systems/devfs/v1
919KERN: returned: -1
920KERN: trying: file_systems/rootfs/v1
921KERN: returned: -1
922KERN: trying: file_systems/packagefs/v1
923KERN: returned: -1
924KERN: trying: file_systems/bfs/v1
925KERN: returned: -1
926KERN: trying: partitioning_systems/session/v1
927KERN: returned: -1
928KERN: trying: file_systems/nfs/v1
929KERN: returned: -1
930KERN: trying: file_systems/bindfs/v1
931KERN: returned: -1
932KERN: trying: file_systems/cdda/v1
933KERN: raw_command:
934KERN: ahci: AHCIPort::ScsiExecuteRequest port 0 unsupported request opcode 0x43
935KERN: returned: -1
936KERN: trying: file_systems/exfat/v1
937KERN: [34mexfat:[0m invalid superblock!
938KERN: returned: -1
939KERN: trying: file_systems/nfs4/v1
940KERN: returned: -1
941KERN: trying: file_systems/log_overlay/v1
942KERN: returned: -1
943KERN: trying: file_systems/ntfs/v1
944KERN: fs_identify_partition: boot signature NTFS doesn't match
945KERN: returned: -1
946KERN: trying: file_systems/fat/v1
947KERN: returned: -1
948KERN: trying: file_systems/btrfs/v1
949KERN: [34mbtrfs:[0m invalid superblock!
950KERN: returned: -1
951KERN: trying: file_systems/iso9660/v1
952KERN: identify(7, 0xffffffff9e808278)
953KERN: returned: -1
954KERN: trying: file_systems/ext2/v1
955KERN: [34mext2:[0m invalid superblock!
956KERN: returned: -1
957KERN: trying: file_systems/udf/v1
958KERN: read_pos(pos:25099788886016, len:512) failed with: 0xffffffffffffffff
959KERN: udf_recognize: Invalid sequence. status = -1
960KERN: returned: -1
961KERN: trying: file_systems/write_overlay/v1
962KERN: returned: -1
963KERN: trying: file_systems/attribute_overlay/v1
964KERN: returned: -1
965KERN: KDiskDeviceManager::_ScanPartition(/dev/disk/usb/0/0/0)
966KERN: intel: ep_std_ops(0x1)
967KERN: trying: partitioning_systems/intel/extended/v1
968KERN: returned: -1
969KERN: intel: ep_std_ops(0x2)
970KERN: trying: partitioning_systems/efi_gpt/v1
971KERN: returned: -1
972KERN: intel: pm_std_ops(0x1)
973KERN: trying: partitioning_systems/intel/map/v1
974KERN: intel: pm_identify_partition(7, 7: 20480, 52428800, 512)
975KERN: returned: -1
976KERN: intel: pm_std_ops(0x2)
977KERN: trying: file_systems/devfs/v1
978KERN: returned: -1
979KERN: trying: file_systems/rootfs/v1
980KERN: returned: -1
981KERN: trying: file_systems/packagefs/v1
982KERN: returned: -1
983KERN: trying: file_systems/bfs/v1
984KERN: returned: -1
985KERN: trying: partitioning_systems/session/v1
986KERN: returned: -1
987KERN: trying: file_systems/nfs/v1
988KERN: returned: -1
989KERN: trying: file_systems/bindfs/v1
990KERN: returned: -1
991KERN: trying: file_systems/cdda/v1
992KERN: usb_disk: unhandled ioctl 10102
993KERN: returned: -1
994KERN: trying: file_systems/exfat/v1
995KERN: [34mexfat:[0m invalid superblock!
996KERN: returned: -1
997KERN: trying: file_systems/nfs4/v1
998KERN: returned: -1
999KERN: trying: file_systems/log_overlay/v1
1000KERN: returned: -1
1001KERN: trying: file_systems/ntfs/v1
1002KERN: fs_identify_partition: boot signature NTFS doesn't match
1003KERN: returned: -1
1004KERN: trying: file_systems/fat/v1
1005KERN: returned: 0.8
1006KERN: trying: file_systems/btrfs/v1
1007KERN: [34mbtrfs:[0m invalid superblock!
1008KERN: returned: -1
1009KERN: trying: file_systems/iso9660/v1
1010KERN: identify(7, 0xffffffff9e808380)
1011KERN: returned: -1
1012KERN: trying: file_systems/ext2/v1
1013KERN: [34mext2:[0m invalid superblock!
1014KERN: returned: -1
1015KERN: trying: file_systems/udf/v1
1016KERN: udf_recognize: Invalid sequence. status = -1
1017KERN: returned: -1
1018KERN: trying: file_systems/write_overlay/v1
1019KERN: returned: -1
1020KERN: trying: file_systems/attribute_overlay/v1
1021KERN: returned: -1
1022KERN: allocate_commpage_entry(4, 16) -> 0x0000000000000260
1023KERN: no valid cpufreq module found
1024KERN: no valid cpuidle module found
1025KERN: add_memory_type_range(-1, 0x100000, 0x8e1f3000, 6)
1026KERN: set MTRRs to:
1027KERN: mtrr: 0: base: 0x8e400000, size: 0x400000, type: 0
1028KERN: mtrr: 1: base: 0xa0000000, size: 0x20000000, type: 0
1029KERN: mtrr: 2: base: 0xc0000000, size: 0x40000000, type: 0
1030KERN: add_memory_type_range(-1, 0x8ed31000, 0x1000, 6)
1031KERN: set MTRRs to:
1032KERN: mtrr: 0: base: 0x8e400000, size: 0x400000, type: 0
1033KERN: mtrr: 1: base: 0xa0000000, size: 0x20000000, type: 0
1034KERN: mtrr: 2: base: 0xc0000000, size: 0x40000000, type: 0
1035KERN: add_memory_type_range(-1, 0x8ef35000, 0x6ef000, 6)
1036KERN: set MTRRs to:
1037KERN: mtrr: 0: base: 0x8e400000, size: 0x400000, type: 0
1038KERN: mtrr: 1: base: 0xa0000000, size: 0x20000000, type: 0
1039KERN: mtrr: 2: base: 0xc0000000, size: 0x40000000, type: 0
1040KERN: add_memory_type_range(-1, 0x8f7f3000, 0xd000, 6)
1041KERN: set MTRRs to:
1042KERN: mtrr: 0: base: 0x8e400000, size: 0x400000, type: 0
1043KERN: mtrr: 1: base: 0xa0000000, size: 0x20000000, type: 0
1044KERN: mtrr: 2: base: 0xc0000000, size: 0x40000000, type: 0
1045KERN: add_memory_type_range(-1, 0x100001000, 0xcefff000, 6)
1046KERN: set MTRRs to:
1047KERN: mtrr: 0: base: 0x8e400000, size: 0x400000, type: 0
1048KERN: mtrr: 1: base: 0xa0000000, size: 0x20000000, type: 0
1049KERN: mtrr: 2: base: 0xc0000000, size: 0x40000000, type: 0
1050KERN: kernel debugger extension "debugger/run_on_exit/v1": loaded
1051KERN: kernel debugger extension "debugger/invalidate_on_exit/v1": loaded
1052KERN: kernel debugger extension "debugger/hangman/v1": loaded
1053KERN: kernel debugger extension "debugger/usb_keyboard/v1": loaded
1054KERN: add_memory_type_range(85, 0xb0000000, 0x1000000, 1)
1055KERN: set MTRRs to:
1056KERN: mtrr: 0: base: 0x8e400000, size: 0x400000, type: 0
1057KERN: mtrr: 1: base: 0xc0000000, size: 0x40000000, type: 0
1058KERN: mtrr: 2: base: 0xa0000000, size: 0x20000000, type: 1
1059KERN: module: Search for bus_managers/ide/controller/driver_v1 failed.
1060KERN: publish device: node 0xffffffff9e856510, path random, module bus_managers/random/device_v1
1061KERN: publish device: node 0xffffffff9e856510, path urandom, module bus_managers/random/device_v1
1062KERN: module: Search for bus_managers/ide/controller/driver_v1 failed.
1063KERN: loading dependent module bus_managers/ide/controller/driver_v1 of busses/ata/silicon_image_3112/driver_v1 failed!
1064KERN: module: Search for bus_managers/ide/controller/driver_v1 failed.
1065KERN: loading dependent module bus_managers/ide/controller/driver_v1 of busses/ata/legacy_sata/driver_v1 failed!
1066KERN: module: Search for bus_managers/ide/controller/driver_v1 failed.
1067KERN: loading dependent module bus_managers/ide/controller/driver_v1 of busses/ata/generic_ide_pci/driver_v1 failed!
1068KERN: module: Search for bus_managers/ide/controller/driver_v1 failed.
1069KERN: loading dependent module bus_managers/ide/controller/driver_v1 of generic/ata_adapter/v1 failed!
1070KERN: loading dependent module generic/ata_adapter/v1 of busses/ata/it8211/driver_v1 failed!
1071KERN: module: Search for bus_managers/ide/controller/driver_v1 failed.
1072KERN: loading dependent module bus_managers/ide/controller/driver_v1 of busses/ata/silicon_image_3112/driver_v1 failed!
1073KERN: module: Search for bus_managers/ide/controller/driver_v1 failed.
1074KERN: loading dependent module bus_managers/ide/controller/driver_v1 of busses/ata/legacy_sata/driver_v1 failed!
1075KERN: module: Search for bus_managers/ide/controller/driver_v1 failed.
1076KERN: loading dependent module bus_managers/ide/controller/driver_v1 of busses/ata/generic_ide_pci/driver_v1 failed!
1077KERN: module: Search for bus_managers/ide/controller/driver_v1 failed.
1078KERN: loading dependent module bus_managers/ide/controller/driver_v1 of generic/ata_adapter/v1 failed!
1079KERN: loading dependent module generic/ata_adapter/v1 of busses/ata/it8211/driver_v1 failed!
1080KERN: publish device: node 0xffffffff9e86d290, path power/button/power, module drivers/power/acpi_button/device_v1
1081KERN: publish device: node 0xffffffff9e86d0b0, path power/acpi_battery/0, module drivers/power/acpi_battery/device_v1
1082KERN: publish device: node 0xffffffff9e871e78, path power/button/power_fixed, module drivers/power/acpi_button/device_v1
1083KERN: REG: Failed to open shadow passwd DB file "/etc/shadow": No such file or directory
1084KERN: register_domain(5, internet6)
1085KERN: unregister_domain(0xffffffff9eee8200, 5, internet6)
1086KERN: register_domain(1, internet)
1087KERN: unregister_domain(0xffffKERN: ffff9eee8180, 1, internet)
1088KERN: register_domain(9, unix)
1089KERN: unregister_domain(0xffffffff9eee8100, 9, unix)
1090KERN: register_domain(5, internet6)
1091KERN: unregister_domain(0xffffffff9eefab00, 5, internet6)
1092KERN: register_domain(5, internet6)
1093KERN: unregister_domain(0xffffffff9eefa980, 5, internet6)
1094KERN: register_domain(5, internet6)
1095KERN: unregister_domain(0xffffffff9eefa980, 5, internet6)
1096KERN: register_domain(4, link)
1097KERN: unregister_domain(0xffffffff9eee8380, 4, link)
1098KERN: slab memory manager: created area 0xffffffff9f801000 (3714)
1099KERN: register_domain(5, internet6)
1100KERN: unregister_domain(0xffffffff9eefa900, 5, internet6)
1101KERN: register_domain(1, internet)
1102KERN: unregister_domain(0xffffffff9eefa900, 1, internet)
1103KERN: register_domain(9, unix)
1104KERN: unregister_domain(0xffffffff9eefa900, 9, unix)
1105KERN: register_domain(5, internet6)
1106KERN: unregister_domain(0xffffffff9eefa900, 5, internet6)
1107KERN: register_domain(5, internet6)
1108KERN: unregister_domain(0xffffffff9eefa900, 5, internet6)
1109KERN: register_domain(5, internet6)
1110KERN: unregister_domain(0xffffffff9eefa900, 5, internet6)
1111KERN: register_domain(1, internet)
1112KERN: register_domain(5, internet6)
1113KERN: unregister_domain(0xffffffff9eee8380, 1, internet)
1114KERN: unregister_domain(0xffffffff9eefa880, 5, internet6)
1115KERN: register_domain(5, internet6)
1116KERN: unregister_domain(0xffffffff9eefa800, 5, internet6)
1117KERN: register_domain(1, internet)
1118KERN: unregister_domain(0xffffffff9eefa800, 1, internet)
1119KERN: package_daemon [12885297: 492] register_domain(9, unix)
1120KERN: root at "/boot" (device: 3, node: 131072) registered
1121KERN: unregister_domain(0xffffffff9eefa800, 9, unix)
1122KERN: package_daemon [12885646: 492] volume at "/boot/system" registered
1123KERN: package_daemon [12885984: 492] volume at "/boot/home/config" registered
1124KERN: register_domain(5, internet6)
1125KERN: unregister_domain(0xffffffff9eefa800, 5, internet6)
1126KERN: register_domain(5, internet6)
1127KERN: unregister_domain(0xffffffff9eefa800, 5, internet6)
1128KERN: register_domain(5, internet6)
1129KERN: unregister_domain(0xffffffff9eefa800, 5, internet6)
1130KERN: register_domain(1, internet)
1131KERN: unregister_domain(0xffffffff9eefa900, 1, internet)
1132KERN: register_domain(5, internet6)
1133KERN: unregister_domain(0xffffffff9eefa800, 5, internet6)
1134KERN: register_domain(1, internet)
1135KERN: unregister_domain(0xffffffff9eefa800, 1, internet)
1136KERN: register_domain(9, unix)
1137KERN: unregister_domain(0xffffffff9eefa800, 9, unix)
1138KERN: register_domain(5, internet6)
1139KERN: unregister_domain(0xffffffff9eefa800, 5, internet6)
1140KERN: register_domain(5, internet6)
1141KERN: unregister_domain(0xffffffff9eefa800, 5, internet6)
1142KERN: register_domain(5, internet6)
1143KERN: unregister_domain(0xffffffff9eefa800, 5, internet6)
1144KERN: register_domain(1, internet)
1145KERN: vesa: init_hardware()
1146KERN: register_domain(5, internet6)
1147KERN: Radeon - init_hardware: Version: 5.1.6.0
1148KERN: Radeon - Radeon_CardDetect: no supported devices found
1149KERN: devfs: "intel_810" api_version missing
1150KERN: i810: init_hardware() - no supported devices
1151KERN: framebuffer: init_hardware()
1152KERN: framebuffer: init_driver()
1153KERN: framebuffer: publish_devices()
1154KERN: framebuffer: find_device()
1155KERN: loaded driver /boot/system/add-ons/kernel/drivers/dev/graphics/framebuffer
1156KERN: intel_extreme: CALLED status_t init_hardware()
1157KERN: radeon_hd: init_hardware
1158KERN: radeon_hd: init_driver
1159KERN: radeon_hd: init_driver: GPU(0) Radeon HD 7920, revision = 0x0
1160KERN: radeon_hd: publish_devices
1161KERN: radeon_hd: find_device
1162KERN: loaded driver /boot/system/add-ons/kernel/drivers/dev/graphics/radeon_hd
1163KERN: add_memory_type_range(3908, 0xb0000000, 0x10000000, 0)
1164KERN: set MTRRs to:
1165KERN: mtrr: 0: base: 0x8e400000, size: 0x400000, type: 0
1166KERN: mtrr: 1: base: 0xb0000000, size: 0x10000000, type: 0
1167KERN: mtrr: 2: base: 0xc0000000, size: 0x40000000, type: 0
1168KERN: remove_memory_type_range(85, 0xb0000000, 0x1000000, 1)
1169KERN: set MTRRs to:
1170KERN: mtrr: 0: base: 0x8e400000, size: 0x400000, type: 0
1171KERN: mtrr: 1: base: 0xa0000000, size: 0x20000000, type: 0
1172KERN: mtrr: 2: base: 0xc0000000, size: 0x40000000, type: 0
1173KERN: add_memory_type_range(3908, 0xb0000000, 0x10000000, 1)
1174KERN: set MTRRs to:
1175KERN: mtrr: 0: base: 0x8e400000, size: 0x400000, type: 0
1176KERN: mtrr: 1: base: 0xc0000000, size: 0x40000000, type: 0
1177KERN: mtrr: 2: base: 0xa0000000, size: 0x20000000, type: 1
1178KERN: framebuffer: framebuffer_init() completed successfully!
1179KERN: framebuffer: acc: framebuffer.accelerant
1180KERN: loaded driver /boot/system/add-ons/kernel/drivers/dev/net/pegasus
1181KERN: Test: and [file_exists [/system/bin/FirstBootPrompt], or [not [file_exists [/boot/home/config/settings/Locale settings]], readonly ]] -> 0
1182KERN: app_server: Finding best mode for 1024x768 (8, 60 Hz, strict) failed
1183KERN: app_server: Finding best mode for 800x600 (8, 60 Hz) failed
1184KERN: app_server: Use 1800x795 (8) instead.
1185KERN: loaded driver /boot/system/add-ons/kernel/drivers/dev/net/usb_ecm
1186KERN: [33musb_asix:[0m00.13.144:init_driver::ver.0.10.1
1187KERN: loaded driver /boot/system/add-ons/kernel/drivers/dev/net/usb_asix
1188KERN: package_daemon [13178394: 514] Failed to open packages activation file: No such file or directory
1189KERN: package_daemon [13178686: 514] Failed to get activated packages info from activated packages file. Assuming all package files in package directory are activated.
1190KERN: package_daemon [13179183: 514] latest volume state:
1191KERN: package_daemon [13179336: 514] active package: "giflib-5.1.2-2-x86_64.hpkg"
1192KERN: package_daemon [13179549: 514] active package: "curl-7.52.1-1-x86_64.hpkg"
1193KERN: package_daemon [13179760: 514] active package: "xz_utils-5.2.2-2-x86_64.hpkg"
1194KERN: package_daemon [13179978: 514] active package: "sharutils-4.15.2-2-x86_64.hpkg"
1195KERN: package_daemon [13180201: 514] active package: "openssl-1.0.2j-1-x86_64.hpkg"
1196KERN: package_daemon [13180419: 514] active package: "m4-1.4.17-3-x86_64.hpkg"
1197KERN: package_daemon [13180625: 514] active package: "libmodplug-0.8.8.5-4-x86_64.hpkg"
1198KERN: package_daemon [13180852: 514] active package: "git-2.11.0-1-x86_64.hpkg"
1199KERN: package_daemon [13181057: 514] active package: "curl_devel-7.52.1-1-x86_64.hpkg"
1200KERN: package_daemon [13181283: 514] active package: "zip-3.0-3-x86_64.hpkg"
1201KERN: package_daemon [13181482: 514] active package: "speex-1.2~rc2-3-x86_64.hpkg"
1202KERN: package_daemon [13181697: 514] active package: "openssl_devel-1.0.2j-1-x86_64.hpkg"
1203KERN: package_daemon [13181934: 514] active package: "make-4.1-1-x86_64.hpkg"
1204KERN: package_daemon [13182135: 514] active package: "libogg-1.3.2-3-x86_64.hpkg"
1205KERN: package_daemon [13182347: 514] active package: "git_arch-2.11.0-1-x86_64.hpkg"
1206KERN: package_daemon [13182571: 514] active package: "cvsps-2.2b1-1-x86_64.hpkg"
1207KERN: package_daemon [13182783: 514] active package: "zlib-1.2.8-4-x86_64.hpkg"
1208KERN: package_daemon [13182990: 514] active package: "speex_devel-1.2~rc2-3-x86_64.hpkg"
1209KERN: package_daemon [13183224: 514] active package: "p7zip-9.20.1-6-x86_64.hpkg"
1210KERN: package_daemon [13183437: 514] active package: "libpcap-1.8.1-1-x86_64.hpkg"
1211KERN: package_daemon [13183654: 514] active package: "haiku-r1~alpha4_pm_hrev50876-1-x86_64.hpkg"
1212KERN: package_daemon [13183908: 514] active package: "git_cvs-2.11.0-1-x86_64.hpkg"
1213KERN: package_daemon [13184137: 514] active package: "diffutils-3.5-1-x86_64.hpkg"
1214KERN: package_daemon [13184353: 514] active package: "zlib_devel-1.2.8-4-x86_64.hpkg"
1215KERN: package_daemon [13184579: 514] active package: "sqlite-3.15.2.0-1-x86_64.hpkg"
1216KERN: package_daemon [13184803: 514] active package: "patch-2.7.5-1-x86_64.hpkg"
1217KERN: package_daemon [13185012: 514] active package: "man-1.6g-4-x86_64.hpkg"
1218KERN: package_daemon [13185213: 514] active package: "libpcre-8.39-2-x86_64.hpkg"
1219KERN: package_daemon [13185426: 514] active package: "haikuwebkit-1.5.3-1-x86_64.hpkg"
1220KERN: package_daemon [13185652: 514] active package: "git_daemon-2.11.0-1-x86_64.hpkg"
1221KERN: package_daemon [13185877: 514] active package: "makefile_engine-r1~alpha4_pm_hrev50876-1-any.hpkg"
1222KERN: package_daemon [13186154: 514] active package: "expat-2.2.0-2-x86_64.hpkg"
1223KERN: package_daemon [13186363: 514] active package: "autoconf-2.69-6-x86_64.hpkg"
1224KERN: package_daemon [13186579: 514] active package: "tar-1.29-2-x86_64.hpkg"
1225KERN: package_daemon [13186782: 514] active package: "mesa-13.0.2-1-x86_64.hpkg"
1226KERN: package_daemon [13186993: 514] active package: "libpng16-1.6.26-1-x86_64.hpkg"
1227KERN: package_daemon [13187214: 514] active package: "icu-57.1-1-x86_64.hpkg"
1228KERN: package_daemon [13187416: 514] active package: "haiku_loader-r1~alpha4_pm_hrev50876-1-x86_64.hpkg"
1229KERN: package_daemon [13187690: 514] active package: "git_email-2.11.0-1-x86_64.hpkg"
1230KERN: package_daemon [13187912: 514] active package: "ffmpeg-3.2.2-1-x86_64.hpkg"
1231KERN: package_daemon [13188126: 514] active package: "jpeg_debuginfo-9b-4-x86_64.hpkg"
1232KERN: package_daemon [13188351: 514] active packKERN: age: "automake-1.15.0-1-x86_64.hpkg"
1233KERN: package_daemon [13188576: 514] active package: "tcpdump-4.8.1-1-x86_64.hpkg"
1234KERN: package_daemon [13188791: 514] active package: "mesa_devel-13.0.2-1-x86_64.hpkg"
1235KERN: package_daemon [13189016: 514] active package: "screenfetch-3.7.0-1-any.hpkg"
1236KERN: package_daemon [13189234: 514] active package: "libpng16_devel-1.6.26-1-x86_64.hpkg"
1237KERN: package_daemon [13189470: 514] active package: "jam-2.5_2012_10_12-2-x86_64.hpkg"
1238KERN: package_daemon [13189699: 514] active package: "webpositive-r1~alpha4_pm_hrev50876-1-x86_64.hpkg"
1239KERN: package_daemon [13189971: 514] active package: "git_svn-2.11.0-1-x86_64.hpkg"
1240KERN: package_daemon [13190188: 514] active package: "ffmpeg_devel-3.2.2-1-x86_64.hpkg"
1241KERN: package_daemon [13190417: 514] active package: "bash-4.4.005-2-x86_64.hpkg"
1242KERN: package_daemon [13190631: 514] active package: "texinfo-6.1-1-x86_64.hpkg"
1243KERN: package_daemon [13190842: 514] active package: "pe-2.4.5-3-x86_64.hpkg"
1244KERN: package_daemon [13191049: 514] active package: "mkdepend-1.7-4-x86_64.hpkg"
1245KERN: package_daemon [13191280: 514] active package: "libsolv-0.3.0_haiku_2014_12_22-1-x86_64.hpkg"
1246KERN: package_daemon [13191541: 514] active package: "jasper-1.900.5-2-x86_64.hpkg"
1247KERN: package_daemon [13191759: 514] active package: "haiku_devel-r1~alpha4_pm_hrev50876-1-x86_64.hpkg"
1248KERN: package_daemon [13192030: 514] [rtl81xx] (re) bus_alloc_resource(3, [24], 0x0, 0xffffffffffffffff, 0x1,0x2)
1249KERN: add_memory_type_range(4172, 0xd0004000, 0x20000, 0)
1250KERN: set MTRRs to:
1251KERN: mtrr: 0: base: 0x8e400000, size: 0x400000, type: 0
1252KERN: mtrr: 1: base: 0xc0000000, size: 0x40000000, type: 0
1253KERN: mtrr: 2: base: 0xa0000000, size: 0x20000000, type: 1
1254KERN: [rtl81xx] (re) MSI count : 1
1255KERN: [rtl81xx] (re) MSI-X count : 4
1256KERN: [rtl81xx] (re) bus_alloc_resource(3, [32], 0x0, 0xffffffffffffffff, 0x1,0x2)
1257KERN: add_memory_type_range(4173, 0xd0000000, 0x20000, 0)
1258KERN: set MTRRs to:
1259KERN: mtrr: 0: base: 0x8e400000, size: 0x400000, type: 0
1260KERN: mtrr: 1: base: 0xc0000000, size: 0x40000000, type: 0
1261KERN: mtrr: 2: base: 0xa0000000, size: 0x20000000, type: 1
1262KERN: active package: "glu-9.0.0-5-x86_64.hpkg"
1263KERN: package_daemon [13196254: 514] active package: "findutils-4.4.2-4-x86_64.hpkg"
1264KERN: package_daemon [13196481: 514] active package: "binutils-2.26.1_2016_07_22-3-x86_64.hpkg"
1265KERN: package_daemon [13196730: 514] active package: "tiff4-4.0.7-1-x86_64.hpkg"
1266KERN: package_daemon [13196939: 514] active package: "perl-5.18.2-2-x86_64.hpkg"
1267KERN: package_daemon [13197153: 514] active package: "mpc-1.0.3-2-x86_64.hpkg"
1268KERN: package_daemon [13197380: 514] active package: "libtheora-1.1.1-5-x86_64.hpkg"
1269KERN: package_daemon [13197601: 514] active package: "jpeg-9b-4-x86_64.hpkg"
1270KERN: package_daemon [13197800: 514] active package: "glu_devel-9.0.0-5-x86_64.hpkg"
1271KERN: package_daemon [13198018: 514] active package: "flex-2.6.1-2-x86_64.hpkg"
1272KERN: package_daemon [13198224: 514] active package: "bison-3.0.4-3-x86_64.hpkg"
1273KERN: package_daemon [13198434: 514] active package: "unzip-6.0-3-x86_64.hpkg"
1274KERN: package_daemon [13198639: 514] active package: "pkgconfig-0.29.1-1-x86_64.hpkg"
1275KERN: package_daemon [13198861: 514] active package: "mpfr-3.1.4-4-x86_64.hpkg"
1276KERN: package_daemon [13199067: 514] active package: "libtool-2.4.2-2-x86_64.hpkg"
1277KERN: package_daemon [13199280: 514] active package: "jpeg_devel-9b-4-x86_64.hpkg"
1278KERN: package_daemon [13199497: 514] active package: "gmp-6.1.2-1-x86_64.hpkg"
1279KERN: add_memory_type_range(4175, 0xd0000000, 0x1000, 0)
1280KERN: package_daemon [13199724: 514] set MTRRs to:
1281KERN: active package: "weather-0.1.1_git-4-x86_64.hpkg"
1282KERN: mtrr: 0: base: 0x8e400000, size: 0x400000, type: 0
1283KERN: package_daemon [13200322: 514] mtrr: 1: base: 0xc0000000, size: 0x40000000, type: 0
1284KERN: active package: "freetype-2.7-1-x86_64.hpkg"
1285KERN: mtrr: 2: base: 0xa0000000, size: 0x20000000, type: 1
1286KERN: package_daemon [13200836: 514] allocate_io_interrupt_vectors: allocated 1 vectors starting from 26
1287KERN: active package: "bzip2-1.0.6-5-x86_64.hpkg"
1288KERN: msi_allocate_vectors: allocated 1 vectors starting from 26
1289KERN: package_daemon [13201373: 514] msix configured for 1 vectors
1290KERN: active package: "vision-0.9.8-2-x86_64.hpkg"
1291KERN: [rtl81xx] (re) Using 1 MSI-X message
1292KERN: package_daemon [13201857: 514] active package: "python-2.7.12-1-x86_64.hpkg"
1293KERN: package_daemon [13202150: 514] active package: "nano-2.7.2-1-x86_64.hpkg"
1294KERN: package_daemon [13202357: 514] active package: "libtool_libltdl-2.4.2-2-x86_64.hpkg"
1295KERN: [rtl81xx] (re) bus_alloc_resource(1, [1], 0x0, 0xffffffffffffffff, 0x1,0x2)
1296KERN: package_daemon [13202619: 514] [rtl81xx] (re) ASPM disabled
1297KERN: active package: "less-481-1-x86_64.hpkg"
1298KERN: [rtl81xx] (re) Chip rev. 0x48000000
1299KERN: package_daemon [13203130: 514] [rtl81xx] (re) MAC rev. 0x00000000
1300KERN: active package: "grep-2.24-1-x86_64.hpkg"
1301KERN: package_daemon [13203568: 514] active package: "freetype_devel-2.7-1-x86_64.hpkg"
1302KERN: package_daemon [13203796: 514] active package: "bzip2_devel-1.0.6-5-x86_64.hpkg"
1303KERN: package_daemon [13204023: 514] active package: "vl_gothic-20141206-1-any.hpkg"
1304KERN: package_daemon [13204245: 514] active package: "qrencode-3.4.4-2-x86_64.hpkg"
1305KERN: package_daemon [13204473: 514] active package: "nasm-2.12.01-1-x86_64.hpkg"
1306KERN: package_daemon [13204689: 514] active package: "libvorbis-1.3.5-3-x86_64.hpkg"
1307KERN: package_daemon [13204911: 514] active package: "libedit-2015_03_21_3.1-5-x86_64.hpkg"
1308KERN: package_daemon [13205154: 514] active package: "groff-1.20.1-3-x86_64.hpkg"
1309KERN: package_daemon [13205370: 514] active package: "gawk-4.1.0-1-x86_64.hpkg"
1310KERN: package_daemon [13205585: 514] active package: "ca_root_certificates-2015_10_28-1-any.hpkg"
1311KERN: package_daemon [13205842: 514] active package: "readline-7.0-1-x86_64.hpkg"
1312KERN: package_daemon [13206057: 514] active package: "ncurses6-6.0-2-x86_64.hpkg"
1313KERN: package_daemon [13206271: 514] active package: "libvpx3-1.5.0-1-x86_64.hpkg"
1314KERN: package_daemon [13206495: 514] active package: "milkytracker-0.90.86-2-x86_64.hpkg"
1315KERN: package_daemon [13206737: 514] active package: "libexecinfo-1.1-1-x86_64.hpkg"
1316KERN: package_daemon [13206959: 514] active package: "gcc-5.4.0_2016_06_04-4-x86_64.hpkg"
1317KERN: package_daemon [13207193: 514] active package: "cdrtools-3.02~a07-1-x86_64.hpkg"
1318KERN: package_daemon [13207428: 514] active package: "wget-1.18-2-x86_64.hpkg"
1319KERN: package_daemon [13207635: 514] active package: "readline6-6.3.8-1-x86_64.hpkg"
1320KERN: package_daemon [13207856: 514] active package: "netcat-1.10-2-x86_64.hpkg"
1321KERN: package_daemon [13208067: 514] active package: "libwebp-0.5.1-2-x86_64.hpkg"
1322KERN: package_daemon [13208283: 514] active package: "libffi-3.2.1-3-x86_64.hpkg"
1323KERN: package_daemon [13208504: 514] active package: "gcc_syslibs-5.4.0_2016_06_04-4-x86_64.hpkg"
1324KERN: package_daemon [13208762: 514] active package: "coreutils-8.24-1-x86_64.hpkg"
1325KERN: package_daemon [13208981: 514] active package: "which-2.21-3-x86_64.hpkg"
1326KERN: package_daemon [13209188: 514] active package: "scons-2.5.1-2-x86_64.hpkg"
1327KERN: package_daemon [13209398: 514] active package: "noto-20160613-4-any.hpkg"
1328KERN: package_daemon [13209616: 514] active package: "libxml2-2.9.3-4-x86_64.hpkg"
1329KERN: package_daemon [13209833: 514] active package: "libicns-0.8.1-5-x86_64.hpkg"
1330KERN: package_daemon [13210048: 514] active package: "gutenprint-5.2.11-3-x86_64.hpkg"
1331KERN: package_daemon [13210274: 514] active package: "gettext_libintl-0.19.8.1-3-x86_64.hpkg"
1332KERN: package_daemon [13210524: 514] active package: "ctags-5.8-4-x86_64.hpkg"
1333KERN: package_daemon [13210731: 514] active package: "wpa_supplicant-2.0-5-x86_64.hpkg"
1334KERN: package_daemon [13210960: 514] active package: "sed-4.2.1-6-x86_64.hpkg"
1335KERN: package_daemon [13211166: 514] active package: "openssh-7.4p1-1-x86_64.hpkg"
1336KERN: package_daemon [13211382: 514] active package: "libxslt-1.1.28-8-x86_64.hpkg"
1337KERN: package_daemon [13211606: 514] active package: "libiconv-1.13.1-8-x86_64.hpkg"
1338KERN: package_daemon [13211828: 514] active package: "gzip-1.8-1-x86_64.hpkg"
1339KERN: package_daemon [13212072: 514] The latest volume state is also the currently active one
1340KERN: package_daemon [13212421: 514] Volume::InitialVerify((nil), (nil))
1341KERN: package_daemon [13365898: 514] Volume::InitialVerify(): volume at "/boot/system" is consistent
1342KERN: package_daemon [13367265: 514] Failed to open packages activation file: No such file or directory
1343KERN: package_daemon [13367551: 514] Failed to get activated packages info from activated packages file. AKERN: ssuming all package files in package directory are activated.
1344KERN: package_daemon [13367998: 514] latest volume state:
1345KERN: package_daemon [13368149: 514] The latest volume state is also the currently active one
1346KERN: package_daemon [13368451: 514] Volume::InitialVerify(0xd657f87960, (nil))
1347KERN: package_daemon [13375451: 514] Volume::InitialVerify(): volume at "/boot/home/config" is consistent
1348KERN: bfs: Remove:2127: No such file or directory
1349KERN: bfs: Could not find value in index "size"!
1350KERN: bfs: Remove:2127: No such file or directory
1351KERN: bfs: Could not find value in index "last_modified"!
1352KERN: if_initname(0xffffffff82ef9000, re, 16)
1353KERN: [rtl81xx] rtl81xx: /dev/net/rtl81xx/0
1354KERN: [rtl81xx] () Found MII: rgephy
1355KERN: [rtl81xx] () OUI 0x00e04c, model 0x0011, rev. 5
1356KERN: [rtl81xx] () ifmedia_add: Adding Entry...
1357KERN: Type: Ethernet
1358KERN: SubType: none
1359KERN: noneifmedia_add: Adding Entry...
1360KERN: Type: Ethernet
1361KERN: SubType: 10baseT/UTP
1362KERN: , 10baseTifmedia_add: Adding Entry...
1363KERN: Type: Ethernet
1364KERN: SubType: 10baseT/UTP
1365KERN: Shared Option[0]: full-duplex
1366KERN: , 10baseT-FDXifmedia_add: Adding Entry...
1367KERN: Type: Ethernet
1368KERN: SubType: 100baseTX
1369KERN: , 100baseTXifmedia_add: Adding Entry...
1370KERN: Type: Ethernet
1371KERN: SubType: 100baseTX
1372KERN: Shared Option[0]: full-duplex
1373KERN: , 100baseTX-FDXifmedia_add: Adding Entry...
1374KERN: Type: Ethernet
1375KERN: SubType: 1000baseT
1376KERN: Shared Option[0]: full-duplex
1377KERN: , 1000baseT-FDXifmedia_add: Adding Entry...
1378KERN: Type: Ethernet
1379KERN: SubType: 1000baseT
1380KERN: Shared Option[0]: full-duplex
1381KERN: , 1000baseT-FDX-masterifmedia_add: Adding Entry...
1382KERN: Type: Ethernet
1383KERN: SubType: autoselect
1384KERN: , auto
1385KERN: ifmedia_set: target Type: Ethernet
1386KERN: SubType: autoselect
1387KERN: ifmedia_set: setting to Type: Ethernet
1388KERN: SubType: autoselect
1389KERN: msi-x enabled: 0x8003
1390KERN: rtl81xx: init_driver(0xffffffff9d968df0) at 6
1391KERN: loaded driver /boot/system/add-ons/kernel/drivers/dev/net/rtl81xx
1392KERN: loaded driver /boot/system/add-ons/kernel/drivers/dev/input/usb_hid
1393KERN: loaded driver /boot/system/add-ons/kernel/drivers/dev/input/wacom
1394KERN: ps2_hid: init_hardware
1395KERN: ps2_hid: init_driver
1396KERN: ps2_hid: publish_devices
1397KERN: ps2_hid: uninit_driver
1398KERN: loaded driver /boot/system/add-ons/kernel/drivers/dev/input/ps2_hid
1399KERN: ps2: possibly a hot plugin of input/keyboard/at/0
1400KERN: [33musb_davicom:[0m00.14.321:init_driver::ver.0.9.5
1401KERN: loaded driver /boot/system/add-ons/kernel/drivers/dev/net/usb_davicom
1402KERN: sis19x:00.14.326:init_hardware::SiS19X:init_hardware()
1403KERN: etherpci: init_driver init_driver: etherpci not found
1404KERN: [net/rtl81xx/0] compat_open(0x2)
1405KERN: ifmedia_ioctl: switching re to Type: Ethernet
1406KERN: SubType: autoselect
1407KERN: /dev/net/rtl81xx/0: media change, media 0x22 quality 1000 speed 10000000
1408KERN: ps2: devfs_publish_device input/touchpad/ps2/synaptics_0, status = 0x00000000
1409KERN: ps2: devfs_publish_device input/keyboard/at/0, status = 0x00000000
1410KERN: ps2: keyboard found
1411KERN: remove_memory_type_range(269, 0xff000000, 0x1000, 0)
1412KERN: set MTRRs to:
1413KERN: mtrr: 0: base: 0x8e400000, size: 0x400000, type: 0
1414KERN: mtrr: 1: base: 0xc0000000, size: 0x40000000, type: 0
1415KERN: mtrr: 2: base: 0xa0000000, size: 0x20000000, type: 1
1416KERN: add_memory_type_range(7098, 0xff000000, 0x1000, 0)
1417KERN: set MTRRs to:
1418KERN: mtrr: 0: base: 0x8e400000, size: 0x400000, type: 0
1419KERN: mtrr: 1: base: 0xc0000000, size: 0x40000000, type: 0
1420KERN: mtrr: 2: base: 0xa0000000, size: 0x20000000, type: 1
1421KERN: auich: init_hardware()
1422KERN: echo3g: init_hardware()
1423KERN: echo3g: no card found
1424KERN: sis7018:init_hardware:ver:2.0.2
1425KERN: emuxki: init_hardware()
1426KERN: auvia: init_hardware()
1427KERN: pci_reserve_device(0, 1, 1, hda)
1428KERN: HDA: Detected controller @ PCI:0:1:1, IRQ:18, type 1002/9902 (144d/c0da)
1429KERN: pci_reserve_device(0, 20, 2, hda)
1430KERN: HDA: Detected controller @ PCI:0:20:2, IRQ:16, type 1022/780d (144d/c0da)
1431KERN: loaded driver /boot/system/add-ons/kernel/drivers/dev/audio/hmulti/hda
1432KERN: bfs: bfs_create_index:2135: File or Directory already exists
1433Last message repeated 1 time
1434KERN: module: Search for bus_managers/ide/controller/driver_v1 failed.
1435KERN: loading dependent module bus_managers/ide/controller/driver_v1 of busses/ata/silicon_image_3112/driver_v1 failed!
1436KERN: module: Search for bus_managers/ide/controller/driver_v1 failed.
1437KERN: loading dependent module bus_managers/ide/controller/driver_v1 of busses/ata/legacy_sata/driver_v1 failed!
1438KERN: module: Search for bus_managers/ide/controller/driver_v1 failed.
1439KERN: loading dependent module bus_managers/ide/controller/driver_v1 of busses/ata/generic_ide_pci/driver_v1 failed!
1440KERN: module: Search for bus_managers/ide/controller/driver_v1 failed.
1441KERN: loading dependent module bus_managers/ide/controller/driver_v1 of generic/ata_adapter/v1 failed!
1442KERN: loading dependent module generic/ata_adapter/v1 of busses/ata/it8211/driver_v1 failed!
1443KERN: module: Search for bus_managers/ide/controller/driver_v1 failed.
1444KERN: loading dependent module bus_managers/ide/controller/driver_v1 of busses/ata/silicon_image_3112/driver_v1 failed!
1445KERN: module: Search for bus_managers/ide/controller/driver_v1 failed.
1446KERN: loading dependent module bus_managers/ide/controller/driver_v1 of busses/ata/legacy_sata/driver_v1 failed!
1447KERN: module: Search for bus_managers/ide/controller/driver_v1 failed.
1448KERN: loading dependent module bus_managers/ide/controller/driver_v1 of busses/ata/generic_ide_pci/driver_v1 failed!
1449KERN: module: Search for bus_managers/ide/controller/driver_v1 failed.
1450KERN: loading dependent module bus_managers/ide/controller/driver_v1 of generic/ata_adapter/v1 failed!
1451KERN: loading dependent module generic/ata_adapter/v1 of busses/ata/it8211/driver_v1 failed!
1452KERN: loaded driver /boot/system/add-ons/kernel/drivers/dev/bus/usb_raw
1453KERN: add_memory_type_range(7339, 0xfeb44000, 0x4000, 0)
1454KERN: set MTRRs to:
1455KERN: mtrr: 0: base: 0x8e400000, size: 0x400000, type: 0
1456KERN: mtrr: 1: base: 0xc0000000, size: 0x40000000, type: 0
1457KERN: mtrr: 2: base: 0xa0000000, size: 0x20000000, type: 1
1458KERN: hda: enabling PCI bus mastering
1459KERN: hda: enabling PCI memory access
1460KERN: allocate_io_interrupt_vectors: allocated 1 vectors starting from 27
1461KERN: msi_allocate_vectors: allocated 1 vectors starting from 27
1462KERN: msi enabled: 0x0081
1463KERN: hda: using MSI vector 27
1464KERN: hda: DMA snooping: no
1465KERN: hda: HDA v0.0, O:0/I:0/B:0, #SDO:1, 64bit:no
1466KERN: add_memory_type_range(7340, 0x1b46c000, 0x1000, 0)
1467KERN: set MTRRs to:
1468KERN: mtrr: 0: base: 0x1b46c000, size: 0x1000, type: 0
1469KERN: mtrr: 1: base: 0x8e400000, size: 0x400000, type: 0
1470KERN: mtrr: 2: base: 0xc0000000, size: 0x40000000, type: 0
1471KERN: mtrr: 3: base: 0xa0000000, size: 0x20000000, type: 1
1472KERN: hda: Codec 0 Vendor: 1002 Product: aa01, Revision: 1.0.3.0 Quirks: 0700
1473KERN: hda: Audio Group: Output delay: 0 samples, Input delay: 0 samples, Beep Generator: no
1474KERN: hda: #GPIO: 0, #GPO: 0, #GPI: 0, unsol: no, wake: no
1475KERN: hda: Supported formats: 16bits
1476KERN: hda: Supported rates: 32khz 44khz 48khz
1477KERN: hda: widget start 2, count 12
1478KERN: hda: 2: Audio output
1479KERN: hda: Supported formats: 16bits
1480KERN: hda: Supported rates: 32khz 44khz 48khz
1481KERN: hda: Supported power states:
1482KERN: hda: [Digital] [Stripe] [Stereo]
1483KERN: hda: 3: Pin complex
1484KERN: hda: [Output]
1485KERN: hda: Jack, HDMI Digital other out, Other digital, N/A, Association:15
1486KERN: hda: Supported power states:
1487KERN: hda: [Digital] [Conn. list] [Unsol. responses] [Stereo]
1488KERN: hda: Inputs: <2>
1489KERN: hda: 4: Audio output
1490KERN: hda: Supported formats: 16bits
1491KERN: hda: Supported rates: 32khz 44khz 48khz
1492KERN: hda: Supported power states:
1493KERN: hda: [Digital] [Stripe] [Stereo]
1494KERN: hda: 5: Pin complex
1495KERN: hda: [Output]
1496KERN: hda: None, HDMI Digital other out, Other digital, N/A, Association:15
1497KERN: hda: Supported power states:
1498KERN: hda: [Digital] [Conn. list] [Unsol. responses] [Stereo]
1499KERN: hda: Inputs: <4>
1500KERN: hda: 6: Audio output
1501KERN: hda: Supported formats: 16bits
1502KERN: hda: Supported rates: 32khz 44khz 48khz
1503KERN: hda: Supported power states:
1504KERN: hda: [Digital] [Stripe] [Stereo]
1505KERN: hda: 7: Pin complex
1506KERN: hda: [Output]
1507KERN: hda: None, HDMI Digital other out, Other digital, N/A, Association:15
1508KERN: hda: Supported power states:
1509KERN: hda: [Digital] [Conn. list] [Unsol. responses] [Stereo]
1510KERN: hda: Inputs: <6>
1511KERN: hda: 8: Audio output
1512KERN: hda: Supported formats: 16bits
1513KERN: hda: Supported rates: 32khz 44khz 48khz
1514KERN: hda: Supported power states:
1515KERN: hda: [Digital] [Stripe] [Stereo]
1516KERN: hda: 9: Pin complex
1517KERN: hda: [Output]
1518KERN: hda: None, HDMI Digital other out, Other digital, N/A, Association:15
1519KERN: hda: Supported power states:
1520KERN: hda: [Digital] [Conn. list] [Unsol. responses] [Stereo]
1521KERN: hda: Inputs: <8>
1522KERN: hda: 10: Audio output
1523KERN: hda: Supported formats: 16bits
1524KERN: hda: Supported rates: 32khz 44khz 48khz
1525KERN: hda: Supported power states:
1526KERN: hda: [Digital] [Stripe] [Stereo]
1527KERN: hda: 11: Pin complex
1528KERN: hda: [Output]
1529KERN: hda: None, HDMI Digital other out, Other digital, N/A, Association:15
1530KERN: hda: Supported power states:
1531KERN: hda: [Digital] [Conn. list] [Unsol. responses] [Stereo]
1532KERN: hda: Inputs: <10>
1533KERN: hda: 12: Audio output
1534KERN: hda: Supported formats: 16bits
1535KERN: hda: Supported rates: 32khz 44khz 48khz
1536KERN: hda: Supported power states:
1537KERN: hda: [Digital] [Stripe] [Stereo]
1538KERN: hda: 13: Pin complex
1539KERN: hda: [Output]
1540KERN: hda: None, HDMI Digital other out, Other digital, N/A, Association:15
1541KERN: hda: Supported power states:
1542KERN: hda: [Digital] [Conn. list] [Unsol. responses] [Stereo]
1543KERN: hda: Inputs: <12>
1544KERN: hda: build output tree: use mixer
1545KERN: hda: look at pin widget 3 (1 inputs)
1546KERN: hda: try widget 2: 0xffffffff9efebe08
1547KERN: hda: look at pin widget 5 (1 inputs)
1548KERN: hda: try widget 4: 0xffffffff9efebf60
1549KERN: hda: look at pin widget 7 (1 inputs)
1550KERN: hda: try widget 6: 0xffffffff9efec0b8
1551KERN: hda: look at pin widget 9 (1 inputs)
1552KERN: hda: try widget 8: 0xffffffff9efec210
1553KERN: hda: look at pin widget 11 (1 inputs)
1554KERN: hda: try widget 10: 0xffffffff9efec368
1555KERN: hda: look at pin widget 13 (1 inputs)
1556KERN: hda: try widget 12: 0xffffffff9efec4c0
1557KERN: hda: try without mixer!
1558KERN: hda: build output tree: don't use mixer
1559KERN: hda: look at pin widget 3 (1 inputs)
1560KERN: hda: try widget 2: 0xffffffff9efebe08
1561KERN: hda: widget 2 is candidate
1562KERN: hda: output: added output widget 2
1563KERN: hda: add pin widget 3
1564KERN: hda: look at pin widget 5 (1 inputs)
1565KERN: hda: try widget 4: 0xffffffff9efebf60
1566KERN: hda: widget 4 is candidate
1567KERN: hda: output: added output widget 4
1568KERN: hda: add pin widget 5
1569KERN: hda: look at pin widget 7 (1 inputs)
1570KERN: hda: try widget 6: 0xffffffff9efec0b8
1571KERN: hda: widget 6 is candidate
1572KERN: hda: output: added output widget 6
1573KERN: hda: add pin widget 7
1574KERN: hda: look at pin widget 9 (1 inputs)
1575KERN: hda: try widget 8: 0xffffffff9efec210
1576KERN: hda: widget 8 is candidate
1577KERN: hda: output: added output widget 8
1578KERN: hda: add pin widget 9
1579KERN: hda: look at pin widget 11 (1 inputs)
1580KERN: hda: try widget 10: 0xffffffff9efec368
1581KERN: hda: widget 10 is candidate
1582KERN: hda: output: added output widget 10
1583KERN: hda: add pin widget 11
1584KERN: hda: look at pin widget 13 (1 inputs)
1585KERN: hda: try widget 12: 0xffffffff9efec4c0
1586KERN: hda: widget 12 is candidate
1587KERN: hda: output: added output widget 12
1588KERN: hda: add pin widget 13
1589KERN: hda: build input tree
1590KERN: hda: build input tree failed
1591KERN: hda: build tree!
1592KERN: hda: Audiogroup:
1593KERN: hda: 2: Audio output
1594KERN: hda: Supported power states:
1595KERN: hda: [Digital] [Stripe] [Stereo]
1596KERN: hda: 3: Pin complex
1597KERN: hda: [Pres Detect][Output]
1598KERN: hda: Supported power states:
1599KERN: hda: [Digital] [Conn. list] [Unsol. responses] [Stereo]
1600KERN: hda: Inputs: <2>
1601KERN: hda: 4: Audio output
1602KERN: hda: Supported power states:
1603KERN: hda: [Digital] [Stripe] [Stereo]
1604KERN: hda: 5: Pin complex
1605KERN: hda: [Pres Detect][Output]
1606KERN: hda: Supported power states:
1607KERN: hda: [Digital] [Conn. list] [Unsol. responses] [Stereo]
1608KERN: hda: Inputs: <4>
1609KERN: hda: 6: Audio output
1610KERN: hda: Supported power states:
1611KERN: hda: [Digital] [Stripe] [Stereo]
1612KERN: hda: 7: Pin complex
1613KERN: hda: [Pres Detect][Output]
1614KERN: hda: Supported power states:
1615KERN: hda: [Digital] [Conn. list] [Unsol. responses] [Stereo]
1616KERN: hda: Inputs: <6>
1617KERN: hda: 8: Audio output
1618KERN: hda: Supported power states:
1619KERN: hda: [Digital] [Stripe] [Stereo]
1620KERN: hda: 9: Pin complex
1621KERN: hda: [Pres Detect][Output]
1622KERN: hda: Supported power states:
1623KERN: hda: [Digital] [Conn. list] [Unsol. responses] [Stereo]
1624KERN: hda: Inputs: <8>
1625KERN: hda: 10: Audio output
1626KERN: hda: Supported power states:
1627KERN: hda: [Digital] [Stripe] [Stereo]
1628KERN: hda: 11: Pin complex
1629KERN: hda: [Pres Detect][Output]
1630KERN: hda: Supported power states:
1631KERN: hda: [Digital] [Conn. list] [Unsol. responses] [Stereo]
1632KERN: hda: Inputs: <10>
1633KERN: hda: 12: Audio output
1634KERN: hda: Supported power states:
1635KERN: hda: [Digital] [Stripe] [Stereo]
1636KERN: hda: 13: Pin complex
1637KERN: hda: [Pres Detect][Output]
1638KERN: hda: Supported power states:
1639KERN: hda: [Digital] [Conn. list] [Unsol. responses] [Stereo]
1640KERN: hda: Inputs: <12>
1641KERN: hda: Enabled unsolicited responses on widget 3
1642KERN: hda: Enabled unsolicited responses on widget 5
1643KERN: hda: Enabled unsolicited responses on widget 7
1644KERN: hda: Enabled unsolicited responses on widget 9
1645KERN: hda: Enabled unsolicited responses on widget 11
1646KERN: hda: Enabled unsolicited responses on widget 13
1647KERN: hda: ENABLE pin widget 3
1648KERN: hda: ENABLE pin widget 5
1649KERN: hda: ENABLE pin widget 7
1650KERN: hda: ENABLE pin widget 9
1651KERN: hda: ENABLE pin widget 11
1652KERN: hda: ENABLE pin widget 13
1653KERN: hda: hda_audio_group_get_widgets failed for playback stream
1654KERN: hda: hda_audio_group_get_widgets failed for record stream
1655KERN: hda: streams playback 0x0000000000000000, record 0x0000000000000000
1656KERN: hda: Failed to setup new audio function group (No such device)!
1657KERN: hda: no active codec
1658KERN: remove_memory_type_range(7339, 0xfeb44000, 0x4000, 0)
1659KERN: set MTRRs to:
1660KERN: mtrr: 0: base: 0x1b46c000, size: 0x1000, type: 0
1661KERN: mtrr: 1: base: 0x8e400000, size: 0x400000, type: 0
1662KERN: mtrr: 2: base: 0xc0000000, size: 0x40000000, type: 0
1663KERN: mtrr: 3: base: 0xa0000000, size: 0x20000000, type: 1
1664KERN: hda: ERROR: No such device(2147512327)
1665KERN: add_memory_type_range(7341, 0xfeb40000, 0x4000, 0)
1666KERN: set MTRRs to:
1667KERN: mtrr: 0: base: 0x1b46c000, size: 0x1000, type: 0
1668KERN: mtrr: 1: base: 0x8e400000, size: 0x400000, type: 0
1669KERN: mtrr: 2: base: 0xc0000000, size: 0x40000000, type: 0
1670KERN: mtrr: 3: base: 0xa0000000, size: 0x20000000, type: 1
1671KERN: hda: enabling PCI bus mastering
1672KERN: hda: DMA snooping: no
1673KERN: hda: HDA v1.0, O:4/I:4/B:0, #SDO:1, 64bit:yes
1674KERN: add_memory_type_range(7342, 0x1b473000, 0x1000, 0)
1675KERN: set MTRRs to:
1676KERN: mtrr: 0: base: 0x1b46c000, size: 0x1000, type: 0
1677KERN: mtrr: 1: base: 0x1b473000, size: 0x1000, type: 0
1678KERN: mtrr: 2: base: 0x8e400000, size: 0x400000, type: 0
1679KERN: mtrr: 3: base: 0xc0000000, size: 0x40000000, type: 0
1680KERN: mtrr: 4: base: 0xa0000000, size: 0x20000000, type: 1
1681KERN: hda: Codec 0 Vendor: 10ec Product: 0269, Revision: 1.0.2.2 Quirks: 0700
1682KERN: hda: Audio Group: Output delay: 15 samples, Input delay: 15 samples, Beep Generator: yes
1683KERN: hda: #GPIO: 2, #GPO: 0, #GPI: 0, unsol: yes, wake: no
1684KERN: hda: Supported formats: 16bits 20bits 24bits
1685KERN: hda: Supported rates: 32khz 44khz 48khz 88khz 96khz 192khz
1686KERN: hda: widget start 2, count 34
1687KERN: hda: 2: Audio output
1688KERN: hda: Supported formats: 16bits 20bits 24bits
1689KERN: hda: Supported rates: 44khz 48khz 96khz 192khz
1690KERN: hda: Supported power states: D0 D1 D2 D3
1691KERN: hda: [Power] [Format override] [Amplifier override] [Out amplifier] [Stereo]
1692KERN: hda: Out Amp: step size: 0.75 dB, # steps: 87, offset to 0 dB: 87
1693KERN: hda: 3: Audio output
1694KERN: hda: Supported formats: 16bits 20bits 24bits
1695KERN: hda: Supported rates: 44khz 48khz 96khz 192khz
1696KERN: hda: Supported power states: D0 D1 D2 D3
1697KERN: hda: [Power] [Format override] [Amplifier override] [Out amplifier] [Stereo]
1698KERN: hda: Out Amp: step size: 0.75 dB, # steps: 87, offset to 0 dB: 87
1699KERN: hda: 4: Vendor defined
1700KERN: hda: Supported power states:
1701KERN: hda: 5: Vendor defined
1702KERN: hda: Supported power states:
1703KERN: hda: 6: Audio output
1704KERN: hda: Supported formats: 16bits 20bits 24bits
1705KERN: hda: Supported rates: 32khz 44khz 48khz 88khz 96khz 192khz
1706KERN: hda: Supported power states: D0 D1 D2 D3
1707KERN: hda: [Power] [Digital] [Format override] [Stereo]
1708KERN: hda: 7: Vendor defined
1709KERN: hda: Supported power states:
1710KERN: hda: 8: Audio input
1711KERN: hda: Supported formats: 16bits 20bits 24bits
1712KERN: hda: Supported rates: 44khz 48khz 96khz 192khz
1713KERN: hda: Supported power states: D0 D1 D2 D3
1714KERN: hda: [Power] [Conn. list] [Format override] [Amplifier override] [In amplifier] [Stereo]
1715KERN: hda: In Amp: supports mute, step size: 0.75 dB, # steps: 63, offset to 0 dB: 23
1716KERN: hda: Inputs: <35>
1717KERN: hda: 9: Audio input
1718KERN: hda: Supported formats: 16bits 20bits 24bits
1719KERN: hda: Supported rates: 44khz 48khz 96khz 192khz
1720KERN: hda: Supported power states: D0 D1 D2 D3
1721KERN: hda: [Power] [Conn. list] [Format override] [Amplifier override] [In amplifier] [Stereo]
1722KERN: hda: In Amp: supports mute, step size: 0.75 dB, # steps: 63, offset to 0 dB: 23
1723KERN: hda: Inputs: <34>
1724KERN: hda: 10: Vendor defined
1725KERN: hda: Supported power states:
1726KERN: hda: 11: Audio mixer
1727KERN: hda: Supported power states: D0
1728KERN: hda: [Conn. list] [Amplifier override] [In amplifier] [Stereo]
1729KERN: hda: In Amp: supports mute, step size: 1.5 dB, # steps: 31, offset to 0 dB: 23
1730KERN: hda: Inputs: 24 25 26 27 29
1731KERN: hda: 12: Audio mixer
1732KERN: hda: Supported power states: D0
1733KERN: hda: [Conn. list] [Amplifier override] [In amplifier] [Stereo]
1734KERN: hda: In Amp: supports mute, step size: 0.25 dB, # steps: 0, offset to 0 dB: 0
1735KERN: hda: Inputs: 2 11
1736KERN: hda: 13: Audio mixer
1737KERN: hda: Supported power states: D0
1738KERN: hda: [Conn. list] [Amplifier override] [In amplifier] [Stereo]
1739KERN: hda: In Amp: supports mute, step size: 0.25 dB, # steps: 0, offset to 0 dB: 0
1740KERN: hda: Inputs: 3 11
1741KERN: hda: 14: Vendor defined
1742KERN: hda: Supported power states:
1743KERN: hda: 15: Audio mixer
1744KERN: hda: Supported power states: D0
1745KERN: hda: [Conn. list] [Amplifier override] [In amplifier]
1746KERN: hda: In Amp: supports mute, step size: 0.25 dB, # steps: 0, offset to 0 dB: 0
1747KERN: hda: Inputs: 2 11
1748KERN: hda: 16: Vendor defined
1749KERN: hda: Supported power states:
1750KERN: hda: 17: Vendor defined
1751KERN: hda: Supported power states:
1752KERN: hda: 18: Pin complex
1753KERN: hda: [Input]
1754KERN: hda: None, Speaker, 1/8", Black, Association:15
1755KERN: hda: Supported power states: D0 D1 D2 D3
1756KERN: hda: [Power] [Amplifier override] [In amplifier] [Stereo]
1757KERN: hda: In Amp: step size: 10 dB, # steps: 3, offset to 0 dB: 0
1758KERN: hda: 19: Vendor defined
1759KERN: hda: Supported power states:
1760KERN: hda: 20: Pin complex
1761KERN: hda: [Output]
1762KERN: hda: Fixed, Speaker, Other analog, N/A, Association:1
1763KERN: hda: Supported power states: D0 D1 D2 D3
1764KERN: hda: [Power] [Conn. list] [Unsol. responses] [Amplifier override] [Out amplifier] [Stereo]
1765KERN: hda: Out Amp: supports mute, step size: 0.25 dB, # steps: 0, offset to 0 dB: 0
1766KERN: hda: Inputs: 12 13
1767KERN: hda: 21: Pin complex
1768KERN: hda: [Output]
1769KERN: hda: Jack, Right HP out, 1/8", Black, Association:1
1770KERN: hda: Supported power states: D0 D1 D2 D3
1771KERN: hda: [Power] [Conn. list] [Unsol. responses] [Amplifier override] [Out amplifier] [Stereo]
1772KERN: hda: Out Amp: supports mute, step size: 0.25 dB, # steps: 0, offset to 0 dB: 0
1773KERN: hda: Inputs: 12 13
1774KERN: hda: 22: Vendor defined
1775KERN: hda: Supported power states:
1776KERN: hda: 23: Pin complex
1777KERN: hda: [Output]
1778KERN: hda: None, Speaker, 1/8", Black, Association:15
1779KERN: hda: Supported power states: D0 D1 D2 D3
1780KERN: hda: [Power] [Conn. list] [Amplifier override] [Out amplifier]
1781KERN: hda: Out Amp: supports mute, step size: 0.25 dB, # steps: 0, offset to 0 dB: 0
1782KERN: hda: Inputs: <15>
1783KERN: hda: 24: Pin complex
1784KERN: hda: [Input] [Output]
1785KERN: hda: Jack, Right Mic in, 1/8", Black, Association:2
1786KERN: hda: Supported power states: D0 D1 D2 D3
1787KERN: hda: [Power] [Conn. list] [Unsol. responses] [Amplifier override] [Out amplifier] [In amplifier] [Stereo]
1788KERN: hda: In Amp: step size: 10 dB, # steps: 3, offset to 0 dB: 0
1789KERN: hda: Out Amp: supports mute, step size: 0.25 dB, # steps: 0, offset to 0 dB: 0
1790KERN: hda: Inputs: 12 13
1791KERN: hda: 25: Pin complex
1792KERN: hda: [Input] [Output]
1793KERN: hda: Fixed, Mic in, Other analog, N/A, Association:2
1794KERN: hda: Supported power states: D0 D1 D2 D3
1795KERN: hda: [Power] [Conn. list] [Unsol. responses] [Amplifier override] [Out amplifier] [In amplifier] [Stereo]
1796KERN: hda: In Amp: step size: 10 dB, # steps: 3, offset to 0 dB: 0
1797KERN: hda: Out Amp: supports mute, step size: 0.25 dB, # steps: 0, offset to 0 dB: 0
1798KERN: hda: Inputs: 12 13
1799KERN: hda: 26: Pin complex
1800KERN: hda: [Input] [Output]
1801KERN: hda: None, Speaker, 1/8", Black, Association:15
1802KERN: hda: Supported power states: D0 D1 D2 D3
1803KERN: hda: [Power] [Conn. list] [Unsol. responses] [Amplifier override] [Out amplifier] [In amplifier] [Stereo]
1804KERN: hda: In Amp: step size: 10 dB, # steps: 3, offset to 0 dB: 0
1805KERN: hda: Out Amp: supports mute, step size: 0.25 dB, # steps: 0, offset to 0 dB: 0
1806KERN: hda: Inputs: 12 13
1807KERN: hda: 27: Pin complex
1808KERN: hda: [Input] [Output]
1809KERN: hda: None, Speaker, 1/8", Black, Association:15
1810KERN: hda: Supported power states: D0 D1 D2 D3
1811KERN: hda: [Power] [Conn. list] [Unsol. responses] [Amplifier override] [Out amplifier] [In amplifier] [Stereo]
1812KERN: hda: In Amp: step size: 10 dB, # steps: 3, offset to 0 dB: 0
1813KERN: hda: Out Amp: supports mute, step size: 0.25 dB, # steps: 0, offset to 0 dB: 0
1814KERN: hda: Inputs: 12 13
1815KERN: hda: 28: Vendor defined
1816KERN: hda: Supported power states:
1817KERN: hda: 29: Pin complex
1818KERN: hda: [Input]
1819KERN: hda: None, Line out, Optical, Purple, Association:2
1820KERN: hda: Supported power states: D0 D1 D2 D3
1821KERN: hda: [Power]
1822KERN: hda: 30: Pin complex
1823KERN: hda: [Output]
1824KERN: hda: None, Speaker, 1/8", Black, Association:15
1825KERN: hda: Supported power states: D0 D1 D2 D3
1826KERN: hda: [Power] [Digital] [Conn. list] [Unsol. responses] [Stereo]
1827KERN: hda: Inputs: <6>
1828KERN: hda: 31: Vendor defined
1829KERN: hda: Supported power states:
1830KERN: hda: 32: Vendor defined
1831KERN: hda: Supported power states:
1832KERN: hda: [Proc widget]
1833KERN: hda: 33: Vendor defined
1834KERN: hda: Supported power states:
1835KERN: hda: 34: Audio mixer
1836KERN: hda: Supported power states: D0
1837KERN: hda: [Conn. list] [Amplifier override] [In amplifier] [Stereo]
1838KERN: hda: In Amp: supports mute, step size: 0.25 dB, # steps: 0, offset to 0 dB: 0
1839KERN: hda: Inputs: 24 25 26 27 29 11 18
1840KERN: hda: 35: Audio mixer
1841KERN: hda: Supported power states: D0
1842KERN: hda: [Conn. list] [Amplifier override] [In amplifier] [Stereo]
1843KERN: hda: In Amp: supports mute, step size: 0.25 dB, # steps: 0, offset to 0 dB: 0
1844KERN: hda: Inputs: 24 25 26 27 29 11
1845KERN: hda: build output tree: use mixer
1846KERN: hda: look at pin widget 20 (2 inputs)
1847KERN: hda: try widget 12: 0xffffffff829d36b8
1848KERN: hda: widget 12 is candidate
1849KERN: hda: output: added output widget 2
1850KERN: hda: output: added mixer/selector widget 12
1851KERN: hda: output: not added mixer/selector widget 11
1852KERN: hda: add pin widget 20
1853KERN: hda: look at pin widget 21 (2 inputs)
1854KERN: hda: try widget 12: 0xffffffff829d36b8
1855KERN: hda: widget 12 is candidate
1856KERN: hda: add pin widget 21
1857KERN: hda: look at pin widget 23 (1 inputs)
1858KERN: hda: try widget 15: 0xffffffff829d38bc
1859KERN: hda: widget 15 is candidate
1860KERN: hda: output: added output widget 2
1861KERN: hda: output: added mixer/selector widget 15
1862KERN: hda: output: not added mixer/selector widget 11
1863KERN: hda: add pin widget 23
1864KERN: hda: look at pin widget 26 (2 inputs)
1865KERN: hda: try widget 12: 0xffffffff829d36b8
1866KERN: hda: widget 12 is candidate
1867KERN: hda: try widget 13: 0xffffffff829d3764
1868KERN: hda: widget 13 is candidate
1869KERN: hda: output: added output widget 3
1870KERN: hda: output: added mixer/selector widget 13
1871KERN: hda: output: not added mixer/selector widget 11
1872KERN: hda: add pin widget 26
1873KERN: hda: look at pin widget 27 (2 inputs)
1874KERN: hda: try widget 12: 0xffffffff829d36b8
1875KERN: hda: widget 12 is candidate
1876KERN: hda: try widget 13: 0xffffffff829d3764
1877KERN: hda: widget 13 is candidate
1878KERN: hda: look at pin widget 30 (1 inputs)
1879KERN: hda: try widget 6: 0xffffffff829d32b0
1880KERN: hda: build input tree
1881KERN: hda: look at input widget 8 (1 inputs)
1882KERN: hda: try widget 35: 0xffffffff829d462c
1883KERN: hda: widget 35 is candidate
1884KERN: hda: input: added input widget 24
1885KERN: hda: input: added mixer/selector widget 35
1886KERN: hda: input: added input widget 25
1887KERN: hda: input: added mixer/selector widget 35
1888KERN: hda: input: not added mixer/selector widget 11
1889KERN: hda: add pin widget 8
1890KERN: hda: look at input widget 9 (1 inputs)
1891KERN: hda: try widget 34: 0xffffffff829d4580
1892KERN: hda: widget 34 is candidate
1893KERN: hda: input: not added mixer/selector widget 11
1894KERN: hda: input: not added mixer/selector widget 34
1895KERN: hda: build tree!
1896KERN: hda: Audiogroup:
1897KERN: hda: 2: Audio output
1898KERN: hda: Supported power states: D0 D1 D2 D3
1899KERN: hda: [Power] [Format override] [Amplifier override] [Out amplifier] [Stereo]
1900KERN: hda: Out Amp: step size: 0.75 dB, # steps: 87, offset to 0 dB: 87
1901KERN: hda: 3: Audio output
1902KERN: hda: Supported power states: D0 D1 D2 D3
1903KERN: hda: [Power] [Format override] [Amplifier override] [Out amplifier] [Stereo]
1904KERN: hda: Out Amp: step size: 0.75 dB, # steps: 87, offset to 0 dB: 87
1905KERN: hda: 4: Vendor defined
1906KERN: hda: Supported power states:
1907KERN: hda: 5: Vendor defined
1908KERN: hda: Supported power states:
1909KERN: hda: 6: Audio output
1910KERN: hda: Supported power states: D0 D1 D2 D3
1911KERN: hda: [Power] [Digital] [Format override] [Stereo]
1912KERN: hda: 7: Vendor defined
1913KERN: hda: Supported power states:
1914KERN: hda: 8: Audio input
1915KERN: hda: Supported power states: D0 D1 D2 D3
1916KERN: hda: [Power] [Conn. list] [Format override] [Amplifier override] [In amplifier] [Stereo]
1917KERN: hda: In Amp: supports mute, step size: 0.75 dB, # steps: 63, offset to 0 dB: 23
1918KERN: hda: Inputs: <35>
1919KERN: hda: 9: Audio input
1920KERN: hda: Supported power states: D0 D1 D2 D3
1921KERN: hda: [Power] [Conn. list] [Format override] [Amplifier override] [In amplifier] [Stereo]
1922KERN: hda: In Amp: supports mute, step size: 0.75 dB, # steps: 63, offset to 0 dB: 23
1923KERN: hda: Inputs: <34>
1924KERN: hda: 10: Vendor defined
1925KERN: hda: Supported power states:
1926KERN: hda: 11: Audio mixer
1927KERN: hda: Supported power states: D0
1928KERN: hda: [Conn. list] [Amplifier override] [In amplifier] [Stereo]
1929KERN: hda: In Amp: supports mute, step size: 1.5 dB, # steps: 31, offset to 0 dB: 23
1930KERN: hda: Inputs: <24> 25 26 27 29
1931KERN: hda: 12: Audio mixer
1932KERN: hda: Supported power states: D0
1933KERN: hda: [Conn. list] [Amplifier override] [In amplifier] [Stereo]
1934KERN: hda: In Amp: supports mute, step size: 0.25 dB, # steps: 0, offset to 0 dB: 0
1935KERN: hda: Inputs: <2> 11
1936KERN: hda: 13: Audio mixer
1937KERN: hda: Supported power states: D0
1938KERN: hda: [Conn. list] [Amplifier override] [In amplifier] [Stereo]
1939KERN: hda: In Amp: supports mute, step size: 0.25 dB, # steps: 0, offset to 0 dB: 0
1940KERN: hda: Inputs: <3> 11
1941KERN: hda: 14: Vendor defined
1942KERN: hda: Supported power states:
1943KERN: hda: 15: Audio mixer
1944KERN: hda: Supported power states: D0
1945KERN: hda: [Conn. list] [Amplifier override] [In amplifier]
1946KERN: hda: In Amp: supports mute, step size: 0.25 dB, # steps: 0, offset to 0 dB: 0
1947KERN: hda: Inputs: <2> 11
1948KERN: hda: 16: Vendor defined
1949KERN: hda: Supported power states:
1950KERN: hda: 17: Vendor defined
1951KERN: hda: Supported power states:
1952KERN: hda: 18: Pin complex
1953KERN: hda: [Input]
1954KERN: hda: Supported power states: D0 D1 D2 D3
1955KERN: hda: [Power] [Amplifier override] [In amplifier] [Stereo]
1956KERN: hda: In Amp: step size: 10 dB, # steps: 3, offset to 0 dB: 0
1957KERN: hda: 19: Vendor defined
1958KERN: hda: Supported power states:
1959KERN: hda: 20: Pin complex
1960KERN: hda: [Pres Detect][Output][EAPD]
1961KERN: hda: Supported power states: D0 D1 D2 D3
1962KERN: hda: [Power] [Conn. list] [Unsol. responses] [Amplifier override] [Out amplifier] [Stereo]
1963KERN: hda: Out Amp: supports mute, step size: 0.25 dB, # steps: 0, offset to 0 dB: 0
1964KERN: hda: Inputs: <12> 13
1965KERN: hda: 21: Pin complex
1966KERN: hda: [Pres Detect][HP Drive][Output][EAPD]
1967KERN: hda: Supported power states: D0 D1 D2 D3
1968KERN: hda: [Power] [Conn. list] [Unsol. responses] [Amplifier override] [Out amplifier] [Stereo]
1969KERN: hda: Out Amp: supports mute, step size: 0.25 dB, # steps: 0, offset to 0 dB: 0
1970KERN: hda: Inputs: <12> 13
1971KERN: hda: 22: Vendor defined
1972KERN: hda: Supported power states:
1973KERN: hda: 23: Pin complex
1974KERN: hda: [Output]
1975KERN: hda: Supported power states: D0 D1 D2 D3
1976KERN: hda: [Power] [Conn. list] [Amplifier override] [Out amplifier]
1977KERN: hda: Out Amp: supports mute, step size: 0.25 dB, # steps: 0, offset to 0 dB: 0
1978KERN: hda: Inputs: <15>
1979KERN: hda: 24: Pin complex
1980KERN: hda: [Pres Detect][Output][Input][VRef HIZ][VRef 50][VRef Gr][VRef 80][VRef 100]
1981KERN: hda: Supported power states: D0 D1 D2 D3
1982KERN: hda: [Power] [Conn. list] [Unsol. responses] [Amplifier override] [Out amplifier] [In amplifier] [Stereo]
1983KERN: hda: In Amp: step size: 10 dB, # steps: 3, offset to 0 dB: 0
1984KERN: hda: Out Amp: supports mute, step size: 0.25 dB, # steps: 0, offset to 0 dB: 0
1985KERN: hda: Inputs: <12> 13
1986KERN: hda: 25: Pin complex
1987KERN: hda: [Pres Detect][Output][Input][VRef HIZ][VRef 50][VRef Gr][VRef 80][VRef 100]
1988KERN: hda: Supported power states: D0 D1 D2 D3
1989KERN: hda: [Power] [Conn. list] [Unsol. responses] [Amplifier override] [Out amplifier] [In amplifier] [Stereo]
1990KERN: hda: In Amp: step size: 10 dB, # steps: 3, offset to 0 dB: 0
1991KERN: hda: Out Amp: supports mute, step size: 0.25 dB, # steps: 0, offset to 0 dB: 0
1992KERN: hda: Inputs: <12> 13
1993KERN: hda: 26: Pin complex
1994KERN: hda: [Pres Detect][HP Drive][Output][Input][VRef HIZ][VRef 50][VRef Gr][VRef 80][VRef 100]
1995KERN: hda: Supported power states: D0 D1 D2 D3
1996KERN: hda: [Power] [Conn. list] [Unsol. responses] [Amplifier override] [Out amplifier] [In amplifier] [Stereo]
1997KERN: hda: In Amp: step size: 10 dB, # steps: 3, offset to 0 dB: 0
1998KERN: hda: Out Amp: supports mute, step size: 0.25 dB, # steps: 0, offset to 0 dB: 0
1999KERN: hda: Inputs: 12 <13>
2000KERN: hda: 27: Pin complex
2001KERN: hda: [Pres Detect][Output][Input][VRef HIZ][VRef 50][VRef Gr][VRef 80][VRef 100]
2002KERN: hda: Supported power states: D0 D1 D2 D3
2003KERN: hda: [Power] [Conn. list] [Unsol. responses] [Amplifier override] [Out amplifier] [In amplifier] [Stereo]
2004KERN: hda: In Amp: step size: 10 dB, # steps: 3, offset to 0 dB: 0
2005KERN: hda: Out Amp: supports mute, step size: 0.25 dB, # steps: 0, offset to 0 dB: 0
2006KERN: hda: Inputs: <12> 13
2007KERN: hda: 28: Vendor defined
2008KERN: hda: Supported power states:
2009KERN: hda: 29: Pin complex
2010KERN: hda: [Input]
2011KERN: hda: Supported power states: D0 D1 D2 D3
2012KERN: hda: [Power]
2013KERN: hda: 30: Pin complex
2014KERN: hda: [Output]
2015KERN: hda: Supported power states: D0 D1 D2 D3
2016KERN: hda: [Power] [Digital] [Conn. list] [Unsol. responses] [Stereo]
2017KERN: hda: Inputs: <6>
2018KERN: hda: 31: Vendor defined
2019KERN: hda: Supported power states:
2020KERN: hda: 32: Vendor defined
2021KERN: hda: Supported power states:
2022KERN: hda: [Proc widget]
2023KERN: hda: 33: Vendor defined
2024KERN: hda: Supported power states:
2025KERN: hda: 34: Audio mixer
2026KERN: hda: Supported power states: D0
2027KERN: hda: [Conn. list] [Amplifier override] [In amplifier] [Stereo]
2028KERN: hda: In Amp: supports mute, step size: 0.25 dB, # steps: 0, offset to 0 dB: 0
2029KERN: hda: Inputs: <24> 25 26 27 29 11 18
2030KERN: hda: 35: Audio mixer
2031KERN: hda: Supported power states: D0
2032KERN: hda: [Conn. list] [Amplifier override] [In amplifier] [Stereo]
2033KERN: hda: In Amp: supports mute, step size: 0.25 dB, # steps: 0, offset to 0 dB: 0
2034KERN: hda: Inputs: <24> 25 26 27 29 11
2035KERN: hda: Enabled unsolicited responses on widget 21
2036KERN: hda: Enabled unsolicited responses on widget 24
2037KERN: hda: UNMUTE/SET OUTPUT GAIN widget 2 (offset 87)
2038KERN: hda: UNMUTE/SET OUTPUT GAIN widget 3 (offset 87)
2039KERN: hda: UNMUTE/SET INPUT GAIN widget 12 (offset 0)
2040KERN: hda: UNMUTE/SET INPUT GAIN widget 13 (offset 0)
2041KERN: hda: UNMUTE/SET INPUT GAIN widget 15 (offset 0)
2042KERN: hda: ENABLE pin widget 20
2043KERN: hda: ENABLE EAPD pin widget 20
2044KERN: hda: UNMUTE/SET OUTPUT GAIN widget 20 (offset 0)
2045KERN: hda: ENABLE pin widget 21
2046KERN: hda: ENABLE EAPD pin widget 21
2047KERN: hda: UNMUTE/SET OUTPUT GAIN widget 21 (offset 0)
2048KERN: hda: ENABLE pin widget 23
2049KERN: hda: UNMUTE/SET OUTPUT GAIN widget 23 (offset 0)
2050KERN: hda: ENABLE pin widget 26
2051KERN: hda: UNMUTE/SET OUTPUT GAIN widget 26 (offset 0)
2052KERN: hda: UNMUTE/SET INPUT GAIN widget 26 (offset 0)
2053KERN: hda: UNMUTE/SET INPUT GAIN widget 8 (offset 23)
2054KERN: hda: input vref 50 enabled
2055KERN: hda: input vref 80 enabled
2056KERN: hda: input vref 100 enabled
2057KERN: hda: ENABLE pin widget 24
2058KERN: hda: UNMUTE/SET OUTPUT GAIN widget 24 (offset 0)
2059KERN: hda: UNMUTE/SET INPUT GAIN widget 24 (offset 0)
2060KERN: hda: input vref 50 enabled
2061KERN: hda: input vref 80 enabled
2062KERN: hda: input vref 100 enabled
2063KERN: hda: ENABLE pin widget 25
2064KERN: hda: UNMUTE/SET OUTPUT GAIN widget 25 (offset 0)
2065KERN: hda: UNMUTE/SET INPUT GAIN widget 25 (offset 0)
2066KERN: hda: UNMUTE/SET INPUT GAIN widget 35 (offset 0)
2067KERN: hda: streams playback 0xffffffff9f05f838, record 0xffffffff9f05f1f8
2068KERN: hda: sensed pin widget 21, 1
2069KERN: hda: sample size 4, num channels 2, buffer length 10240
2070KERN: hda: hda_stream_setup_buffers: setup stream 1: SR=192000, SF=24 F=0x1831 (0x100)
2071KERN: add_memory_type_range(7344, 0x1b493000, 0x28000, 0)
2072KERN: set MTRRs to:
2073KERN: mtrr: 0: base: 0xc0000000, size: 0x40000000, type: 0
2074KERN: mtrr: 1: base: 0xa0000000, size: 0x20000000, type: 1
2075KERN: update_mtrrs(): Succeeded setting MTRRs after ignoring uncacheable ranges up to size 0x28000.
2076KERN: hda: hda_stream_setup_buffers(Playback): Allocated 163840 bytes for 2 buffers
2077KERN: add_memory_type_range(7345, 0x1b47f000, 0x1000, 0)
2078KERN: set MTRRs to:
2079KERN: mtrr: 0: base: 0xc0000000, size: 0x40000000, type: 0
2080KERN: mtrr: 1: base: 0xa0000000, size: 0x20000000, type: 1
2081KERN: update_mtrrs(): Succeeded setting MTRRs after ignoring uncacheable ranges up to size 0x28000.
2082KERN: hda: hda_stream_setup_buffers(Playback): Allocated 4096 bytes for 2 BDLEs
2083KERN: hda: stream: 1 fifo size: 1024 num_io_widgets: 2
2084KERN: hda: widgets: KERN: 2 KERN: 3
2085KERN: hda: sample size 4, num channels 2, buffer length 10240
2086KERN: hda: hda_stream_setup_buffers: setup stream 2: SR=192000, SF=24 F=0x1831 (0x100)
2087KERN: add_memory_type_range(7346, 0x1b4bc000, 0x28000, 0)
2088KERN: set MTRRs to:
2089KERN: mtrr: 0: base: 0xc0000000, size: 0x40000000, type: 0
2090KERN: mtrr: 1: base: 0xa0000000, size: 0x20000000, type: 1
2091KERN: update_mtrrs(): Succeeded setting MTRRs after ignoring uncacheable ranges up to size 0x28000.
2092KERN: hda: hda_stream_setup_buffers(Recording): Allocated 163840 bytes for 2 buffers
2093KERN: add_memory_type_range(7347, 0x1b480000, 0x1000, 0)
2094KERN: set MTRRs to:
2095KERN: mtrr: 0: base: 0xc0000000, size: 0x40000000, type: 0
2096KERN: mtrr: 1: base: 0xa0000000, size: 0x20000000, type: 1
2097KERN: update_mtrrs(): Succeeded setting MTRRs after ignoring uncacheable ranges up to size 0x28000.
2098KERN: hda: hda_stream_setup_buffers(Recording): Allocated 4096 bytes for 2 BDLEs
2099KERN: hda: stream: 2 fifo size: 256 num_io_widgets: 1
2100KERN: hda: widgets: 8
2101KERN: hda_stream_start() offset 80
2102KERN: hda_stream_start() offset 0
2103KERN: /dev/net/rtl81xx/0: media change, media 0x900030 quality 1000 speed 1000000000
2104KERN: register_domain(4, link)
2105DAEMON 'DHCP': /dev/net/rtl81xx/0: Send DHCP_DISCOVER to 255.255.255.255:67
2106KERN: hda: DMA position for stream (id:1) seems to be broken. Switching to using LPIB.
2107KERN: hda: DMA position for stream (id:2) seems to be broken. Switching to using LPIB.
2108DAEMON 'DHCP': /dev/net/rtl81xx/0: Timeout shift: 8 secs (try 1)
2109DAEMON 'DHCP': /dev/net/rtl81xx/0: Send DHCP_DISCOVER to 255.255.255.255:67
2110DAEMON 'DHCP': /dev/net/rtl81xx/0: Received DHCP_OFFER from 192.168.100.1
2111DAEMON 'DHCP': your_address: 192.168.100.2
2112DAEMON 'DHCP': server: 192.168.100.1
2113DAEMON 'DHCP': lease time: 245082 seconds
2114DAEMON 'DHCP': subnet: 255.255.255.0
2115DAEMON 'DHCP': gateway: 192.168.100.1
2116DAEMON 'DHCP': nameserver[0]: 192.168.100.1
2117DAEMON 'DHCP': /dev/net/rtl81xx/0: Send DHCP_REQUEST for 192.168.100.2 to 255.255.255.255:67
2118DAEMON 'DHCP': /dev/net/rtl81xx/0: Received DHCP_ACK from 192.168.100.1
2119DAEMON 'DHCP': server: 192.168.100.1
2120DAEMON 'DHCP': lease time: 259200 seconds
2121DAEMON 'DHCP': subnet: 255.255.255.0
2122DAEMON 'DHCP': gateway: 192.168.100.1
2123DAEMON 'DHCP': nameserver[0]: 192.168.100.1
2124DAEMON 'DHCP': /dev/net/rtl81xx/0: DHCP status = No error
2125KERN: slab memory manager: created area 0xffffffff8c801000 (9856)
2126KERN: bfs: Remove:2127: No such file or directory
2127KERN: bfs: KERN: Could not find value in index "size"!
2128KERN: bfs: Remove:2127: No such file or directory
2129KERN: bfs: Could not find value in index "last_modified"!
2130KERN: module: Search for bus_managers/ide/controller/driver_v1 failed.
2131KERN: loading dependent module bus_managers/ide/controller/driver_v1 of busses/ata/silicon_image_3112/driver_v1 failed!
2132KERN: module: Search for bus_managers/ide/controller/driver_v1 failed.
2133KERN: loading dependent module bus_managers/ide/controller/driver_v1 of busses/ata/legacy_sata/driver_v1 failed!
2134KERN: module: Search for bus_managers/ide/controller/driver_v1 failed.
2135KERN: loading dependent module bus_managers/ide/controller/driver_v1 of busses/ata/generic_ide_pci/driver_v1 failed!
2136KERN: module: Search for bus_managers/ide/controller/driver_v1 failed.
2137KERN: loading dependent module bus_managers/ide/controller/driver_v1 of generic/ata_adapter/v1 failed!
2138KERN: loading dependent module generic/ata_adapter/v1 of busses/ata/it8211/driver_v1 failed!
2139KERN: module: Search for bus_managers/ide/controller/driver_v1 failed.
2140KERN: loading dependent module bus_managers/ide/controller/driver_v1 of busses/ata/silicon_image_3112/driver_v1 failed!
2141KERN: module: Search for bus_managers/ide/controller/driver_v1 failed.
2142KERN: loading dependent module bus_managers/ide/controller/driver_v1 of busses/ata/legacy_sata/driver_v1 failed!
2143KERN: module: Search for bus_managers/ide/controller/driver_v1 failed.
2144KERN: loading dependent module bus_managers/ide/controller/driver_v1 of busses/ata/generic_ide_pci/driver_v1 failed!
2145KERN: module: Search for bus_managers/ide/controller/driver_v1 failed.
2146KERN: loading dependent module bus_managers/ide/controller/driver_v1 of generic/ata_adapter/v1 failed!
2147KERN: loading dependent module generic/ata_adapter/v1 of busses/ata/it8211/driver_v1 failed!
2148KERN: config_manager: driver module: init
2149KERN: [32mpc_serial:[0m Skipping port 0 as it is used for kernel debug.
2150KERN: [32mpc_serial:[0m scanning PCI bus (alt)...
2151KERN: loaded driver /boot/system/add-ons/kernel/drivers/dev/ports/pc_serial
2152KERN: [32musb_serial:[0m probing device: 0x0000/0x0000
2153Last message repeated 1 time
2154KERN: [32musb_serial:[0m probing device: 0x0cf3/0x3004
2155KERN: [32musb_serial:[0m probing device: 0x0000/0x0000
2156KERN: [32musb_serial:[0m probing device: 0x0781/0x556b
2157KERN: [32musb_serial:[0m probing device: 0x0bda/0x0129
2158KERN: [32musb_serial:[0m probing device: 0x0c45/0xc35a
2159KERN: loaded driver /boot/system/add-ons/kernel/drivers/dev/ports/usb_serial
2160KERN: loaded driver /boot/system/add-ons/kernel/drivers/dev/midi/emuxki
2161KERN: loaded driver /boot/system/add-ons/kernel/drivers/dev/midi/ice1712
2162KERN: [34musb_midi:[m init_driver() version:Jan 16 2017 01:44:12
2163KERN: [34musb_midi:[m init_driver() OK
2164KERN: [34musb_midi:[m publish_devices()
2165KERN: [34musb_midi:[m uninit_driver()
2166KERN: [34musb_midi:[m uninit complete
2167KERN: loaded driver /boot/system/add-ons/kernel/drivers/dev/midi/usb_midi
2168KERN: devfs: reload driver "ice1712" (4, 776)
2169KERN: devfs: reload driver "emuxki" (4, 764)
2170KERN: emuxki: init_hardware()
2171KERN: bfs: bfs_create_index:2135: File or Directory already exists
2172Last message repeated 1 time
2173KERN: slab memory manager: created area 0xffffffffb0001000 (16252)
2174KERN: vm_soft_fault: va 0x700000000 not covered by area in address space
2175KERN: vm_page_fault: vm_soft_fault returned error 'Bad address' on fault at 0x700000002, ip 0x1ac2f4f93f2, write 0, user 1, thread 0x724
2176KERN: vm_page_fault: thread "WebPositive" (1828) in team "WebPositive" (1828) tried to read address 0x700000002, ip 0x1ac2f4f93f2 ("libroot.so_seg0ro" +0xd13f2)
2177KERN: debug_server: Thread 1828 entered the debugger: Segment violation
2178KERN: stack trace, current PC 0x1ac2f4f93f2 strcmp + 0x4:
2179KERN: (0x7fec1fd470c0) 0xfc136283f0 _ZNK11BHttpHeader6NameIsEPKc + 0x68
2180KERN: (0x7fec1fd470f0) 0xfc13628480 _ZNK12BHttpHeaders11HeaderValueEPKc + 0x3a
2181KERN: (0x7fec1fd47120) 0xfc13628525 _ZNK12BHttpHeadersixEPKc + 0x9
2182KERN: (0x7fec1fd47130) 0x91d0de596e _ZN7WebCore19BUrlProtocolHandler15HeadersReceivedEP11BUrlRequest + 0x13e
2183KERN: (0x7fec1fd47460) 0xfc1362fea4 _ZN32BUrlProtocolAsynchronousListener15MessageReceivedEP8BMessage + 0xf2
2184KERN: (0x7fec1fd47520) 0x8cdd5b8af0 _ZN7BLooper15DispatchMessageEP8BMessageP8BHandler + 0x34
2185KERN: (0x7fec1fd47530) 0x8cdd5b1c52 _ZN12BApplication15DispatchMessageEP8BMessageP8BHandler + 0x24
2186KERN: (0x7fec1fd47770) 0x8cdd5b8e7c _ZN7BLooper11task_looperEv + 0x1dc
2187KERN: (0x7fec1fd477d0) 0x8cdd5aec9e _ZN12BApplication3RunEv + 0x50
2188KERN: (0x7fec1fd477f0) 0x187b5777d54 main + 0x2f
2189KERN: (0x7fec1fd47810) 0x187b576cdde _start + 0x54
2190KERN: (0x7fec1fd47840) 0x1250e634e48 runtime_loader + 0x12b
2191KERN: slab memory manager: created area 0xffffffffb0801000 (21551)
2192KERN: package_daemon [2958778049: 514] CommitTransactionHandler::_ChangePackageActivation(): activating 3, deactivating 0 packages
2193KERN: packagefs [2958779893: 514] Volume::_ChangeActivation(): 3 new packages, 0 old packages
2194KERN: packagefs [2958814644: 514] package "qsystray-0.1-3-x86_64.hpkg" activated
2195KERN: packagefs [2958822886: 514] package "qupzilla-1.8.7-1-x86_64.hpkg" activated
2196KERN: packagefs [2958866436: 514] package "libqt4-4.8.7-5-x86_64.hpkg" activated
2197KERN: package_daemon [2959279275: 514] Volume::_PackagesEntryCreated("qsystray-0.1-3-x86_64.hpkg")
2198KERN: package_daemon [2959279617: 514] Volume::_PackagesEntryCreated("libqt4-4.8.7-5-x86_64.hpkg")
2199KERN: package_daemon [2959279924: 514] Volume::_PackagesEntryCreated("qupzilla-1.8.7-1-x86_64.hpkg")
2200KERN: bfs: bfs_access:1525: Permission denied
2201KERN: runtime_loader: Cannot open file libresolv.so: No such file or directory
2202KERN: runtime_loader: Cannot open file libresolv: No such file or directory
2203KERN: runtime_loader: Cannot open file resolv.so: No such file or directory
2204KERN: runtime_loader: Cannot open file resolv: No such file or directory
2205KERN: bfs: bfs_access:1525: Permission denied
2206KERN: runtime_loader: Cannot open file thai: No such file or directory
2207KERN: runtime_loader: Cannot open file thai.so.0: No such file or directory
2208KERN: runtime_loader: Cannot open file libthai: No such file or directory
2209KERN: runtime_loader: Cannot open file libthai.so.0: No such file or directory
2210KERN: runtime_loader: Cannot open file thai: No such file or directory
2211KERN: runtime_loader: Cannot open file thai.so.0: No such file or directory
2212KERN: runtime_loader: Cannot open file libthai: No such file or directory
2213KERN: runtime_loader: Cannot open file libthai.so.0: No such file or directory
2214KERN: runtime_loader: Cannot open file thai: No such file or directory
2215KERN: runtime_loader: Cannot open file thai.so.0: No such file or directory
2216KERN: runtime_loader: Cannot open file libthai: No such file or directory
2217KERN: runtime_loader: Cannot open file libthai.so.0: No such file or directory
2218KERN: runtime_loader: Cannot open file thai: No such file or directory
2219KERN: runtime_loader: Cannot open file thai.so.0: No such file or directory
2220KERN: runtime_loader: Cannot open file libthai: No such file or directory
2221KERN: runtime_loader: Cannot open file libthai.so.0: No such file or directory
2222KERN: runtime_loader: Cannot open file thai: No such file or directory
2223KERN: runtime_loader: Cannot open file thai.so.0: No such file or directory
2224KERN: runtime_loader: Cannot open file libthai: No such file or directory
2225KERN: runtime_loader: Cannot open file libthai.so.0: No such file or directory
2226KERN: slab memory manager: created area 0xffffffffb1001000 (24220)
2227KERN: package_daemon [3259564623: 514] CommitTransactionHandler::_ChangePackageActivation(): activating 0, deactivating 1 packages
2228KERN: packagefs [3259567693: 514] Volume::_ChangeActivation(): 0 new packages, 1 old packages
2229KERN: packagefs [3259575947: 514] package "qupzilla-1.8.7-1-x86_64.hpkg" deactivated
2230KERN: package_daemon [3260065682: 514] Volume::_PackagesEntryRemoved("qupzilla-1.8.7-1-x86_64.hpkg")
2231KERN: package_daemon [3274989482: 514] CommitTransactionHandler::_ChangePackageActivation(): activating 0, deactivating 2 packages
2232KERN: packagefs [3274990384: 514] Volume::_ChangeActivation(): 0 new packages, 2 old packages
2233KERN: packagefs [3274990748: 514] package "qsystray-0.1-3-x86_64.hpkg" deactivated
2234KERN: packagefs [3275006310: 514] package "libqt4-4.8.7-5-x86_64.hpkg" deactivated
2235KERN: package_daemon [3275490177: 514] Volume::_PackagesEntryRemoved("qsystray-0.1-3-x86_64.hpkg")
2236KERN: package_daemon [3275490491: 514] Volume::_PackagesEntryRemoved("libqt4-4.8.7-5-x86_64.hpkg")
2237KERN: 5612: DEBUGGER: getNumAvailable() == 0
2238KERN: debug_server: Thread 5612 entered the debugger: Debugger call: `getNumAvailable() == 0'
2239KERN: stack trace, current PC 0x18295a9c141 _kern_debugger + 0x9:
2240KERN: (0x7f13c5e61490) 0x18295aa1274 __assert_fail + 0x43
2241KERN: (0x7f13c5e614c0) 0x18295b3c5bf _ZN8BPrivate10threadHeap6mallocEm + 0x325
2242KERN: (0x7f13c5e61510) 0x18295b3d3c9 malloc + 0x199
2243KERN: (0x7f13c5e61530) 0xf25b374db9 CRYPTO_malloc + 0x59
2244KERN: (0x7f13c5e61560) 0xf25b441820 x509_name_ex_new + 0x20
2245KERN: (0x7f13c5e61580) 0xf25b4465ad asn1_item_ex_combine_new + 0x14d
2246KERN: (0x7f13c5e615c0) 0xf25b4466d6 asn1_item_ex_combine_new + 0x276
2247KERN: (0x7f13c5e61600) 0xf25b4466d6 asn1_item_ex_combine_new + 0x276
2248KERN: (0x7f13c5e61640) 0xf25b449041 ASN1_item_ex_d2i + 0x501
2249KERN: (0x7f13c5e616d0) 0xf25b4495fb ASN1_item_d2i + 0x3b
2250KERN: (0x7f13c5e61730) 0x4638c55491 ssl3_get_server_certificate + 0x231
2251KERN: (0x7f13c5e617a0) 0x4638c5a5de ssl3_connect + 0xa7e
2252KERN: (0x7f13c5e617f0) 0x4638c64519 ssl23_connect + 0x849
2253KERN: (0x7f13c5e61890) 0x7c67cec404 _ZN13BSecureSocket13_SetupConnectEPKc + 0x22
2254KERN: (0x7f13c5e618b0) 0x7c67cec48b _ZN13BSecureSocket7ConnectERK15BNetworkAddressl + 0x5d
2255KERN: (0x7f13c5e618f0) 0x7c67cf6c61 _ZN12BHttpRequest12_MakeRequestEv + 0x1b9
2256KERN: (0x7f13c5e62a40) 0x7c67cf79a1 _ZN12BHttpRequest13_ProtocolLoopEv + 0x197
2257KERN: (0x7f13c5e62b90) 0x7c67cfabe7 _ZN11BUrlRequest12_ThreadEntryEPv + 0x25
2258KERN: (0x7f13c5e62bb0) 0x18295a9af54 thread_entry + 0x12
2259KERN: bfs: bfs_open_dir:1653: Not a directory
2260KERN: /acpi/namespace/device_v1
2261KERN: registering power button
2262KERN: add_memory_type_range(259, 0xfed40000, 0x1000, 0)
2263KERN: add_memory_type_range(268, 0xff000000, 0x1000, 0)
2264KERN: publish device: node 0xffffffff82be6828, path power/embedded_controller/0, module drivers/power/acpi_embedded_controller/device_v1
2265KERN: add_memory_type_range(269, 0xff000000, 0x1000, 0)
2266KERN: remove_memory_type_range(136, 0xe00a0000, 0x1000, 0)
2267KERN: add_memory_type_range(342, 0xe0088000, 0x1000, 0)
2268KERN: add_memory_type_range(347, 0xfeb4c000, 0x1000, 0)
2269KERN: remove_memory_type_range(347, 0xfeb4c000, 0x1000, 0)
2270KERN: add_memory_type_range(352, 0xfeb4c000, 0x1000, 0)
2271KERN: remove_memory_type_range(352, 0xfeb4c000, 0x1000, 0)
2272KERN: add_memory_type_range(361, 0xfeb4c000, 0x1000, 0)
2273KERN: remove_memory_type_range(361, 0xfeb4c000, 0x1000, 0)
2274KERN: add_memory_type_range(366, 0xfeb4c000, 0x1000, 0)
2275KERN: remove_memory_type_range(366, 0xfeb4c000, 0x1000, 0)
2276KERN: add_memory_type_range(379, 0xfed80000, 0x1000, 0)
2277KERN: add_memory_type_range(500, 0xfed40000, 0x1000, 0)
2278KERN: add_memory_type_range(595, 0xfeb48000, 0x2000, 0)
2279KERN: allocate_io_interrupt_vectors: allocated 1 vectors starting from 24
2280KERN: msi_allocate_vectors: allocated 1 vectors starting from 24
2281KERN: msi enabled: 0x0087
2282KERN: usb xhci -1: using message signaled interrupts
2283KERN: usb xhci -1: starting XHCI host controller
2284KERN: usb xhci -1: successfully started the controller
2285KERN: usb uhci: no devices found
2286KERN: usb ohci -1: iospace offset: 0xfeb4b000
2287KERN: add_memory_type_range(600, 0xfeb4b000, 0x1000, 0)
2288KERN: usb ohci -1: smm is in control of the host controller
2289KERN: usb ohci -1: ownership change successful
2290KERN: usb ohci -1: successfully started the controller
2291KERN: add_memory_type_range(603, 0xfeb4a000, 0x1000, 0)
2292KERN: sitd entry size 128, itd entry size 128
2293KERN: usb ehci -1: successfully started the controller
2294KERN: usb hub 2: port 2: new device connected
2295KERN: usb error control pipe 16: timeout waiting for queued request to complete
2296KERN: usb xhci -1: cancel queued transfers for pipe 0xffffffff82676e30 (0)
2297KERN: usb error xhci -1: error while getting the device descriptor
2298KERN: usb xhci -1: cancel queued transfers for pipe 0xffffffff82676e30 (0)
2299KERN: usb error control pipe 17: timeout waiting for queued request to complete
2300KERN: usb xhci -1: cancel queued transfers for pipe 0xffffffff82676e30 (0)
2301KERN: usb error xhci -1: error while getting the device descriptor
2302KERN: usb xhci -1: cancel queued transfers for pipe 0xffffffff82676e30 (0)
2303KERN: usb hub 7: port 1: device removed
2304KERN: usb hub 7: port 2: device removed
2305KERN: usb hub 7: port 3: device removed
2306KERN: usb hub 7: port 4: device removed
2307KERN: usb hub 12: port 1: new device connected
2308KERN: usb hub 12: port 2: new device connected
2309KERN: usb hub 12: port 3: new device connected
2310KERN: usb ehci -1: fullspeed device connected, giving up port ownership
2311KERN: usb hub 12: port 4: new device connected
2312KERN: usb_disk: device reports a lun count of 1
2313KERN: usb_disk: vendor_identification "SanDisk "
2314KERN: usb_disk: product_identification "Cruzer Edge "
2315KERN: usb_disk: product_revision_level "1.27"
2316KERN: get_boot_partitions(): boot volume message:
2317KERN: KMessage: buffer: 0xffffffff824c1460 (size/capacity: 299/299), flags: 0xa
2318KERN: field: "partition offset" (LLNG): 52449280 (0x3205000)
2319KERN: field: "packaged" (BOOL): true
2320KERN: field: "boot method" (LONG): 0 (0x0)
2321KERN: field: "booted from image" (BOOL): false
2322KERN: field: "disk identifier" (RAWT): data at 0xffffffff824c153c, 79 bytes
2323KERN: get_boot_partitions(): boot method type: 0
2324KERN: partitioning system: partitioning_systems/intel/extended/v1
2325KERN: KDiskDeviceManager::_AddDiskSystem(partitioning_systems/intel/extended/v1)
2326KERN: intel: ep_std_ops(0x1)
2327KERN: intel: ep_std_ops(0x2)
2328KERN: KDiskDeviceManager::_AddDiskSystem() done: No error
2329KERN: partitioning system: partitioning_systems/efi_gpt/v1
2330KERN: KDiskDeviceManager::_AddDiskSystem(partitioning_systems/efi_gpt/v1)
2331KERN: KDiskDeviceManager::_AddDiskSystem() done: No error
2332KERN: partitioning system: partitioning_systems/intel/map/v1
2333KERN: KDiskDeviceManager::_AddDiskSystem(partitioning_systems/intel/map/v1)
2334KERN: intel: pm_std_ops(0x1)
2335KERN: intel: pm_std_ops(0x2)
2336KERN: KDiskDeviceManager::_AddDiskSystem() done: No error
2337KERN: file system: file_systems/devfs/v1
2338KERN: KDiskDeviceManager::_AddDiskSystem(file_systems/devfs/v1)
2339KERN: KDiskDeviceManager::_AddDiskSystem() done: No error
2340KERN: file system: file_systems/rootfs/v1
2341KERN: KDiskDeviceManager::_AddDiskSystem(file_systems/rootfs/v1)
2342KERN: KDiskDeviceManager::_AddDiskSystem() done: No error
2343KERN: file system: file_systems/packagefs/v1
2344KERN: KDiskDeviceManager::_AddDiskSystem(file_systems/packagefs/v1)
2345KERN: KDiskDeviceManager::_AddDiskSystem() done: No error
2346KERN: file system: file_systems/bfs/v1
2347KERN: KDiskDeviceManager::_AddDiskSystem(file_systems/bfs/v1)
2348KERN: KDiskDeviceManager::_AddDiskSystem() done: No error
2349KERN: number of disk systems: 7
2350KERN: KDiskDeviceManager::_Scan(/dev/disk)
2351KERN: ahci: generic AHCI controller found! vendor 0x1022, device 0x7804
2352KERN: ahci: ahci_register_device
2353KERN: ahci: ahci_init_driver
2354KERN: ahci: ahci_sim_init_bus
2355KERN: ahci: ahci_sim_init_bus: pciDevice 0xffffffff82c49660
2356KERN: ahci: AHCIController::Init 0:17:0 vendor 1022, device 7804
2357KERN: ahci: PCI SATA capability found at offset 0x70
2358KERN: ahci: satacr0 = 0x00100012, satacr1 = 0x0000000f
2359KERN: ahci: pcicmd old 0x0007
2360KERN: ahci: pcicmd new 0x0006
2361KERN: allocate_io_interrupt_vectors: allocated 1 vectors starting from 25
2362KERN: msi_allocate_vectors: allocated 1 vectors starting from 25
2363KERN: msi enabled: 0x0087
2364KERN: ahci: using MSI vector 25
2365KERN: ahci: registers at 0xfeb4c000, size 0x800
2366KERN: ahci: mapping physical address 0xfeb4c000 with 2048 bytes for AHCI HBA regs
2367KERN: add_memory_type_range(629, 0xfeb4c000, 0x1000, 0)
2368KERN: ahci: physical = 0xfeb4c000, virtual = 0xffffffff82681000, offset = 0, phyadr = 0xfeb4c000, mapadr = 0xffffffff82681000, size = 4096, area = 0x00000275
2369KERN: ahci: reported number of ports is wrong, using 4 instead.
2370KERN: ahci: cap: Interface Speed Support: generation 3
2371KERN: ahci: cap: Number of Command Slots: 32 (raw 0x1f)
2372KERN: ahci: cap: Number of Ports: 4 (raw 0x2)
2373KERN: ahci: cap: Supports Port Multiplier: yes
2374KERN: ahci: cap: Supports External SATA: yes
2375KERN: ahci: cap: Enclosure Management Supported: no
2376KERN: ahci: cap: FIS-based Switching Control: no
2377KERN: ahci: cap: Supports Command List Override: yes
2378KERN: ahci: cap: Supports Staggered Spin-up: no
2379KERN: ahci: cap: Supports Mechanical Presence Switch: yes
2380KERN: ahci: cap: Supports 64-bit Addressing: yes
2381KERN: ahci: cap: Supports Native Command Queuing: yes
2382KERN: ahci: cap: Supports SNotification Register: yes
2383KERN: ahci: cap: Supports Command List Override: yes
2384KERN: ahci: cap: Supports AHCI mode only: no
2385KERN: ahci: cap2: DevSleep Entrance from Slumber Only: no
2386KERN: ahci: cap2: Supports Aggressive Device Sleep Management: no
2387KERN: ahci: cap2: Supports Device Sleep: no
2388KERN: ahci: cap2: Automatic Partial to Slumber Transitions: no
2389KERN: ahci: cap2: NVMHCI Present: no
2390KERN: ahci: cap2: BIOS/OS Handoff: no
2391KERN: ahci: ghc: AHCI Enable: yes
2392KERN: ahci: Ports Implemented Mask: 0x00000d Number of Available Ports: 3
2393KERN: ahci: AHCI Version 0001.03.00 Interrupt 25
2394KERN: ahci: allocating 4096 bytes for AHCI port 0
2395KERN: ahci: area = 630, size = 4096, virt = 0xffffffff82682000, phy = 0xbe9000
2396KERN: ahci: allocating 4096 bytes for AHCI port 2
2397KERN: ahci: area = 631, size = 4096, virt = 0xffffffff82683000, phy = 0xbe8000
2398KERN: ahci: allocating 4096 bytes for AHCI port 3
2399KERN: ahci: area = 632, size = 4096, virt = 0xffffffff82684000, phy = 0xbe7000
2400KERN: ahci: Probe: port 0 link speed 3.0Gb/s
2401KERN: ahci: Probe: port 2 link speed 1.5Gb/s
2402KERN: usb hub 7: port 3: new device connected
2403KERN: ahci: PortReset: port 3 undergoing COMRESET
2404KERN: usb hub 12: port 3: device removed
2405KERN: ahci: cookie = 0xffffffff82a96000
2406KERN: ahci: ahci_path_inquiry, cookie 0xffffffff82a96000
2407Last message repeated 1 time
2408KERN: ahci: ahci_scan_bus, cookie 0xffffffff82a96000
2409KERN: ahci: sg_memcpy phyAddr 0x48a1a0, size 96
2410KERN: ahci: ahci_get_restrictions, cookie 0xffffffff82a96000
2411KERN: publish device: node 0xffffffff82c6eaa0, path disk/scsi/0/0/0/raw, module drivers/disk/scsi/scsi_disk/device_v1
2412KERN: ahci: ahci_get_restrictions, cookie 0xffffffff82a96000
2413KERN: publish device: node 0xffffffff82c6e5a0, path disk/scsi/0/2/0/raw, module drivers/disk/scsi/scsi_cd/device_v1
2414KERN: KDiskDeviceManager::_Scan(/dev/disk/scsi)
2415KERN: KDiskDeviceManager::_Scan(/dev/disk/scsi/0)
2416KERN: KDiskDeviceManager::_Scan(/dev/disk/scsi/0/0)
2417KERN: KDiskDeviceManager::_Scan(/dev/disk/scsi/0/0/0)
2418KERN: KDiskDeviceManager::_Scan(/dev/disk/scsi/0/0/0/raw)
2419KERN: found device: /dev/disk/scsi/0/0/0/raw
2420KERN: ahci: sg_memcpy phyAddr 0x48a280, size 8
2421KERN: DMAResource@0xffffffff82c6ea00: low/high 0/100000000, max segment count 32, align 2, boundary 65536, max transfer 130560, max segment size 33554432
2422KERN: ahci: sg_memcpy phyAddr 0xKERN: 48a290, size 8
2423KERN: ahci: ahci_ioctl, cookie 0xffffffff82a96000
2424KERN: KDiskDeviceManager::_Scan(/dev/disk/scsi/0/2)
2425KERN: KDiskDeviceManager::_Scan(/dev/disk/scsi/0/2/0)
2426KERN: KDiskDeviceManager::_Scan(/dev/disk/scsi/0/2/0/raw)
2427KERN: found device: /dev/disk/scsi/0/2/0/raw
2428KERN: ahci: Probe: port 2 link speed 1.5Gb/s
2429KERN: ahci: sata_request::finish ATA command 0xa0 failed: status 0x51, error 0x20
2430KERN: ahci: sata_request::finish ATAPI packet 25 00 00 00 00 00 00 00 00 00 00 00 00 00 00 00 (len 10)
2431KERN: check_sense: encountered DEFERRED ERROR - bye, bye
2432KERN: ahci: ahci_ioctl, cookie 0xffffffff82a96000
2433KERN: KDiskDeviceManager::_Scan(/dev/disk/usb)
2434KERN: KDiskDeviceManager::_Scan(/dev/disk/usb/0)
2435KERN: KDiskDeviceManager::_Scan(/dev/disk/usb/0/0)
2436KERN: KDiskDeviceManager::_Scan(/dev/disk/usb/0/0/raw)
2437KERN: found device: /dev/disk/usb/0/0/raw
2438KERN: usb_disk: got device name "SanDisk Cruzer Edge 1.27": No error
2439KERN: KDiskDeviceManager::_ScanPartition(/dev/disk/scsi/0/0/0/raw)
2440KERN: intel: ep_std_ops(0x1)
2441KERN: trying: partitioning_systems/intel/extended/v1
2442KERN: returned: -1
2443KERN: intel: ep_std_ops(0x2)
2444KERN: trying: partitioning_systems/efi_gpt/v1
2445KERN: EFI header: EFI PART
2446KERN: EFI revision: 10000
2447KERN: header size: 92
2448KERN: header CRC: a7313a2d
2449KERN: absolute block: 1
2450KERN: alternate block: 976773167
2451KERN: first usable block: 34
2452KERN: last usable block: 976773134
2453KERN: disk GUID: f833fb81-5eef-47c0-abcf-f5302dd5f92d
2454KERN: entries block: 2
2455KERN: entry size: 128
2456KERN: entry count: 128
2457KERN: entries CRC: e01fb6fd
2458KERN: EFI header: EFI PART
2459KERN: EFI revision: 10000
2460KERN: header size: 92
2461KERN: header CRC: 1c8b382d
2462KERN: absolute block: 976773167
2463KERN: alternate block: 1
2464KERN: first usable block: 34
2465KERN: last usable block: 976773134
2466KERN: disk GUID: f833fb81-5eef-47c0-abcf-f5302dd5f92d
2467KERN: entries block: 976773135
2468KERN: entry size: 128
2469KERN: entry count: 128
2470KERN: entries CRC: e01fb6fd
2471KERN: [ 0] partition type: c12a7328-f81f-11d2-ba4b-00a0c93ec93b
2472KERN: unique id: 9834b71a-2e0a-4ba8-a235-fa58d78feb21
2473KERN: start block: 2048
2474KERN: end block: 321535
2475KERN: size: 155.999 MB
2476KERN: attributes: 0
2477KERN: name: primary
2478KERN: [ 1] partition type: 0fc63daf-8483-4772-8e79-3d69d8477de4
2479KERN: unique id: 029eb528-2cbe-4b66-832a-23d25a6b590f
2480KERN: start block: 321536
2481KERN: end block: 11855871
2482KERN: size: 5631.999 MB
2483KERN: attributes: 0
2484KERN: name: primary
2485KERN: [ 2] partition type: 0fc63daf-8483-4772-8e79-3d69d8477de4
2486KERN: unique id: 6770c84c-cdc1-4240-bc69-bd9271dbb834
2487KERN: start block: 11855872
2488KERN: end block: 95748095
2489KERN: size: 40962.999 MB
2490KERN: attributes: 0
2491KERN: name: primary
2492KERN: [ 3] partition type: 0fc63daf-8483-4772-8e79-3d69d8477de4
2493KERN: unique id: e84cffe1-3f2d-4f81-8530-62f51e7c84eb
2494KERN: start block: 95748096
2495KERN: end block: 976773119
2496KERN: size: 430187.999 MB
2497KERN: attributes: 0
2498KERN: name: primary
2499KERN: returned: 0.959
2500KERN: intel: pm_std_ops(0x1)
2501KERN: trying: partitioning_systems/intel/map/v1
2502KERN: intel: pm_identify_partition(0, 0: 0, 500107862016, 512)
2503KERN: intel: Found GPT signature, ignoring.
2504KERN: returned: -1
2505KERN: intel: pm_std_ops(0x2)
2506KERN: trying: file_systems/devfs/v1
2507KERN: returned: -1
2508KERN: trying: file_systems/rootfs/v1
2509KERN: returned: -1
2510KERN: trying: file_systems/packagefs/v1
2511KERN: returned: -1
2512KERN: trying: file_systems/bfs/v1
2513KERN: returned: -1
2514KERN: scanning with: partitioning_systems/efi_gpt/v1
2515KERN: efi_gpt_scan_partition(cookie = 0xffffffff8280ed20)
2516KERN: KDiskDeviceManager::_ScanPartition(/dev/disk/scsi/0/0/0/0)
2517KERN: intel: ep_std_ops(0x1)
2518KERN: trying: partitioning_systems/intel/extended/v1
2519KERN: returned: -1
2520KERN: intel: ep_std_ops(0x2)
2521KERN: trying: partitioning_systems/efi_gpt/v1
2522KERN: returned: -1
2523KERN: intel: pm_std_ops(0x1)
2524KERN: trying: partitioning_systems/intel/map/v1
2525KERN: intel: pm_identify_partition(0, 3: 1048576, 163577856, 512)
2526KERN: returned: -1
2527KERN: intel: pm_std_ops(0x2)
2528KERN: trying: file_systems/devfs/v1
2529KERN: returned: -1
2530KERN: trying: file_systems/rootfs/v1
2531KERN: returned: -1
2532KERN: trying: file_systems/packagefs/v1
2533KERN: returned: -1
2534KERN: trying: file_systems/bfs/v1
2535KERN: returned: -1
2536KERN: KDiskDeviceManager::_ScanPartition(/dev/disk/scsi/0/0/0/1)
2537KERN: intel: ep_std_ops(0x1)
2538KERN: trying: partitioning_systems/intel/extended/v1
2539KERN: intel: ep_identify_partition(0, 164626432, 5905580032, 512)
2540KERN: returned: -1
2541KERN: intel: ep_std_ops(0x2)
2542KERN: trying: partitioning_systems/efi_gpt/v1
2543KERN: returned: -1
2544KERN: intel: pm_std_ops(0x1)
2545KERN: trying: partitioning_systems/intel/map/v1
2546KERN: intel: pm_identify_partition(0, 4: 164626432, 5905580032, 512)
2547KERN: returned: -1
2548KERN: intel: pm_std_ops(0x2)
2549KERN: trying: file_systems/devfs/v1
2550KERN: returned: -1
2551KERN: trying: file_systems/rootfs/v1
2552KERN: returned: -1
2553KERN: trying: file_systems/packagefs/v1
2554KERN: returned: -1
2555KERN: trying: file_systems/bfs/v1
2556KERN: returned: -1
2557KERN: KDiskDeviceManager::_ScanPartition(/dev/disk/scsi/0/0/0/2)
2558KERN: intel: ep_std_ops(0x1)
2559KERN: trying: partitioning_systems/intel/extended/v1
2560KERN: intel: ep_identify_partition(0, 6070206464, 42952818688, 512)
2561KERN: returned: -1
2562KERN: intel: ep_std_ops(0x2)
2563KERN: trying: partitioning_systems/efi_gpt/v1
2564KERN: returned: -1
2565KERN: intel: pm_std_ops(0x1)
2566KERN: trying: partitioning_systems/intel/map/v1
2567KERN: intel: pm_identify_partition(0, 5: 6070206464, 42952818688, 512)
2568KERN: returned: -1
2569KERN: intel: pm_std_ops(0x2)
2570KERN: trying: file_systems/devfs/v1
2571KERN: returned: -1
2572KERN: trying: file_systems/rootfs/v1
2573KERN: returned: -1
2574KERN: trying: file_systems/packagefs/v1
2575KERN: returned: -1
2576KERN: trying: file_systems/bfs/v1
2577KERN: returned: -1
2578KERN: KDiskDeviceManager::_ScanPartition(/dev/disk/scsi/0/0/0/3)
2579KERN: intel: ep_std_ops(0x1)
2580KERN: trying: partitioning_systems/intel/extended/v1
2581KERN: intel: ep_identify_partition(0, 49023025152, 451084812288, 512)
2582KERN: returned: -1
2583KERN: intel: ep_std_ops(0x2)
2584KERN: trying: partitioning_systems/efi_gpt/v1
2585KERN: returned: -1
2586KERN: intel: pm_std_ops(0x1)
2587KERN: trying: partitioning_systems/intel/map/v1
2588KERN: intel: pm_identify_partition(0, 6: 49023025152, 451084812288, 512)
2589KERN: returned: -1
2590KERN: intel: pm_std_ops(0x2)
2591KERN: trying: file_systems/devfs/v1
2592KERN: returned: -1
2593KERN: trying: file_systems/rootfs/v1
2594KERN: returned: -1
2595KERN: trying: file_systems/packagefs/v1
2596KERN: returned: -1
2597KERN: trying: file_systems/bfs/v1
2598KERN: returned: -1
2599KERN: KDiskDeviceManager::_ScanPartition(/dev/disk/usb/0/0/raw)
2600KERN: intel: ep_std_ops(0x1)
2601KERN: trying: partitioning_systems/intel/extended/v1
2602KERN: returned: -1
2603KERN: intel: ep_std_ops(0x2)
2604KERN: trying: partitioning_systems/efi_gpt/v1
2605KERN: gpt: alternate header not in last block (2047999 vs. 30529535)
2606KERN: EFI header: EFI PART
2607KERN: EFI revision: 10000
2608KERN: header size: 92
2609KERN: header CRC: 5b9c07f6
2610KERN: absolute block: 1
2611KERN: alternate block: 2047999
2612KERN: first usable block: 34
2613KERN: last usable block: 2047966
2614KERN: disk GUID: 7329509a-b888-1649-8d3c-c4150a3f43da
2615KERN: entries block: 2
2616KERN: entry size: 128
2617KERN: entry count: 128
2618KERN: entries CRC: 6facae30
2619KERN: EFI header: EFI PART
2620KERN: EFI revision: 10000
2621KERN: header size: 92
2622KERN: header CRC: 5b9c07f6
2623KERN: absolute block: 2047999
2624KERN: alternate block: 1
2625KERN: first usable block: 34
2626KERN: last usable block: 2047966
2627KERN: disk GUID: 7329509a-b888-1649-8d3c-c4150a3f43da
2628KERN: entries block: 2047967
2629KERN: entry size: 128
2630KERN: entry count: 128
2631KERN: entries CRC: 6facae30
2632KERN: [ 0] partition type: c12a7328-f81f-11d2-ba4b-00a0c93ec93b
2633KERN: unique id: cbf355f4-7e44-9844-9158-60fc603a6c82
2634KERN: start block: 40
2635KERN: end block: 102439
2636KERN: size: 49.999 MB
2637KERN: attributes: 0
2638KERN: name: efi
2639KERN: [ 1] partition type: 42465331-3ba3-10f1-802a-4861696b7521
2640KERN: unique id: e4e596bc-c9fe-3942-ad32-776db4408f61
2641KERN: start block: 102440
2642KERN: end block: 2045991
2643KERN: size: 948.999 MB
2644KERN: attributes: 0
2645KERN: name: Haiku
2646KERN: returned: 0.959
2647KERN: intel: pm_std_ops(0x1)
2648KERN: trying: partitioning_systems/intel/map/v1
2649KERN: intel: pm_identify_partition(0, 2: 0, 15631122432, 512)
2650KERN: intel: Found GPT signature, ignoring.
2651KERN: returned: -1
2652KERN: intel: pm_std_ops(0x2)
2653KERN: trying: file_systems/devfs/v1
2654KERN: returned: -1
2655KERN: trying: file_systems/rootfs/v1
2656KERN: returned: -1
2657KERN: trying: file_systems/packagefs/v1
2658KERN: returned: -1
2659KERN: trying: file_systems/bfs/v1
2660KERN: returned: -1
2661KERN: scanning with: partitioning_systems/efi_gpt/v1
2662KERN: efi_gpt_scan_partition(cookie = 0xffffffff8280ec40)
2663KERN: KDiskDeviceManager::_ScanPartition(/dev/disk/usb/0/0/0)
2664KERN: intel: ep_std_ops(0x1)
2665KERN: trying: partitioning_systems/intel/extended/v1
2666KERN: returned: -1
2667KERN: intel: ep_std_ops(0x2)
2668KERN: trying: partitioning_systems/efi_gpt/v1
2669KERN: returned: -1
2670KERN: intel: pm_std_ops(0x1)
2671KERN: trying: partitioning_systems/intel/map/v1
2672KERN: intel: pm_identify_partition(0, 7: 20480, 52428800, 512)
2673KERN: returned: -1
2674KERN: intel: pm_std_ops(0x2)
2675KERN: trying: file_systems/devfs/v1
2676KERN: returned: -1
2677KERN: trying: file_systems/rootfs/v1
2678KERN: returned: -1
2679KERN: trying: file_systems/packagefs/v1
2680KERN: returned: -1
2681KERN: trying: file_systems/bfs/v1
2682KERN: returned: -1
2683KERN: KDiskDeviceManager::_ScanPartition(/dev/disk/usb/0/0/1)
2684KERN: intel: ep_std_ops(0x1)
2685KERN: trying: partitioning_systems/intel/extended/v1
2686KERN: intel: ep_identify_partKERN: ition(0, 52449280, 995098624, 512)
2687KERN: returned: -1
2688KERN: intel: ep_std_ops(0x2)
2689KERN: trying: partitioning_systems/efi_gpt/v1
2690KERN: returned: -1
2691KERN: intel: pm_std_ops(0x1)
2692KERN: trying: partitioning_systems/intel/map/v1
2693KERN: intel: pm_identify_partition(0, 8: 52449280, 995098624, 512)
2694KERN: returned: -1
2695KERN: intel: pm_std_ops(0x2)
2696KERN: trying: file_systems/devfs/v1
2697KERN: returned: -1
2698KERN: trying: file_systems/rootfs/v1
2699KERN: returned: -1
2700KERN: trying: file_systems/packagefs/v1
2701KERN: returned: -1
2702KERN: trying: file_systems/bfs/v1
2703KERN: returned: 0.8
2704KERN: scanning with: file_systems/bfs/v1
2705KERN: device 0: /dev/disk/scsi/0/0/0/raw
2706KERN: media status: No error
2707KERN: device flags: 2
2708KERN: offset: 0
2709KERN: size: 500107862016 (476940.23 MB)
2710KERN: content size: 500107862016
2711KERN: block size: 512
2712KERN: child count: 4
2713KERN: index: -1
2714KERN: status: 0
2715KERN: flags: 5
2716KERN: volume: -1
2717KERN: disk system: partitioning_systems/efi_gpt/v1
2718KERN: name: ST500LM0 12 HN-M500MBB
2719KERN: content name: <NULL>
2720KERN: type: <NULL>
2721KERN: content type: GUID Partition Map
2722KERN: params: <NULL>
2723KERN: content params: <NULL>
2724KERN: partition 3: /dev/disk/scsi/0/0/0/0
2725KERN: offset: 1048576
2726KERN: size: 163577856 (156 MB)
2727KERN: content size: 0
2728KERN: block size: 512
2729KERN: child count: 0
2730KERN: index: 0
2731KERN: status: 2
2732KERN: flags: 0
2733KERN: volume: -1
2734KERN: disk system: <NULL>
2735KERN: name: primary
2736KERN: content name: <NULL>
2737KERN: type: EFI system data
2738KERN: content type: <NULL>
2739KERN: params: <NULL>
2740KERN: content params: <NULL>
2741KERN: partition 4: /dev/disk/scsi/0/0/0/1
2742KERN: offset: 164626432
2743KERN: size: 5905580032 (5632 MB)
2744KERN: content size: 0
2745KERN: block size: 512
2746KERN: child count: 0
2747KERN: index: 1
2748KERN: status: 2
2749KERN: flags: 0
2750KERN: volume: -1
2751KERN: disk system: <NULL>
2752KERN: name: primary
2753KERN: content name: <NULL>
2754KERN: type: Linux data
2755KERN: content type: <NULL>
2756KERN: params: <NULL>
2757KERN: content params: <NULL>
2758KERN: partition 5: /dev/disk/scsi/0/0/0/2
2759KERN: offset: 6070206464
2760KERN: size: 42952818688 (40963 MB)
2761KERN: content size: 0
2762KERN: block size: 512
2763KERN: child count: 0
2764KERN: index: 2
2765KERN: status: 2
2766KERN: flags: 0
2767KERN: volume: -1
2768KERN: disk system: <NULL>
2769KERN: name: primary
2770KERN: content name: <NULL>
2771KERN: type: Linux data
2772KERN: content type: <NULL>
2773KERN: params: <NULL>
2774KERN: content params: <NULL>
2775KERN: partition 6: /dev/disk/scsi/0/0/0/3
2776KERN: offset: 49023025152
2777KERN: size: 451084812288 (430188 MB)
2778KERN: content size: 0
2779KERN: block size: 512
2780KERN: child count: 0
2781KERN: index: 3
2782KERN: status: 2
2783KERN: flags: 0
2784KERN: volume: -1
2785KERN: disk system: <NULL>
2786KERN: name: primary
2787KERN: content name: <NULL>
2788KERN: type: Linux data
2789KERN: content type: <NULL>
2790KERN: params: <NULL>
2791KERN: content params: <NULL>
2792KERN: device 1: /dev/disk/scsi/0/2/0/raw
2793KERN: media status: No media present
2794KERN: device flags: 5
2795KERN: device 2: /dev/disk/usb/0/0/raw
2796KERN: media status: No error
2797KERN: device flags: 3
2798KERN: offset: 0
2799KERN: size: 15631122432 (14907 MB)
2800KERN: content size: 15631122432
2801KERN: block size: 512
2802KERN: child count: 2
2803KERN: index: -1
2804KERN: status: 0
2805KERN: flags: 5
2806KERN: volume: -1
2807KERN: disk system: partitioning_systems/efi_gpt/v1
2808KERN: name: SanDisk Cruzer Edge 1.27
2809KERN: content name: <NULL>
2810KERN: type: <NULL>
2811KERN: content type: GUID Partition Map
2812KERN: params: <NULL>
2813KERN: content params: <NULL>
2814KERN: partition 7: /dev/disk/usb/0/0/0
2815KERN: offset: 20480
2816KERN: size: 52428800 (50 MB)
2817KERN: content size: 0
2818KERN: block size: 512
2819KERN: child count: 0
2820KERN: index: 0
2821KERN: status: 2
2822KERN: flags: 0
2823KERN: volume: -1
2824KERN: disk system: <NULL>
2825KERN: name: efi
2826KERN: content name: <NULL>
2827KERN: type: EFI system data
2828KERN: content type: <NULL>
2829KERN: params: <NULL>
2830KERN: content params: <NULL>
2831KERN: partition 8: /dev/disk/usb/0/0/1
2832KERN: offset: 52449280
2833KERN: size: 995098624 (949 MB)
2834KERN: content size: 995098624
2835KERN: block size: 2048
2836KERN: child count: 0
2837KERN: index: 1
2838KERN: status: 0
2839KERN: flags: 2
2840KERN: volume: -1
2841KERN: disk system: file_systems/bfs/v1
2842KERN: name: Haiku
2843KERN: content name: Haiku
2844KERN: type: Be File System
2845KERN: content type: Be File System
2846KERN: params: <NULL>
2847KERN: content params: <NULL>
2848KERN: Identified boot partition by partition offset.
2849KERN: slab memory manager: created area 0xffffffff9e001000 (674)
2850KERN: bfs: mounted "Haiku" (root node at 131072, device = /dev/disk/usb/0/0/1)
2851KERN: Mounted boot partition: /dev/disk/usb/0/0/1
2852KERN: packagefs [8359404: 16] Adding packages from "/boot/system/packages"
2853KERN: slab memory manager: created area 0xffffffff9e801000 (762)
2854KERN: slab memory manager: created area 0xffffffff9f001000 (984)
2855KERN: packagefs [9966983: 16] StringPool usage:
2856KERN: packagefs [9967159: 16] total unique strings: 23355, 286587 bytes, overhead: 537165 bytes
2857KERN: packagefs [9967436: 16] total strings with dups: 108113, 1146645 bytes
2858KERN: packagefs [9967648: 16] unshared strings: 960
2859KERN: packagefs [9967817: 16] bytes saved: 322893
2860KERN: packagefs [9978363: 16] Adding packages from "/boot/home/config/packages"
2861KERN: packagefs [9981139: 16] Failed to open packages activation file: No such file or directory
2862KERN: packagefs [9981399: 16] Loading packages from activation file failed. Loading all packages in packages directory.
2863KERN: packagefs [9989668: 16] StringPool usage:
2864KERN: packagefs [9989810: 16] total unique strings: 23355, 286587 bytes, overhead: 537165 bytes
2865KERN: packagefs [9990090: 16] total strings with dups: 108124, 1146710 bytes
2866KERN: packagefs [9990302: 16] unshared strings: 957
2867KERN: packagefs [9990472: 16] bytes saved: 322958
2868KERN: module: Search for file_cache/launch_speedup/v1 failed.
2869KERN: partitioning system: partitioning_systems/session/v1
2870KERN: KDiskDeviceManager::_AddDiskSystem(partitioning_systems/session/v1)
2871KERN: KDiskDeviceManager::_AddDiskSystem() done: No error
2872KERN: file system: file_systems/nfs/v1
2873KERN: KDiskDeviceManager::_AddDiskSystem(file_systems/nfs/v1)
2874KERN: KDiskDeviceManager::_AddDiskSystem() done: No error
2875KERN: file system: file_systems/bindfs/v1
2876KERN: KDiskDeviceManager::_AddDiskSystem(file_systems/bindfs/v1)
2877KERN: KDiskDeviceManager::_AddDiskSystem() done: No error
2878KERN: file system: file_systems/cdda/v1
2879KERN: KDiskDeviceManager::_AddDiskSystem(file_systems/cdda/v1)
2880KERN: KDiskDeviceManager::_AddDiskSystem() done: No error
2881KERN: file system: file_systems/exfat/v1
2882KERN: KDiskDeviceManager::_AddDiskSystem(file_systems/exfat/v1)
2883KERN: KDiskDeviceManager::_AddDiskSystem() done: No error
2884KERN: file system: file_systems/nfs4/v1
2885KERN: KDiskDeviceManager::_AddDiskSystem(file_systems/nfs4/v1)
2886KERN: KDiskDeviceManager::_AddDiskSystem() done: No error
2887KERN: file system: file_systems/log_overlay/v1
2888KERN: KDiskDeviceManager::_AddDiskSystem(file_systems/log_overlay/v1)
2889KERN: KDiskDeviceManager::_AddDiskSystem() done: No error
2890KERN: file system: file_systems/ntfs/v1
2891KERN: KDiskDeviceManager::_AddDiskSystem(file_systems/ntfs/v1)
2892KERN: KDiskDeviceManager::_AddDiskSystem() done: No error
2893KERN: file system: file_systems/fat/v1
2894KERN: KDiskDeviceManager::_AddDiskSystem(file_systems/fat/v1)
2895KERN: dos_std_ops()
2896Last message repeated 1 time
2897KERN: KDiskDeviceManager::_AddDiskSystem() done: No error
2898KERN: file system: file_systems/btrfs/v1
2899KERN: KDiskDeviceManager::_AddDiskSystem(file_systems/btrfs/v1)
2900KERN: KDiskDeviceManager::_AddDiskSystem() done: No error
2901KERN: file system: file_systems/iso9660/v1
2902KERN: KDiskDeviceManager::_AddDiskSystem(file_systems/iso9660/v1)
2903KERN: KDiskDeviceManager::_AddDiskSystem() done: No error
2904KERN: file system: file_systems/ext2/v1
2905KERN: KDiskDeviceManager::_AddDiskSystem(file_systems/ext2/v1)
2906KERN: KDiskDeviceManager::_AddDiskSystem() done: No error
2907KERN: file system: file_systems/KERN: udf/v1
2908KERN: KDiskDeviceManager::_AddDiskSystem(file_systems/udf/v1)
2909KERN: KDiskDeviceManager::_AddDiskSystem() done: No error
2910KERN: file system: file_systems/write_overlay/v1
2911KERN: KDiskDeviceManager::_AddDiskSystem(file_systems/write_overlay/v1)
2912KERN: KDiskDeviceManager::_AddDiskSystem() done: No error
2913KERN: file system: file_systems/attribute_overlay/v1
2914KERN: KDiskDeviceManager::_AddDiskSystem(file_systems/attribute_overlay/v1)
2915KERN: KDiskDeviceManager::_AddDiskSystem() done: No error
2916KERN: KDiskDeviceManager::_ScanPartition(/dev/disk/scsi/0/0/0/0)
2917KERN: trying: partitioning_systems/session/v1
2918KERN: publish device: node 0xffffffff9e8555b0, path disk/virtual/ram/control, module drivers/disk/virtual/ram_disk/control/device_v1
2919KERN: usb_modeswitch: init_hardware()
2920KERN: usb_modeswitch: init_driver()
2921KERN: usb_modeswitch: trying module bus_managers/usb/v3
2922KERN: usb_modeswitch: publish_devices()
2923KERN: usb_modeswitch: uninit_driver()
2924KERN: loaded driver /boot/system/add-ons/kernel/drivers/dev/usb_modeswitch
2925KERN: loaded driver /boot/system/add-ons/kernel/drivers/dev/tty
2926KERN: loaded driver /boot/system/add-ons/kernel/drivers/dev/null
2927KERN: con_init: trying module console/frame_buffer/v1
2928KERN: loaded driver /boot/system/add-ons/kernel/drivers/dev/console
2929KERN: loaded driver /boot/system/add-ons/kernel/drivers/dev/zero
2930KERN: loaded driver /boot/system/add-ons/kernel/drivers/dev/dprintf
2931KERN: module: Search for bus_managers/ide/controller/driver_v1 failed.
2932KERN: loading dependent module bus_managers/ide/controller/driver_v1 of busses/ata/silicon_image_3112/driver_v1 failed!
2933KERN: module: Search for bus_managers/ide/controller/driver_v1 failed.
2934KERN: loading dependent module bus_managers/ide/controller/driver_v1 of busses/ata/legacy_sata/driver_v1 failed!
2935KERN: module: Search for bus_managers/ide/controller/driver_v1 failed.
2936KERN: loading dependent module bus_managers/ide/controller/driver_v1 of busses/ata/generic_ide_pci/driver_v1 failed!
2937KERN: module: Search for bus_managers/ide/controller/driver_v1 failed.
2938KERN: loading dependent module bus_managers/ide/controller/driver_v1 of generic/ata_adapter/v1 failed!
2939KERN: loading dependent module generic/ata_adapter/v1 of busses/ata/it8211/driver_v1 failed!
2940KERN: module: Search for bus_managers/ide/controller/driver_v1 failed.
2941KERN: loading dependent module bus_managers/ide/controller/driver_v1 of busses/ata/silicon_image_3112/driver_v1 failed!
2942KERN: module: Search for bus_managers/ide/controller/driver_v1 failed.
2943KERN: loading dependent module bus_managers/ide/controller/driver_v1 of busses/ata/legacy_sata/driver_v1 failed!
2944KERN: module: Search for bus_managers/ide/controller/driver_v1 failed.
2945KERN: loading dependent module bus_managers/ide/controller/driver_v1 of busses/ata/generic_ide_pci/driver_v1 failed!
2946KERN: module: Search for bus_managers/ide/controller/driver_v1 failed.
2947KERN: loading dependent module bus_managers/ide/controller/driver_v1 of generic/ata_adapter/v1 failed!
2948KERN: loading dependent module generic/ata_adapter/v1 of busses/ata/it8211/driver_v1 failed!
2949KERN: module: Search for bus_managers/ide/controller/driver_v1 failed.
2950KERN: loading dependent module bus_managers/ide/controller/driver_v1 of busses/ata/silicon_image_3112/driver_v1 failed!
2951KERN: module: Search for bus_managers/ide/controller/driver_v1 failed.
2952KERN: loading dependent module bus_managers/ide/controller/driver_v1 of busses/ata/legacy_sata/driver_v1 failed!
2953KERN: module: Search for bus_managers/ide/controller/driver_v1 failed.
2954KERN: loading dependent module bus_managers/ide/controller/driver_v1 of busses/ata/generic_ide_pci/driver_v1 failed!
2955KERN: module: Search for bus_managers/ide/controller/driver_v1 failed.
2956KERN: loading dependent module bus_managers/ide/controller/driver_v1 of generic/ata_adapter/v1 failed!
2957KERN: loading dependent module generic/ata_adapter/v1 of busses/ata/it8211/driver_v1 failed!
2958KERN: returned: -1
2959KERN: trying: file_systems/nfs/v1
2960KERN: returned: -1
2961KERN: trying: file_systems/bindfs/v1
2962KERN: returned: -1
2963KERN: trying: file_systems/cdda/v1
2964KERN: raw_command:
2965KERN: ahci: AHCIPort::ScsiExecuteRequest port 0 unsupported request opcode 0x43
2966KERN: returned: -1
2967KERN: trying: file_systems/exfat/v1
2968KERN: [34mexfat:[0m invalid superblock!
2969KERN: returned: -1
2970KERN: trying: file_systems/nfs4/v1
2971KERN: returned: -1
2972KERN: trying: file_systems/log_overlay/v1
2973KERN: returned: -1
2974KERN: trying: file_systems/ntfs/v1
2975KERN: fs_identify_partition: boot signature NTFS doesn't match
2976KERN: returned: -1
2977KERN: dos_std_ops()
2978KERN: trying: file_systems/fat/v1
2979KERN: returned: 0.8
2980KERN: trying: file_systems/btrfs/v1
2981KERN: [34mbtrfs:[0m invalid superblock!
2982KERN: returned: -1
2983KERN: trying: file_systems/iso9660/v1
2984KERN: identify(7, 0xffffffff9ec21398)
2985KERN: returned: -1
2986KERN: trying: file_systems/ext2/v1
2987KERN: [34mext2:[0m invalid superblock!
2988KERN: returned: -1
2989KERN: trying: file_systems/udf/v1
2990KERN: read_pos(pos:536879104, len:512) failed with: 0xffffffffffffffff
2991KERN: udf_recognize: Invalid sequence. status = -1
2992KERN: returned: -1
2993KERN: trying: file_systems/write_overlay/v1
2994KERN: returned: -1
2995KERN: trying: file_systems/attribute_overlay/v1
2996KERN: returned: -1
2997KERN: scanning with: file_systems/fat/v1
2998KERN: KDiskDeviceManager::_ScanPartition(/dev/disk/scsi/0/0/0/1)
2999KERN: trying: partitioning_systems/session/v1
3000KERN: returned: -1
3001KERN: trying: file_systems/nfs/v1
3002KERN: returned: -1
3003KERN: trying: file_systems/bindfs/v1
3004KERN: returned: -1
3005KERN: trying: file_systems/cdda/v1
3006KERN: raw_command:
3007KERN: ahci: AHCIPort::ScsiExecuteRequest port 0 unsupported request opcode 0x43
3008KERN: returned: -1
3009KERN: trying: file_systems/exfat/v1
3010KERN: [34mexfat:[0m invalid superblock!
3011KERN: returned: -1
3012KERN: trying: file_systems/nfs4/v1
3013KERN: returned: -1
3014KERN: trying: file_systems/log_overlay/v1
3015KERN: returned: -1
3016KERN: trying: file_systems/ntfs/v1
3017KERN: fs_identify_partition: boot signature NTFS doesn't match
3018KERN: returned: -1
3019KERN: trying: file_systems/fat/v1
3020KERN: returned: -1
3021KERN: trying: file_systems/btrfs/v1
3022KERN: [34mbtrfs:[0m invalid superblock!
3023KERN: returned: -1
3024KERN: trying: file_systems/iso9660/v1
3025KERN: identify(7, 0xffffffff9ec21398)
3026KERN: returned: -1
3027KERN: trying: file_systems/ext2/v1
3028KERN: [34mext2:[0m invalid superblock!
3029KERN: returned: -1
3030KERN: trying: file_systems/udf/v1
3031KERN: read_pos(pos:84288741376, len:512) failed with: 0xffffffffffffffff
3032KERN: udf_recognize: Invalid sequence. status = -1
3033KERN: returned: -1
3034KERN: trying: file_systems/write_overlay/v1
3035KERN: returned: -1
3036KERN: trying: file_systems/attribute_overlay/v1
3037KERN: returned: -1
3038KERN: KDiskDeviceManager::_ScanPartition(/dev/disk/scsi/0/0/0/2)
3039KERN: trying: partitioning_systems/session/v1
3040KERN: returned: -1
3041KERN: trying: file_systems/nfs/v1
3042KERN: returned: -1
3043KERN: trying: file_systems/bindfs/v1
3044KERN: returned: -1
3045KERN: trying: file_systems/cdda/v1
3046KERN: raw_command:
3047KERN: ahci: AHCIPort::ScsiExecuteRequest port 0 unsupported request opcode 0x43
3048KERN: returned: -1
3049KERN: trying: file_systems/exfat/v1
3050KERN: [34mexfat:[0m invalid superblock!
3051KERN: returned: -1
3052KERN: trying: file_systems/nfs4/v1
3053KERN: returned: -1
3054KERN: trying: file_systems/log_overlay/v1
3055KERN: returned: -1
3056KERN: trying: file_systems/ntfs/v1
3057KERN: fs_identify_partition: boot signature NTFS doesn't match
3058KERN: returned: -1
3059KERN: trying: file_systems/fat/v1
3060KERN: returned: -1
3061KERN: trying: file_systems/btrfs/v1
3062KERN: returned: 0.8
3063KERN: trying: file_systems/iso9660/v1
3064KERN: identify(7, 0xffffffff9ec21380)
3065KERN: returned: -1
3066KERN: trying: file_systems/ext2/v1
3067KERN: [34mext2:[0m invalid superblock!
3068KERN: returned: -1
3069KERN: trying: file_systems/udf/v1
3070KERN: read_pos(pos:3107945717760, len:512) failed with: 0xffffffffffffffff
3071KERN: udf_recognize: Invalid sequence. status = -1
3072KERN: returned: -1
3073KERN: trying: file_systems/write_overlay/v1
3074KERN: returned: -1
3075KERN: trying: file_systems/attribute_overlay/v1
3076KERN: returned: -1
3077KERN: scanning with: file_systems/btrfs/v1
3078KERN: KDiskDeviceManager::_ScanPartition(/dev/disk/scsi/0/0/0/3)
3079KERN: trying: partitioning_systems/session/v1
3080KERN: returned: -1
3081KERN: trying: file_systems/nfs/v1
3082KERN: returned: -1
3083KERN: trying: file_systems/bindfs/v1
3084KERN: returned: -1
3085KERN: trying: file_systems/cdda/v1
3086KERN: raw_command:
3087KERN: ahci: AHCIPort::ScsiExecuteRequest port 0 unsupported request opcode 0x43
3088KERN: returned: -1
3089KERN: trying: file_systems/exfat/v1
3090KERN: [34mexfat:[0m invalid superblock!
3091KERN: returned: -1
3092KERN: trying: file_systems/nfs4/v1
3093KERN: returned: -1
3094KERN: trying: file_systems/log_overlay/v1
3095KERN: returned: -1
3096KERN: trying: file_systems/ntfs/v1
3097KERN: fs_identify_partition: boot signature NTFS doesn't match
3098KERN: returned: -1
3099KERN: trying: file_systems/fat/v1
3100KERN: returned: -1
3101KERN: trying: file_systems/btrfs/v1
3102KERN: [34mbtrfs:[0m invalid superblock!
3103KERN: returned: -1
3104KERN: trying: file_systems/iso9660/v1
3105KERN: identify(7, 0xffffffff9ec21398)
3106KERN: returned: -1
3107KERN: trying: file_systems/ext2/v1
3108KERN: [34mext2:[0m invalid superblock!
3109KERN: returned: -1
3110KERN: trying: file_systems/udf/v1
3111KERN: read_pos(pos:25099788886016, len:512) failed with: 0xffffffffffffffff
3112KERN: udf_recoKERN: gnize: Invalid sequence. status = -1
3113KERN: returned: -1
3114KERN: trying: file_systems/write_overlay/v1
3115KERN: returned: -1
3116KERN: trying: file_systems/attribute_overlay/v1
3117KERN: returned: -1
3118KERN: KDiskDeviceManager::_ScanPartition(/dev/disk/usb/0/0/0)
3119KERN: trying: partitioning_systems/session/v1
3120KERN: loaded driver /boot/system/add-ons/kernel/drivers/dev/disk/usb/usb_floppy
3121KERN: loaded driver /boot/system/add-ons/kernel/drivers/dev/disk/usb/usb_disk
3122KERN: returned: -1
3123KERN: trying: file_systems/nfs/v1
3124KERN: returned: -1
3125KERN: trying: file_systems/bindfs/v1
3126KERN: returned: -1
3127KERN: trying: file_systems/cdda/v1
3128KERN: usb_disk: unhandled ioctl 10102
3129KERN: returned: -1
3130KERN: trying: file_systems/exfat/v1
3131KERN: [34mexfat:[0m invalid superblock!
3132KERN: returned: -1
3133KERN: trying: file_systems/nfs4/v1
3134KERN: returned: -1
3135KERN: trying: file_systems/log_overlay/v1
3136KERN: returned: -1
3137KERN: trying: file_systems/ntfs/v1
3138KERN: fs_identify_partition: boot signature NTFS doesn't match
3139KERN: returned: -1
3140KERN: trying: file_systems/fat/v1
3141KERN: returned: 0.8
3142KERN: trying: file_systems/btrfs/v1
3143KERN: [34mbtrfs:[0m invalid superblock!
3144KERN: returned: -1
3145KERN: trying: file_systems/iso9660/v1
3146KERN: identify(7, 0xffffffff9ec21398)
3147KERN: returned: -1
3148KERN: trying: file_systems/ext2/v1
3149KERN: [34mext2:[0m invalid superblock!
3150KERN: returned: -1
3151KERN: trying: file_systems/udf/v1
3152KERN: udf_recognize: Invalid sequence. status = -1
3153KERN: returned: -1
3154KERN: trying: file_systems/write_overlay/v1
3155KERN: returned: -1
3156KERN: trying: file_systems/attribute_overlay/v1
3157KERN: returned: -1
3158KERN: scanning with: file_systems/fat/v1
3159KERN: KDiskDeviceManager::_Scan(/dev/disk)
3160KERN: KDiskDeviceManager::_Scan(/dev/disk/scsi)
3161KERN: KDiskDeviceManager::_Scan(/dev/disk/scsi/0)
3162KERN: KDiskDeviceManager::_Scan(/dev/disk/scsi/0/0)
3163KERN: KDiskDeviceManager::_Scan(/dev/disk/scsi/0/0/0)
3164KERN: KDiskDeviceManager::_Scan(/dev/disk/scsi/0/0/0/0)
3165KERN: KDiskDeviceManager::_Scan(/dev/disk/scsi/0/0/0/1)
3166KERN: KDiskDeviceManager::_Scan(/dev/disk/scsi/0/0/0/2)
3167KERN: KDiskDeviceManager::_Scan(/dev/disk/scsi/0/0/0/3)
3168KERN: KDiskDeviceManager::_Scan(/dev/disk/scsi/0/0/0/raw)
3169KERN: KDiskDeviceManager::_Scan(/dev/disk/scsi/0/2)
3170KERN: KDiskDeviceManager::_Scan(/dev/disk/scsi/0/2/0)
3171KERN: KDiskDeviceManager::_Scan(/dev/disk/scsi/0/2/0/raw)
3172KERN: KDiskDeviceManager::_Scan(/dev/disk/usb)
3173KERN: KDiskDeviceManager::_Scan(/dev/disk/usb/0)
3174KERN: KDiskDeviceManager::_Scan(/dev/disk/usb/0/0)
3175KERN: KDiskDeviceManager::_Scan(/dev/disk/usb/0/0/0)
3176KERN: KDiskDeviceManager::_Scan(/dev/disk/usb/0/0/1)
3177KERN: KDiskDeviceManager::_Scan(/dev/disk/usb/0/0/raw)
3178KERN: KDiskDeviceManager::_Scan(/dev/disk/virtual)
3179KERN: KDiskDeviceManager::_Scan(/dev/disk/virtual/ram)
3180KERN: KDiskDeviceManager::_Scan(/dev/disk/virtual/ram/control)
3181KERN: KDiskDeviceManager::_ScanPartition(/dev/disk/scsi/0/0/0/0)
3182KERN: intel: ep_std_ops(0x1)
3183KERN: trying: partitioning_systems/intel/extended/v1
3184KERN: returned: -1
3185KERN: intel: ep_std_ops(0x2)
3186KERN: trying: partitioning_systems/efi_gpt/v1
3187KERN: returned: -1
3188KERN: intel: pm_std_ops(0x1)
3189KERN: trying: partitioning_systems/intel/map/v1
3190KERN: intel: pm_identify_partition(7, 3: 1048576, 163577856, 512)
3191KERN: returned: -1
3192KERN: intel: pm_std_ops(0x2)
3193KERN: trying: file_systems/devfs/v1
3194KERN: returned: -1
3195KERN: trying: file_systems/rootfs/v1
3196KERN: returned: -1
3197KERN: trying: file_systems/packagefs/v1
3198KERN: returned: -1
3199KERN: trying: file_systems/bfs/v1
3200KERN: returned: -1
3201KERN: trying: partitioning_systems/session/v1
3202KERN: returned: -1
3203KERN: trying: file_systems/nfs/v1
3204KERN: returned: -1
3205KERN: trying: file_systems/bindfs/v1
3206KERN: returned: -1
3207KERN: trying: file_systems/cdda/v1
3208KERN: raw_command:
3209KERN: ahci: AHCIPort::ScsiExecuteRequest port 0 unsupported request opcode 0x43
3210KERN: returned: -1
3211KERN: trying: file_systems/exfat/v1
3212KERN: [34mexfat:[0m invalid superblock!
3213KERN: returned: -1
3214KERN: trying: file_systems/nfs4/v1
3215KERN: returned: -1
3216KERN: trying: file_systems/log_overlay/v1
3217KERN: returned: -1
3218KERN: trying: file_systems/ntfs/v1
3219KERN: fs_identify_partition: boot signature NTFS doesn't match
3220KERN: returned: -1
3221KERN: trying: file_systems/fat/v1
3222KERN: returned: 0.8
3223KERN: trying: file_systems/btrfs/v1
3224KERN: [34mbtrfs:[0m invalid superblock!
3225KERN: returned: -1
3226KERN: trying: file_systems/iso9660/v1
3227KERN: identify(7, 0xffffffff9ec21380)
3228KERN: returned: -1
3229KERN: trying: file_systems/ext2/v1
3230KERN: [34mext2:[0m invalid superblock!
3231KERN: returned: -1
3232KERN: trying: file_systems/udf/v1
3233KERN: read_pos(pos:536879104, len:512) failed with: 0xffffffffffffffff
3234KERN: udf_recognize: Invalid sequence. status = -1
3235KERN: returned: -1
3236KERN: trying: file_systems/write_overlay/v1
3237KERN: returned: -1
3238KERN: trying: file_systems/attribute_overlay/v1
3239KERN: returned: -1
3240KERN: KDiskDeviceManager::_ScanPartition(/dev/disk/scsi/0/0/0/1)
3241KERN: intel: ep_std_ops(0x1)
3242KERN: trying: partitioning_systems/intel/extended/v1
3243KERN: intel: ep_identify_partition(7, 164626432, 5905580032, 512)
3244KERN: returned: -1
3245KERN: intel: ep_std_ops(0x2)
3246KERN: trying: partitioning_systems/efi_gpt/v1
3247KERN: returned: -1
3248KERN: intel: pm_std_ops(0x1)
3249KERN: trying: partitioning_systems/intel/map/v1
3250KERN: intel: pm_identify_partition(7, 4: 164626432, 5905580032, 512)
3251KERN: returned: -1
3252KERN: intel: pm_std_ops(0x2)
3253KERN: trying: file_systems/devfs/v1
3254KERN: returned: -1
3255KERN: trying: file_systems/rootfs/v1
3256KERN: returned: -1
3257KERN: trying: file_systems/packagefs/v1
3258KERN: returned: -1
3259KERN: trying: file_systems/bfs/v1
3260KERN: returned: -1
3261KERN: trying: partitioning_systems/session/v1
3262KERN: returned: -1
3263KERN: trying: file_systems/nfs/v1
3264KERN: returned: -1
3265KERN: trying: file_systems/bindfs/v1
3266KERN: returned: -1
3267KERN: trying: file_systems/cdda/v1
3268KERN: raw_command:
3269KERN: ahci: AHCIPort::ScsiExecuteRequest port 0 unsupported request opcode 0x43
3270KERN: returned: -1
3271KERN: trying: file_systems/exfat/v1
3272KERN: [34mexfat:[0m invalid superblock!
3273KERN: returned: -1
3274KERN: trying: file_systems/nfs4/v1
3275KERN: returned: -1
3276KERN: trying: file_systems/log_overlay/v1
3277KERN: returned: -1
3278KERN: trying: file_systems/ntfs/v1
3279KERN: fs_identify_partition: boot signature NTFS doesn't match
3280KERN: returned: -1
3281KERN: trying: file_systems/fat/v1
3282KERN: returned: -1
3283KERN: trying: file_systems/btrfs/v1
3284KERN: [34mbtrfs:[0m invalid superblock!
3285KERN: returned: -1
3286KERN: trying: file_systems/iso9660/v1
3287KERN: identify(7, 0xffffffff9ec21278)
3288KERN: returned: -1
3289KERN: trying: file_systems/ext2/v1
3290KERN: [34mext2:[0m invalid superblock!
3291KERN: returned: -1
3292KERN: trying: file_systems/udf/v1
3293KERN: read_pos(pos:84288741376, len:512) failed with: 0xffffffffffffffff
3294KERN: udf_recognize: Invalid sequence. status = -1
3295KERN: returned: -1
3296KERN: trying: file_systems/write_overlay/v1
3297KERN: returned: -1
3298KERN: trying: file_systems/attribute_overlay/v1
3299KERN: returned: -1
3300KERN: KDiskDeviceManager::_ScanPartition(/dev/disk/scsi/0/0/0/2)
3301KERN: intel: ep_std_ops(0x1)
3302KERN: trying: partitioning_systems/intel/extended/v1
3303KERN: intel: ep_identify_partition(7, 6070206464, 42952818688, 4096)
3304KERN: returned: -1
3305KERN: intel: ep_std_ops(0x2)
3306KERN: trying: partitioning_systems/efi_gpt/v1
3307KERN: returned: -1
3308KERN: intel: pm_std_ops(0x1)
3309KERN: trying: partitioning_systems/intel/map/v1
3310KERN: intel: pm_identify_partition(7, 5: 6070206464, 42952818688, 4096)
3311KERN: returned: -1
3312KERN: intel: pm_std_ops(0x2)
3313KERN: trying: file_systems/devfs/v1
3314KERN: returned: -1
3315KERN: trying: file_systems/rootfs/v1
3316KERN: returned: -1
3317KERN: trying: file_systems/packagefs/v1
3318KERN: returned: -1
3319KERN: trying: file_systems/bfs/v1
3320KERN: returned: -1
3321KERN: trying: partitioning_systems/session/v1
3322KERN: returned: -1
3323KERN: trying: file_systems/nfs/v1
3324KERN: returned: -1
3325KERN: trying: file_systems/bindfs/v1
3326KERN: returned: -1
3327KERN: trying: file_systems/cdda/v1
3328KERN: raw_command:
3329KERN: ahci: AHCIPort::ScsiExecuteRequest port 0 unsupported request opcode 0x43
3330KERN: returned: -1
3331KERN: trying: file_systems/exfat/v1
3332KERN: [34mexfat:[0m invalid superblock!
3333KERN: returned: -1
3334KERN: trying: file_systems/nfs4/v1
3335KERN: returned: -1
3336KERN: trying: file_systems/log_overlay/v1
3337KERN: returned: -1
3338KERN: trying: file_systems/ntfs/v1
3339KERN: fs_identify_partition: boot signature NTFS doesn't match
3340KERN: returned: -1
3341KERN: trying: file_systems/fat/v1
3342KERN: returned: -1
3343KERN: trying: file_systems/btrfs/v1
3344KERN: returned: 0.8
3345KERN: trying: file_systems/iso9660/v1
3346KERN: identify(7, 0xffffffff9ec21380)
3347KERN: returned: -1
3348KERN: trying: file_systems/ext2/v1
3349KERN: [34mext2:[0m invalid superblock!
3350KERN: returned: -1
3351KERN: trying: file_systems/udf/v1
3352KERN: read_pos(pos:24863565742080, len:4096) failed with: 0xffffffffffffffff
3353KERN: udf_recognize: Invalid sequence. status = -1
3354KERN: returned: -1
3355KERN: trying: file_systems/write_overlay/v1
3356KERN: returned: -1
3357KERN: trying: file_systems/attribute_overlay/v1
3358KERN: returned: -1
3359KERN: KDiskDeviceManager::_ScanPartition(/dev/disk/scsi/0/0/0/3)
3360KERN: intel: ep_std_ops(0x1)
3361KERN: trying: partitioning_systems/intel/extended/v1
3362KERN: intel: ep_identify_partition(7, 49023025152, 451084812288, 512)
3363KERN: returned: -1
3364KERN: intel: ep_std_ops(0x2)
3365KERN: trying: partitioning_systems/efi_gpt/v1
3366KERN: returned: -1
3367KERN: intel: pm_std_ops(0x1)
3368KERN: trying: partitioning_systems/intel/map/v1
3369KERN: intel: pm_identify_partition(7, 6: 49023025152, 451084812288, 512)
3370KERN: returned: -1
3371KERN: intel: pm_std_ops(KERN: 0x2)
3372KERN: trying: file_systems/devfs/v1
3373KERN: returned: -1
3374KERN: trying: file_systems/rootfs/v1
3375KERN: returned: -1
3376KERN: trying: file_systems/packagefs/v1
3377KERN: returned: -1
3378KERN: trying: file_systems/bfs/v1
3379KERN: returned: -1
3380KERN: trying: partitioning_systems/session/v1
3381KERN: returned: -1
3382KERN: trying: file_systems/nfs/v1
3383KERN: returned: -1
3384KERN: trying: file_systems/bindfs/v1
3385KERN: returned: -1
3386KERN: trying: file_systems/cdda/v1
3387KERN: raw_command:
3388KERN: ahci: AHCIPort::ScsiExecuteRequest port 0 unsupported request opcode 0x43
3389KERN: returned: -1
3390KERN: trying: file_systems/exfat/v1
3391KERN: [34mexfat:[0m invalid superblock!
3392KERN: returned: -1
3393KERN: trying: file_systems/nfs4/v1
3394KERN: returned: -1
3395KERN: trying: file_systems/log_overlay/v1
3396KERN: returned: -1
3397KERN: trying: file_systems/ntfs/v1
3398KERN: fs_identify_partition: boot signature NTFS doesn't match
3399KERN: returned: -1
3400KERN: trying: file_systems/fat/v1
3401KERN: returned: -1
3402KERN: trying: file_systems/btrfs/v1
3403KERN: [34mbtrfs:[0m invalid superblock!
3404KERN: returned: -1
3405KERN: trying: file_systems/iso9660/v1
3406KERN: identify(7, 0xffffffff9ec21278)
3407KERN: returned: -1
3408KERN: trying: file_systems/ext2/v1
3409KERN: [34mext2:[0m invalid superblock!
3410KERN: returned: -1
3411KERN: trying: file_systems/udf/v1
3412KERN: read_pos(pos:25099788886016, len:512) failed with: 0xffffffffffffffff
3413KERN: udf_recognize: Invalid sequence. status = -1
3414KERN: returned: -1
3415KERN: trying: file_systems/write_overlay/v1
3416KERN: returned: -1
3417KERN: trying: file_systems/attribute_overlay/v1
3418KERN: returned: -1
3419KERN: KDiskDeviceManager::_ScanPartition(/dev/disk/usb/0/0/0)
3420KERN: intel: ep_std_ops(0x1)
3421KERN: trying: partitioning_systems/intel/extended/v1
3422KERN: returned: -1
3423KERN: intel: ep_std_ops(0x2)
3424KERN: trying: partitioning_systems/efi_gpt/v1
3425KERN: returned: -1
3426KERN: intel: pm_std_ops(0x1)
3427KERN: trying: partitioning_systems/intel/map/v1
3428KERN: intel: pm_identify_partition(7, 7: 20480, 52428800, 512)
3429KERN: returned: -1
3430KERN: intel: pm_std_ops(0x2)
3431KERN: trying: file_systems/devfs/v1
3432KERN: returned: -1
3433KERN: trying: file_systems/rootfs/v1
3434KERN: returned: -1
3435KERN: trying: file_systems/packagefs/v1
3436KERN: returned: -1
3437KERN: trying: file_systems/bfs/v1
3438KERN: returned: -1
3439KERN: trying: partitioning_systems/session/v1
3440KERN: returned: -1
3441KERN: trying: file_systems/nfs/v1
3442KERN: returned: -1
3443KERN: trying: file_systems/bindfs/v1
3444KERN: returned: -1
3445KERN: trying: file_systems/cdda/v1
3446KERN: usb_disk: unhandled ioctl 10102
3447KERN: returned: -1
3448KERN: trying: file_systems/exfat/v1
3449KERN: [34mexfat:[0m invalid superblock!
3450KERN: returned: -1
3451KERN: trying: file_systems/nfs4/v1
3452KERN: returned: -1
3453KERN: trying: file_systems/log_overlay/v1
3454KERN: returned: -1
3455KERN: trying: file_systems/ntfs/v1
3456KERN: fs_identify_partition: boot signature NTFS doesn't match
3457KERN: returned: -1
3458KERN: trying: file_systems/fat/v1
3459KERN: returned: 0.8
3460KERN: trying: file_systems/btrfs/v1
3461KERN: [34mbtrfs:[0m invalid superblock!
3462KERN: returned: -1
3463KERN: trying: file_systems/iso9660/v1
3464KERN: identify(7, 0xffffffff9ec21380)
3465KERN: returned: -1
3466KERN: trying: file_systems/ext2/v1
3467KERN: [34mext2:[0m invalid superblock!
3468KERN: returned: -1
3469KERN: trying: file_systems/udf/v1
3470KERN: udf_recognize: Invalid sequence. status = -1
3471KERN: returned: -1
3472KERN: trying: file_systems/write_overlay/v1
3473KERN: returned: -1
3474KERN: trying: file_systems/attribute_overlay/v1
3475KERN: returned: -1
3476KERN: allocate_commpage_entry(4, 16) -> 0x0000000000000260
3477KERN: no valid cpufreq module found
3478KERN: no valid cpuidle module found
3479KERN: add_memory_type_range(-1, 0x100000, 0x8e1f3000, 6)
3480KERN: set MTRRs to:
3481KERN: mtrr: 0: base: 0x8e400000, size: 0x400000, type: 0
3482KERN: mtrr: 1: base: 0xa0000000, size: 0x20000000, type: 0
3483KERN: mtrr: 2: base: 0xc0000000, size: 0x40000000, type: 0
3484KERN: add_memory_type_range(-1, 0x8ed31000, 0x1000, 6)
3485KERN: set MTRRs to:
3486KERN: mtrr: 0: base: 0x8e400000, size: 0x400000, type: 0
3487KERN: mtrr: 1: base: 0xa0000000, size: 0x20000000, type: 0
3488KERN: mtrr: 2: base: 0xc0000000, size: 0x40000000, type: 0
3489KERN: add_memory_type_range(-1, 0x8ef35000, 0x6ef000, 6)
3490KERN: set MTRRs to:
3491KERN: mtrr: 0: base: 0x8e400000, size: 0x400000, type: 0
3492KERN: mtrr: 1: base: 0xa0000000, size: 0x20000000, type: 0
3493KERN: mtrr: 2: base: 0xc0000000, size: 0x40000000, type: 0
3494KERN: add_memory_type_range(-1, 0x8f7f3000, 0xd000, 6)
3495KERN: set MTRRs to:
3496KERN: mtrr: 0: base: 0x8e400000, size: 0x400000, type: 0
3497KERN: mtrr: 1: base: 0xa0000000, size: 0x20000000, type: 0
3498KERN: mtrr: 2: base: 0xc0000000, size: 0x40000000, type: 0
3499KERN: add_memory_type_range(-1, 0x100001000, 0xcefff000, 6)
3500KERN: set MTRRs to:
3501KERN: mtrr: 0: base: 0x8e400000, size: 0x400000, type: 0
3502KERN: mtrr: 1: base: 0xa0000000, size: 0x20000000, type: 0
3503KERN: mtrr: 2: base: 0xc0000000, size: 0x40000000, type: 0
3504KERN: kernel debugger extension "debugger/run_on_exit/v1": loaded
3505KERN: kernel debugger extension "debugger/invalidate_on_exit/v1": loaded
3506KERN: kernel debugger extension "debugger/hangman/v1": loaded
3507KERN: kernel debugger extension "debugger/usb_keyboard/v1": loaded
3508KERN: add_memory_type_range(85, 0xb0000000, 0x1000000, 1)
3509KERN: set MTRRs to:
3510KERN: mtrr: 0: base: 0x8e400000, size: 0x400000, type: 0
3511KERN: mtrr: 1: base: 0xc0000000, size: 0x40000000, type: 0
3512KERN: mtrr: 2: base: 0xa0000000, size: 0x20000000, type: 1
3513KERN: module: Search for bus_managers/ide/controller/driver_v1 failed.
3514KERN: publish device: node 0xffffffff9e855510, path random, module bus_managers/random/device_v1
3515KERN: publish device: node 0xffffffff9e855510, path urandom, module bus_managers/random/device_v1
3516KERN: module: Search for bus_managers/ide/controller/driver_v1 failed.
3517KERN: loading dependent module bus_managers/ide/controller/driver_v1 of busses/ata/silicon_image_3112/driver_v1 failed!
3518KERN: module: Search for bus_managers/ide/controller/driver_v1 failed.
3519KERN: loading dependent module bus_managers/ide/controller/driver_v1 of busses/ata/legacy_sata/driver_v1 failed!
3520KERN: module: Search for bus_managers/ide/controller/driver_v1 failed.
3521KERN: loading dependent module bus_managers/ide/controller/driver_v1 of busses/ata/generic_ide_pci/driver_v1 failed!
3522KERN: module: Search for bus_managers/ide/controller/driver_v1 failed.
3523KERN: loading dependent module bus_managers/ide/controller/driver_v1 of generic/ata_adapter/v1 failed!
3524KERN: loading dependent module generic/ata_adapter/v1 of busses/ata/it8211/driver_v1 failed!
3525KERN: module: Search for bus_managers/ide/controller/driver_v1 failed.
3526KERN: loading dependent module bus_managers/ide/controller/driver_v1 of busses/ata/silicon_image_3112/driver_v1 failed!
3527KERN: module: Search for bus_managers/ide/controller/driver_v1 failed.
3528KERN: loading dependent module bus_managers/ide/controller/driver_v1 of busses/ata/legacy_sata/driver_v1 failed!
3529KERN: module: Search for bus_managers/ide/controller/driver_v1 failed.
3530KERN: loading dependent module bus_managers/ide/controller/driver_v1 of busses/ata/generic_ide_pci/driver_v1 failed!
3531KERN: module: Search for bus_managers/ide/controller/driver_v1 failed.
3532KERN: loading dependent module bus_managers/ide/controller/driver_v1 of generic/ata_adapter/v1 failed!
3533KERN: loading dependent module generic/ata_adapter/v1 of busses/ata/it8211/driver_v1 failed!
3534KERN: publish device: node 0xffffffff9e86d290, path power/button/power, module drivers/power/acpi_button/device_v1
3535KERN: publish device: node 0xffffffff9e86d0b0, path power/acpi_battery/0, module drivers/power/acpi_battery/device_v1
3536KERN: publish device: node 0xffffffff9e870e78, path power/button/power_fixed, module drivers/power/acpi_button/device_v1
3537KERN: REG: Failed to open shadow passwd DB file "/etc/shadow": No such file or directory
3538KERN: register_domain(5, internet6)
3539KERN: unregister_domain(0xffffffff9eef6e80, 5, internet6)
3540KERN: register_domain(1, internet)
3541KERN: unregister_domain(0xffffffff9eef6e00, 1, internet)
3542KERN: register_domain(9, unix)
3543KERN: unregister_domain(0xffffffff9eef6d80, 9, unix)
3544KERN: register_domain(5, internet6)
3545KERN: unregister_domain(0xffffffff9eef6b00, 5, internet6)
3546KERN: register_domain(5, internet6)
3547KERN: unregister_domain(0xffffffff9eef6980, 5, internet6)
3548KERN: register_domain(5, internet6)
3549KERN: unregister_domain(0xffffffff9eef6980, 5, internet6)
3550KERN: register_domain(5, internet6)
3551KERN: register_domain(4, link)
3552KERN: unregister_domain(0xffffffff9eef6900, 4, link)
3553KERN: unregister_domain(0xffffffff9eee9480, 5, internet6)
3554KERN: register_domain(5, internet6)
3555KERN: unregister_domain(0xffffffff9eef6900, 5, internet6)
3556KERN: register_domain(1, internet)
3557KERN: unregister_domain(0xffffffff9eef6900, 1, internet)
3558KERN: register_domain(9, unix)
3559KERN: unregister_domain(0xffffffff9eef6900, 9, unix)
3560KERN: register_domain(5, internet6)
3561KERN: unregister_domain(0xffffffff9eef6900, 5, internet6)
3562KERN: register_domain(5, internet6)
3563KERN: unregister_domain(0xffffffff9eef6900, 5, internet6)
3564KERN: register_domain(5, internet6)
3565KERN: unregister_domain(0xffffffff9eef6900, 5, internet6)
3566KERN: register_domain(1, internet)
3567KERN: unregister_domain(0xffffffff9eee9480, 1, internet)
3568KERN: package_daemon [12581045: 492] root at "/boot" (device: 3, noKERN: de: 131072) registered
3569KERN: package_daemon [12581304: 492] volume at "/boot/system" registered
3570KERN: package_daemon [12581773: 492] volume at "/boot/home/config" registered
3571KERN: register_domain(5, internet6)
3572KERN: unregister_domain(0xffffffff9eef6900, 5, internet6)
3573KERN: register_domain(1, internet)
3574KERN: unregister_domain(0xffffffff9eef6900, 1, internet)
3575KERN: register_domain(9, unix)
3576KERN: unregister_domain(0xffffffff9eef6900, 9, unix)
3577KERN: register_domain(5, internet6)
3578KERN: unregister_domain(0xffffffff9eef6900, 5, internet6)
3579KERN: register_domain(5, internet6)
3580KERN: unregister_domain(0xffffffff9eef6900, 5, internet6)
3581KERN: register_domain(5, internet6)
3582KERN: unregister_domain(0xffffffff9eef6900, 5, internet6)
3583KERN: register_domain(1, internet)
3584KERN: unregister_domain(0xffffffff9eee9480, 1, internet)
3585KERN: register_domain(5, internet6)
3586KERN: unregister_domain(0xffffffff9eef6900, 5, internet6)
3587KERN: register_domain(1, internet)
3588KERN: unregister_domain(0xffffffff9eef6900, 1, internet)
3589KERN: register_domain(9, unix)
3590KERN: unregister_domain(0xffffffff9eef6900, 9, unix)
3591KERN: register_domain(5, internet6)
3592KERN: unregister_domain(0xffffffff9eef6900, 5, internet6)
3593KERN: register_domain(5, internet6)
3594KERN: unregister_domain(0xffffffff9eef6900, 5, internet6)
3595KERN: register_domain(5, internet6)
3596KERN: unregister_domain(0xffffffff9eef6900, 5, internet6)
3597KERN: register_domain(5, internet6)
3598KERN: unregister_domain(0xffffffff9eee9480, 5, internet6)
3599KERN: register_domain(5, internet6)
3600KERN: unregister_domain(0xffffffff9eef6900, 5, internet6)
3601KERN: register_domain(1, internet)
3602KERN: unregister_domain(0xffffffff9eef6900, 1, internet)
3603KERN: register_domain(9, unix)
3604KERN: unregister_domain(0xffffffff9eef6900, 9, unix)
3605KERN: register_domain(5, internet6)
3606KERN: unregister_domain(0xffffffff9eef6900, 5, internet6)
3607KERN: register_domain(5, internet6)
3608KERN: unregister_domain(0xffffffff9eef6900, 5, internet6)
3609KERN: register_domain(5, internet6)
3610KERN: unregister_domain(0xffffffff9eef6900, 5, internet6)
3611KERN: register_domain(1, internet)
3612KERN: unregister_domain(0xffffffff9eee9480, 1, internet)
3613KERN: register_domain(5, internet6)
3614KERN: unregister_domain(0xffffffff9eef6580, 5, internet6)
3615KERN: register_domain(1, internet)
3616KERN: unregister_domain(0xffffffff9eef6580, 1, internet)
3617KERN: register_domain(9, unix)
3618KERN: unregister_domain(0xffffffff9eef6580, 9, unix)
3619KERN: register_domain(5, internet6)
3620KERN: unregister_domain(0xffffffff9eef6580, 5, internet6)
3621KERN: register_domain(5, internet6)
3622KERN: unregister_domain(0xffffffff9eef6580, 5, internet6)
3623KERN: register_domain(5, internet6)
3624KERN: unregister_domain(0xffffffff9eef6580, 5, internet6)
3625KERN: register_domain(1, internet)
3626KERN: register_domain(5, internet6)
3627KERN: vesa: init_hardware()
3628KERN: Radeon - init_hardware: Version: 5.1.6.0
3629KERN: Radeon - Radeon_CardDetect: no supported devices found
3630KERN: devfs: "intel_810" api_version missing
3631KERN: i810: init_hardware() - no supported devices
3632KERN: framebuffer: init_hardware()
3633KERN: framebuffer: init_driver()
3634KERN: framebuffer: publish_devices()
3635KERN: framebuffer: find_device()
3636KERN: loaded driver /boot/system/add-ons/kernel/drivers/dev/graphics/framebuffer
3637KERN: intel_extreme: CALLED status_t init_hardware()
3638KERN: radeon_hd: init_hardware
3639KERN: radeon_hd: init_driver
3640KERN: radeon_hd: init_driver: GPU(0) Radeon HD 7920, revision = 0x0
3641KERN: radeon_hd: publish_devices
3642KERN: radeon_hd: find_device
3643KERN: loaded driver /boot/system/add-ons/kernel/drivers/dev/graphics/radeon_hd
3644KERN: loaded driver /boot/system/add-ons/kernel/drivers/dev/net/pegasus
3645KERN: add_memory_type_range(3995, 0xb0000000, 0x10000000, 0)
3646KERN: set MTRRs to:
3647KERN: mtrr: 0: base: 0x8e400000, size: 0x400000, type: 0
3648KERN: mtrr: 1: base: 0xb0000000, size: 0x10000000, type: 0
3649KERN: mtrr: 2: base: 0xc0000000, size: 0x40000000, type: 0
3650KERN: remove_memory_type_range(85, 0xb0000000, 0x1000000, 1)
3651KERN: set MTRRs to:
3652KERN: mtrr: 0: base: 0x8e400000, size: 0x400000, type: 0
3653KERN: mtrr: 1: base: 0xa0000000, size: 0x20000000, type: 0
3654KERN: mtrr: 2: base: 0xc0000000, size: 0x40000000, type: 0
3655KERN: add_memory_type_range(3995, 0xb0000000, 0x10000000, 1)
3656KERN: set MTRRs to:
3657KERN: mtrr: 0: base: 0x8e400000, size: 0x400000, type: 0
3658KERN: mtrr: 1: base: 0xc0000000, size: 0x40000000, type: 0
3659KERN: mtrr: 2: base: 0xa0000000, size: 0x20000000, type: 1
3660KERN: framebuffer: framebuffer_init() completed successfully!
3661KERN: framebuffer: acc: framebuffer.accelerant
3662KERN: slab memory manager: created area 0xffffffff8c801000 (3997)
3663KERN: Test: and [file_exists [/system/bin/FirstBootPrompt], or [not [file_exists [/boot/home/config/settings/Locale settings]], readonly ]] -> 0
3664KERN: app_server: Finding best mode for 1024x768 (8, 60 Hz, strict) failed
3665KERN: app_server: Finding best mode for 800x600 (8, 60 Hz) failed
3666KERN: app_server: Use 1800x795 (8) instead.
3667KERN: loaded driver /boot/system/add-ons/kernel/drivers/dev/net/usb_ecm
3668KERN: package_daemon [12879127: 514] Failed to open packages activation file: No such file or directory
3669KERN: package_daemon [12879415: 514] Failed to get activated packages info from activated packages file. Assuming all package files in package directory are activated.
3670KERN: package_daemon [12879917: 514] latest volume state:
3671KERN: package_daemon [12880078: 514] active package: "giflib-5.1.2-2-x86_64.hpkg"
3672KERN: package_daemon [12880287: 514] active package: "curl-7.52.1-1-x86_64.hpkg"
3673KERN: package_daemon [12880494: 514] active package: "xz_utils-5.2.2-2-x86_64.hpkg"
3674KERN: package_daemon [12880717: 514] active package: "sharutils-4.15.2-2-x86_64.hpkg"
3675KERN: package_daemon [12880939: 514] active package: "openssl-1.0.2j-1-x86_64.hpkg"
3676KERN: package_daemon [12881158: 514] active package: "m4-1.4.17-3-x86_64.hpkg"
3677KERN: package_daemon [12881365: 514] active package: "libmodplug-0.8.8.5-4-x86_64.hpkg"
3678KERN: package_daemon [12881591: 514] active package: "git-2.11.0-1-x86_64.hpkg"
3679KERN: package_daemon [12881796: 514] active package: "curl_devel-7.52.1-1-x86_64.hpkg"
3680KERN: package_daemon [12882024: 514] active package: "zip-3.0-3-x86_64.hpkg"
3681KERN: package_daemon [12882228: 514] active package: "speex-1.2~rc2-3-x86_64.hpkg"
3682KERN: package_daemon [12882445: 514] active package: "openssl_devel-1.0.2j-1-x86_64.hpkg"
3683KERN: package_daemon [12882684: 514] active package: "make-4.1-1-x86_64.hpkg"
3684KERN: package_daemon [12882883: 514] active package: "libogg-1.3.2-3-x86_64.hpkg"
3685KERN: package_daemon [12883094: 514] active package: "git_arch-2.11.0-1-x86_64.hpkg"
3686KERN: package_daemon [12883320: 514] active package: "cvsps-2.2b1-1-x86_64.hpkg"
3687KERN: package_daemon [12883529: 514] active package: "zlib-1.2.8-4-x86_64.hpkg"
3688KERN: package_daemon [12883739: 514] active package: "speex_devel-1.2~rc2-3-x86_64.hpkg"
3689KERN: package_daemon [12883969: 514] active package: "p7zip-9.20.1-6-x86_64.hpkg"
3690KERN: package_daemon [12884180: 514] active package: "libpcap-1.8.1-1-x86_64.hpkg"
3691KERN: package_daemon [12884400: 514] active package: "haiku-r1~alpha4_pm_hrev50876-1-x86_64.hpkg"
3692KERN: package_daemon [12884654: 514] active package: "git_cvs-2.11.0-1-x86_64.hpkg"
3693KERN: package_daemon [12884877: 514] active package: "diffutils-3.5-1-x86_64.hpkg"
3694KERN: package_daemon [12885100: 514] active package: "zlib_devel-1.2.8-4-x86_64.hpkg"
3695KERN: package_daemon [12885320: 514] active package: "sqlite-3.15.2.0-1-x86_64.hpkg"
3696KERN: package_daemon [12885548: 514] active package: "patch-2.7.5-1-x86_64.hpkg"
3697KERN: package_daemon [12885764: 514] active package: "man-1.6g-4-x86_64.hpkg"
3698KERN: package_daemon [12885969: 514] active package: "libpcre-8.39-2-x86_64.hpkg"
3699KERN: package_daemon [12886182: 514] active package: "haikuwebkit-1.5.3-1-x86_64.hpkg"
3700KERN: package_daemon [12886408: 514] active package: "git_daemon-2.11.0-1-x86_64.hpkg"
3701KERN: package_daemon [12886632: 514] active package: "makefile_engine-r1~alpha4_pm_hrev50876-1-any.hpkg"
3702KERN: package_daemon [12886912: 514] active package: "expat-2.2.0-2-x86_64.hpkg"
3703KERN: package_daemon [12887129: 514] active package: "autoconf-2.69-6-x86_64.hpkg"
3704KERN: package_daemon [12887346: 514] active package: "tar-1.29-2-x86_64.hpkg"
3705KERN: package_daemon [12887553: 514] active package: "mesa-13.0.2-1-x86_64.hpkg"
3706KERN: package_daemon [12887784: 514] active package: "libpng16-1.6.26-1-x86_64.hpkg"
3707KERN: package_daemon [12888005: 514] active package: "icu-57.1-1-x86_64.hpkg"
3708KERN: package_daemon [12888206: 514] active package: "haiku_loader-r1~alpha4_pm_hrev50876-1-x86_64.hpkg"
3709KERN: package_daemon [12888479: 514] active package: "git_email-2.11.0-1-x86_64.hpkg"
3710KERN: package_daemon [12888701: 514] active package: "ffmpeg-3.2.2-1-x86_64.hpkg"
3711KERN: package_daemon [12888917: 514] active package: "jpeg_debuginfo-9b-4-x86_64.hpkg"
3712KERN: package_daemon [12889142: 514] active package: "automake-1.15.0-1-x86_64.hpkg"
3713KERN: package_daemon [12889361: 514] active package: "tcpdump-4.8.1-1-x86_64.hpkg"
3714KERN: pacKERN: kage_daemon [12889578: 514] active package: "mesa_devel-13.0.2-1-x86_64.hpkg"
3715KERN: package_daemon [12889803: 514] active package: "screenfetch-3.7.0-1-any.hpkg"
3716KERN: package_daemon [12890019: 514] active package: "libpng16_devel-1.6.26-1-x86_64.hpkg"
3717KERN: package_daemon [12890254: 514] active package: "jam-2.5_2012_10_12-2-x86_64.hpkg"
3718KERN: package_daemon [12890482: 514] active package: "webpositive-r1~alpha4_pm_hrev50876-1-x86_64.hpkg"
3719KERN: package_daemon [12890751: 514] active package: "git_svn-2.11.0-1-x86_64.hpkg"
3720KERN: package_daemon [12890968: 514] active package: "ffmpeg_devel-3.2.2-1-x86_64.hpkg"
3721KERN: package_daemon [12891195: 514] active package: "bash-4.4.005-2-x86_64.hpkg"
3722KERN: package_daemon [12891406: 514] active package: "texinfo-6.1-1-x86_64.hpkg"
3723KERN: package_daemon [12891615: 514] active package: "pe-2.4.5-3-x86_64.hpkg"
3724KERN: package_daemon [12891815: 514] active package: "mkdepend-1.7-4-x86_64.hpkg"
3725KERN: package_daemon [12892026: 514] active package: "libsolv-0.3.0_haiku_2014_12_22-1-x86_64.hpkg"
3726KERN: package_daemon [12892285: 514] active package: "jasper-1.900.5-2-x86_64.hpkg"
3727KERN: package_daemon [12892502: 514] active package: "haiku_devel-r1~alpha4_pm_hrev50876-1-x86_64.hpkg"
3728KERN: package_daemon [12892772: 514] active package: "glu-9.0.0-5-x86_64.hpkg"
3729KERN: package_daemon [12892975: 514] active package: "findutils-4.4.2-4-x86_64.hpkg"
3730KERN: package_daemon [12893193: 514] active package: "binutils-2.26.1_2016_07_22-3-x86_64.hpkg"
3731KERN: package_daemon [12893441: 514] active package: "tiff4-4.0.7-1-x86_64.hpkg"
3732KERN: package_daemon [12893654: 514] active package: "perl-5.18.2-2-x86_64.hpkg"
3733KERN: package_daemon [12893866: 514] active package: "mpc-1.0.3-2-x86_64.hpkg"
3734KERN: package_daemon [12894068: 514] active package: "libtheora-1.1.1-5-x86_64.hpkg"
3735KERN: package_daemon [12894287: 514] active package: "jpeg-9b-4-x86_64.hpkg"
3736KERN: package_daemon [12894509: 514] active package: "glu_devel-9.0.0-5-x86_64.hpkg"
3737KERN: package_daemon [12894729: 514] active package: "flex-2.6.1-2-x86_64.hpkg"
3738KERN: package_daemon [12894955: 514] active package: "bison-3.0.4-3-x86_64.hpkg"
3739KERN: package_daemon [12895164: 514] active package: "unzip-6.0-3-x86_64.hpkg"
3740KERN: package_daemon [12895366: 514] active package: "pkgconfig-0.29.1-1-x86_64.hpkg"
3741KERN: package_daemon [12895593: 514] active package: "mpfr-3.1.4-4-x86_64.hpkg"
3742KERN: package_daemon [12895798: 514] active package: "libtool-2.4.2-2-x86_64.hpkg"
3743KERN: package_daemon [12896019: 514] active package: "jpeg_devel-9b-4-x86_64.hpkg"
3744KERN: package_daemon [12896239: 514] active package: "gmp-6.1.2-1-x86_64.hpkg"
3745KERN: package_daemon [12896442: 514] active package: "weather-0.1.1_git-4-x86_64.hpkg"
3746KERN: package_daemon [12896665: 514] active package: "freetype-2.7-1-x86_64.hpkg"
3747KERN: package_daemon [12896876: 514] active package: "bzip2-1.0.6-5-x86_64.hpkg"
3748KERN: package_daemon [12897083: 514] active package: "vision-0.9.8-2-x86_64.hpkg"
3749KERN: package_daemon [12897294: 514] active package: "python-2.7.12-1-x86_64.hpkg"
3750KERN: package_daemon [12897507: 514] active package: "nano-2.7.2-1-x86_64.hpkg"
3751KERN: package_daemon [12897712: 514] active package: "libtool_libltdl-2.4.2-2-x86_64.hpkg"
3752KERN: package_daemon [12897947: 514] active package: "less-481-1-x86_64.hpkg"
3753KERN: package_daemon [12898148: 514] active package: "grep-2.24-1-x86_64.hpkg"
3754KERN: package_daemon [12898350: 514] active package: "freetype_devel-2.7-1-x86_64.hpkg"
3755KERN: package_daemon [12898576: 514] active package: "bzip2_devel-1.0.6-5-x86_64.hpkg"
3756KERN: package_daemon [12898801: 514] active package: "vl_gothic-20141206-1-any.hpkg"
3757KERN: package_daemon [12899020: 514] active package: "qrencode-3.4.4-2-x86_64.hpkg"
3758KERN: package_daemon [12899239: 514] active package: "nasm-2.12.01-1-x86_64.hpkg"
3759KERN: package_daemon [12899456: 514] active package: "libvorbis-1.3.5-3-x86_64.hpkg"
3760KERN: package_daemon [12899678: 514] active package: "libedit-2015_03_21_3.1-5-x86_64.hpkg"
3761KERN: package_daemon [12899914: 514] active package: "groff-1.20.1-3-x86_64.hpkg"
3762KERN: package_daemon [12900125: 514] active package: "gawk-4.1.0-1-x86_64.hpkg"
3763KERN: package_daemon [12900337: 514] active package: "ca_root_certificates-2015_10_28-1-any.hpkg"
3764KERN: package_daemon [12900590: 514] active package: "readline-7.0-1-x86_64.hpkg"
3765KERN: package_daemon [12900800: 514] active package: "ncurses6-6.0-2-x86_64.hpkg"
3766KERN: package_daemon [12901011: 514] active package: "libvpx3-1.5.0-1-x86_64.hpkg"
3767KERN: package_daemon [12901230: 514] active package: "milkytracker-0.90.86-2-x86_64.hpkg"
3768KERN: package_daemon [12901466: 514] active package: "libexecinfo-1.1-1-x86_64.hpkg"
3769KERN: package_daemon [12901684: 514] active package: "gcc-5.4.0_2016_06_04-4-x86_64.hpkg"
3770KERN: package_daemon [12901916: 514] active package: "cdrtools-3.02~a07-1-x86_64.hpkg"
3771KERN: package_daemon [12902139: 514] active package: "wget-1.18-2-x86_64.hpkg"
3772KERN: package_daemon [12902347: 514] active package: "readline6-6.3.8-1-x86_64.hpkg"
3773KERN: package_daemon [12902565: 514] active package: "netcat-1.10-2-x86_64.hpkg"
3774KERN: package_daemon [12902773: 514] active package: "libwebp-0.5.1-2-x86_64.hpkg"
3775KERN: package_daemon [12902986: 514] active package: "libffi-3.2.1-3-x86_64.hpkg"
3776KERN: package_daemon [12903207: 514] active package: "gcc_syslibs-5.4.0_2016_06_04-4-x86_64.hpkg"
3777KERN: package_daemon [12903460: 514] active package: "coreutils-8.24-1-x86_64.hpkg"
3778KERN: package_daemon [12903678: 514] active package: "which-2.21-3-x86_64.hpkg"
3779KERN: package_daemon [12904032: 514] active package: "scons-2.5.1-2-x86_64.hpkg"
3780KERN: package_daemon [12904247: 514] active package: "noto-20160613-4-any.hpkg"
3781KERN: package_daemon [12904473: 514] active package: "libxml2-2.9.3-4-x86_64.hpkg"
3782KERN: package_daemon [12904694: 514] active package: "libicns-0.8.1-5-x86_64.hpkg"
3783KERN: package_daemon [12904908: 514] active package: "gutenprint-5.2.11-3-x86_64.hpkg"
3784KERN: package_daemon [12905133: 514] active package: "gettext_libintl-0.19.8.1-3-x86_64.hpkg"
3785KERN: package_daemon [12905375: 514] active package: "ctags-5.8-4-x86_64.hpkg"
3786KERN: package_daemon [12905580: 514] active package: "wpa_supplicant-2.0-5-x86_64.hpkg"
3787KERN: package_daemon [12905812: 514] active package: "sed-4.2.1-6-x86_64.hpkg"
3788KERN: package_daemon [12906038: 514] active package: "openssh-7.4p1-1-x86_64.hpkg"
3789KERN: package_daemon [12906258: 514] active package: "libxslt-1.1.28-8-x86_64.hpkg"
3790KERN: package_daemon [12906475: 514] active package: "libiconv-1.13.1-8-x86_64.hpkg"
3791KERN: package_daemon [12906695: 514] active package: "gzip-1.8-1-x86_64.hpkg"
3792KERN: package_daemon [12906916: 514] The latest volume state is also the currently active one
3793KERN: package_daemon [12907201: 514] Volume::InitialVerify((nil), (nil))
3794KERN: [33musb_asix:[0m00.12.916:init_driver::ver.0.10.1
3795KERN: loaded driver /boot/system/add-ons/kernel/drivers/dev/net/usb_asix
3796KERN: [rtl81xx] (re) bus_alloc_resource(3, [24], 0x0, 0xffffffffffffffff, 0x1,0x2)
3797KERN: add_memory_type_range(4269, 0xd0004000, 0x20000, 0)
3798KERN: set MTRRs to:
3799KERN: mtrr: 0: base: 0x8e400000, size: 0x400000, type: 0
3800KERN: mtrr: 1: base: 0xc0000000, size: 0x40000000, type: 0
3801KERN: mtrr: 2: base: 0xa0000000, size: 0x20000000, type: 1
3802KERN: [rtl81xx] (re) MSI count : 1
3803KERN: [rtl81xx] (re) MSI-X count : 4
3804KERN: [rtl81xx] (re) bus_alloc_resource(3, [32], 0x0, 0xffffffffffffffff, 0x1,0x2)
3805KERN: add_memory_type_range(4270, 0xd0000000, 0x20000, 0)
3806KERN: set MTRRs to:
3807KERN: mtrr: 0: base: 0x8e400000, size: 0x400000, type: 0
3808KERN: mtrr: 1: base: 0xc0000000, size: 0x40000000, type: 0
3809KERN: mtrr: 2: base: 0xa0000000, size: 0x20000000, type: 1
3810KERN: add_memory_type_range(4271, 0xd0000000, 0x1000, 0)
3811KERN: set MTRRs to:
3812KERN: mtrr: 0: base: 0x8e400000, size: 0x400000, type: 0
3813KERN: mtrr: 1: base: 0xc0000000, size: 0x40000000, type: 0
3814KERN: mtrr: 2: base: 0xa0000000, size: 0x20000000, type: 1
3815KERN: allocate_io_interrupt_vectors: allocated 1 vectors starting from 26
3816KERN: msi_allocate_vectors: allocated 1 vectors starting from 26
3817KERN: msix configured for 1 vectors
3818KERN: [rtl81xx] (re) Using 1 MSI-X message
3819KERN: [rtl81xx] (re) bus_alloc_resource(1, [1], 0x0, 0xffffffffffffffff, 0x1,0x2)
3820KERN: [rtl81xx] (re) ASPM disabled
3821KERN: [rtl81xx] (re) Chip rev. 0x48000000
3822KERN: [rtl81xx] (re) MAC rev. 0x00000000
3823KERN: package_daemon [13042650: 514] Volume::InitialVerify(): volume at "/boot/system" is consistent
3824KERN: package_daemon [13043998: 514] Failed to open packages activation file: No such file or directory
3825KERN: package_daemon [13044317: 514] Failed to get activated packages info from activated packages file. AKERN: ssuming all package files in package directory are activated.
3826KERN: package_daemon [13044758: 514] latest volume state:
3827KERN: package_daemon [13044909: 514] The latest volume state is also the currently active one
3828KERN: package_daemon [13045178: 514] Volume::InitialVerify(0x94c0d33960, (nil))
3829KERN: package_daemon [13049761: 514] Volume::InitialVerify(): volume at "/boot/home/config" is consistent
3830KERN: if_initname(0xffffffff82efa000, re, 16)
3831KERN: [rtl81xx] rtl81xx: /dev/net/rtl81xx/0
3832KERN: [rtl81xx] () Found MII: rgephy
3833KERN: [rtl81xx] () OUI 0x00e04c, model 0x0011, rev. 5
3834KERN: [rtl81xx] () ifmedia_add: Adding Entry...
3835KERN: Type: Ethernet
3836KERN: SubType: none
3837KERN: noneifmedia_add: Adding Entry...
3838KERN: Type: Ethernet
3839KERN: SubType: 10baseT/UTP
3840KERN: , 10baseTifmedia_add: Adding Entry...
3841KERN: Type: Ethernet
3842KERN: SubType: 10baseT/UTP
3843KERN: Shared Option[0]: full-duplex
3844KERN: , 10baseT-FDXifmedia_add: Adding Entry...
3845KERN: Type: Ethernet
3846KERN: SubType: 100baseTX
3847KERN: , 100baseTXifmedia_add: Adding Entry...
3848KERN: Type: Ethernet
3849KERN: SubType: 100baseTX
3850KERN: Shared Option[0]: full-duplex
3851KERN: , 100baseTX-FDXifmedia_add: Adding Entry...
3852KERN: Type: Ethernet
3853KERN: SubType: 1000baseT
3854KERN: Shared Option[0]: full-duplex
3855KERN: , 1000baseT-FDXifmedia_add: Adding Entry...
3856KERN: Type: Ethernet
3857KERN: SubType: 1000baseT
3858KERN: Shared Option[0]: full-duplex
3859KERN: , 1000baseT-FDX-masterifmedia_add: Adding Entry...
3860KERN: Type: Ethernet
3861KERN: SubType: autoselect
3862KERN: , auto
3863KERN: ifmedia_set: target Type: Ethernet
3864KERN: SubType: autoselect
3865KERN: ifmedia_set: setting to Type: Ethernet
3866KERN: SubType: autoselect
3867KERN: msi-x enabled: 0x8003
3868KERN: rtl81xx: init_driver(0xffffffff8d054df0) at 6
3869KERN: loaded driver /boot/system/add-ons/kernel/drivers/dev/net/rtl81xx
3870KERN: loaded driver /boot/system/add-ons/kernel/drivers/dev/input/usb_hid
3871KERN: loaded driver /boot/system/add-ons/kernel/drivers/dev/input/wacom
3872KERN: ps2_hid: init_hardware
3873KERN: ps2_hid: init_driver
3874KERN: ps2_hid: publish_devices
3875KERN: ps2_hid: uninit_driver
3876KERN: loaded driver /boot/system/add-ons/kernel/drivers/dev/input/ps2_hid
3877KERN: [33musb_davicom:[0m00.14.106:init_driver::ver.0.9.5
3878KERN: loaded driver /boot/system/add-ons/kernel/drivers/dev/net/usb_davicom
3879KERN: sis19x:00.14.118:init_hardware::SiS19X:init_hardware()
3880KERN: etherpci: init_driver init_driver: etherpci not found
3881KERN: [net/rtl81xx/0] compat_open(0x2)
3882KERN: ifmedia_ioctl: switching re to Type: Ethernet
3883KERN: SubType: autoselect
3884KERN: /dev/net/rtl81xx/0: media change, media 0x22 quality 1000 speed 10000000
3885KERN: ps2: devfs_publish_device input/touchpad/ps2/synaptics_0, status = 0x00000000
3886KERN: ps2: devfs_publish_device input/keyboard/at/0, status = 0x00000000
3887KERN: ps2: keyboard found
3888KERN: remove_memory_type_range(269, 0xff000000, 0x1000, 0)
3889KERN: set MTRRs to:
3890KERN: mtrr: 0: base: 0x8e400000, size: 0x400000, type: 0
3891KERN: mtrr: 1: base: 0xc0000000, size: 0x40000000, type: 0
3892KERN: mtrr: 2: base: 0xa0000000, size: 0x20000000, type: 1
3893KERN: add_memory_type_range(7174, 0xff000000, 0x1000, 0)
3894KERN: set MTRRs to:
3895KERN: mtrr: 0: base: 0x8e400000, size: 0x400000, type: 0
3896KERN: mtrr: 1: base: 0xc0000000, size: 0x40000000, type: 0
3897KERN: mtrr: 2: base: 0xa0000000, size: 0x20000000, type: 1
3898KERN: auich: init_hardware()
3899KERN: echo3g: init_hardware()
3900KERN: echo3g: no card found
3901KERN: sis7018:init_hardware:ver:2.0.2
3902KERN: emuxki: init_hardware()
3903KERN: auvia: init_hardware()
3904KERN: pci_reserve_device(0, 1, 1, hda)
3905KERN: HDA: Detected controller @ PCI:0:1:1, IRQ:18, type 1002/9902 (144d/c0da)
3906KERN: pci_reserve_device(0, 20, 2, hda)
3907KERN: bfs: bfs_create_index:2135: File or Directory already exists
3908Last message repeated 1 time
3909KERN: HDA: Detected controller @ PCI:0:20:2, IRQ:16, type 1022/780d (144d/c0da)
3910KERN: loaded driver /boot/system/add-ons/kernel/drivers/dev/audio/hmulti/hda
3911KERN: module: Search for bus_managers/ide/controller/driver_v1 failed.
3912KERN: loading dependent module bus_managers/ide/controller/driver_v1 of busses/ata/silicon_image_3112/driver_v1 failed!
3913KERN: module: Search for bus_managers/ide/controller/driver_v1 failed.
3914KERN: loading dependent module bus_managers/ide/controller/driver_v1 of busses/ata/legacy_sata/driver_v1 failed!
3915KERN: module: Search for bus_managers/ide/controller/driver_v1 failed.
3916KERN: loading dependent module bus_managers/ide/controller/driver_v1 of busses/ata/generic_ide_pci/driver_v1 failed!
3917KERN: module: Search for bus_managers/ide/controller/driver_v1 failed.
3918KERN: loading dependent module bus_managers/ide/controller/driver_v1 of generic/ata_adapter/v1 failed!
3919KERN: loading dependent module generic/ata_adapter/v1 of busses/ata/it8211/driver_v1 failed!
3920KERN: module: Search for bus_managers/ide/controller/driver_v1 failed.
3921KERN: loading dependent module bus_managers/ide/controller/driver_v1 of busses/ata/silicon_image_3112/driver_v1 failed!
3922KERN: module: Search for bus_managers/ide/controller/driver_v1 failed.
3923KERN: loading dependent module bus_managers/ide/controller/driver_v1 of busses/ata/legacy_sata/driver_v1 failed!
3924KERN: module: Search for bus_managers/ide/controller/driver_v1 failed.
3925KERN: loading dependent module bus_managers/ide/controller/driver_v1 of busses/ata/generic_ide_pci/driver_v1 failed!
3926KERN: module: Search for bus_managers/ide/controller/driver_v1 failed.
3927KERN: loading dependent module bus_managers/ide/controller/driver_v1 of generic/ata_adapter/v1 failed!
3928KERN: loading dependent module generic/ata_adapter/v1 of busses/ata/it8211/driver_v1 failed!
3929KERN: loaded driver /boot/system/add-ons/kernel/drivers/dev/bus/usb_raw
3930KERN: add_memory_type_range(7415, 0xfeb44000, 0x4000, 0)
3931KERN: set MTRRs to:
3932KERN: mtrr: 0: base: 0x8e400000, size: 0x400000, type: 0
3933KERN: mtrr: 1: base: 0xc0000000, size: 0x40000000, type: 0
3934KERN: mtrr: 2: base: 0xa0000000, size: 0x20000000, type: 1
3935KERN: hda: enabling PCI bus mastering
3936KERN: hda: enabling PCI memory access
3937KERN: allocate_io_interrupt_vectors: allocated 1 vectors starting from 27
3938KERN: msi_allocate_vectors: allocated 1 vectors starting from 27
3939KERN: msi enabled: 0x0081
3940KERN: hda: using MSI vector 27
3941KERN: hda: DMA snooping: no
3942KERN: hda: HDA v0.0, O:0/I:0/B:0, #SDO:1, 64bit:no
3943KERN: add_memory_type_range(7416, 0x1b448000, 0x1000, 0)
3944KERN: set MTRRs to:
3945KERN: mtrr: 0: base: 0x1b448000, size: 0x1000, type: 0
3946KERN: mtrr: 1: base: 0x8e400000, size: 0x400000, type: 0
3947KERN: mtrr: 2: base: 0xc0000000, size: 0x40000000, type: 0
3948KERN: mtrr: 3: base: 0xa0000000, size: 0x20000000, type: 1
3949KERN: hda: Codec 0 Vendor: 1002 Product: aa01, Revision: 1.0.3.0 Quirks: 0700
3950KERN: hda: Audio Group: Output delay: 0 samples, Input delay: 0 samples, Beep Generator: no
3951KERN: hda: #GPIO: 0, #GPO: 0, #GPI: 0, unsol: no, wake: no
3952KERN: hda: Supported formats: 16bits
3953KERN: hda: Supported rates: 32khz 44khz 48khz
3954KERN: hda: widget start 2, count 12
3955KERN: hda: 2: Audio output
3956KERN: hda: Supported formats: 16bits
3957KERN: hda: Supported rates: 32khz 44khz 48khz
3958KERN: hda: Supported power states:
3959KERN: hda: [Digital] [Stripe] [Stereo]
3960KERN: hda: 3: Pin complex
3961KERN: hda: [Output]
3962KERN: hda: Jack, HDMI Digital other out, Other digital, N/A, Association:15
3963KERN: hda: Supported power states:
3964KERN: hda: [Digital] [Conn. list] [Unsol. responses] [Stereo]
3965KERN: hda: Inputs: <2>
3966KERN: hda: 4: Audio output
3967KERN: hda: Supported formats: 16bits
3968KERN: hda: Supported rates: 32khz 44khz 48khz
3969KERN: hda: Supported power states:
3970KERN: hda: [Digital] [Stripe] [Stereo]
3971KERN: hda: 5: Pin complex
3972KERN: hda: [Output]
3973KERN: hda: None, HDMI Digital other out, Other digital, N/A, Association:15
3974KERN: hda: Supported power states:
3975KERN: hda: [Digital] [Conn. list] [Unsol. responses] [Stereo]
3976KERN: hda: Inputs: <4>
3977KERN: hda: 6: Audio output
3978KERN: hda: Supported formats: 16bits
3979KERN: hda: Supported rates: 32khz 44khz 48khz
3980KERN: hda: Supported power states:
3981KERN: hda: [Digital] [Stripe] [Stereo]
3982KERN: hda: 7: Pin complex
3983KERN: hda: [Output]
3984KERN: hda: None, HDMI Digital other out, Other digital, N/A, Association:15
3985KERN: hda: Supported power states:
3986KERN: hda: [Digital] [Conn. list] [Unsol. responses] [Stereo]
3987KERN: hda: Inputs: <6>
3988KERN: hda: 8: Audio output
3989KERN: hda: Supported formats: 16bits
3990KERN: hda: Supported rates: 32khz 44khz 48khz
3991KERN: hda: Supported power states:
3992KERN: hda: [Digital] [Stripe] [Stereo]
3993KERN: hda: 9: Pin complex
3994KERN: hda: [Output]
3995KERN: hda: None, HDMI Digital other out, Other digital, N/A, Association:15
3996KERN: hda: Supported power states:
3997KERN: hda: [Digital] [Conn. list] [Unsol. responses] [Stereo]
3998KERN: hda: Inputs: <8>
3999KERN: hda: 10: Audio output
4000KERN: hda: Supported formats: 16bits
4001KERN: hda: Supported rates: 32khz 44khz 48khz
4002KERN: hda: Supported power states:
4003KERN: hda: [Digital] [Stripe] [Stereo]
4004KERN: hda: 11: Pin complex
4005KERN: hda: [Output]
4006KERN: hda: None, HDMI Digital other out, Other digital, N/A, Association:15
4007KERN: hda: Supported power states:
4008KERN: hda: [Digital] [Conn. list] [Unsol. responses] [Stereo]
4009KERN: hda: Inputs: <10>
4010KERN: hda: 12: Audio output
4011KERN: hda: Supported formats: 16bits
4012KERN: hda: Supported rates: 32khz 44khz 48khz
4013KERN: hda: Supported power states:
4014KERN: hda: [Digital] [Stripe] [Stereo]
4015KERN: hda: 13: Pin complex
4016KERN: hda: [Output]
4017KERN: hda: None, HDMI Digital other out, Other digital, N/A, Association:15
4018KERN: hda: Supported power states:
4019KERN: hda: [Digital] [Conn. list] [Unsol. responses] [Stereo]
4020KERN: hda: Inputs: <12>
4021KERN: hda: build output tree: use mixer
4022KERN: hda: look at pin widget 3 (1 inputs)
4023KERN: hda: try widget 2: 0xffffffff9f28be08
4024KERN: hda: look at pin widget 5 (1 inputs)
4025KERN: hda: try widget 4: 0xffffffff9f28bf60
4026KERN: hda: look at pin widget 7 (1 inputs)
4027KERN: hda: try widget 6: 0xffffffff9f28c0b8
4028KERN: hda: look at pin widget 9 (1 inputs)
4029KERN: hda: try widget 8: 0xffffffff9f28c210
4030KERN: hda: look at pin widget 11 (1 inputs)
4031KERN: hda: try widget 10: 0xffffffff9f28c368
4032KERN: hda: look at pin widget 13 (1 inputs)
4033KERN: hda: try widget 12: 0xffffffff9f28c4c0
4034KERN: hda: try without mixer!
4035KERN: hda: build output tree: don't use mixer
4036KERN: hda: look at pin widget 3 (1 inputs)
4037KERN: hda: try widget 2: 0xffffffff9f28be08
4038KERN: hda: widget 2 is candidate
4039KERN: hda: output: added output widget 2
4040KERN: hda: add pin widget 3
4041KERN: hda: look at pin widget 5 (1 inputs)
4042KERN: hda: try widget 4: 0xffffffff9f28bf60
4043KERN: hda: widget 4 is candidate
4044KERN: hda: output: added output widget 4
4045KERN: hda: add pin widget 5
4046KERN: hda: look at pin widget 7 (1 inputs)
4047KERN: hda: try widget 6: 0xffffffff9f28c0b8
4048KERN: hda: widget 6 is candidate
4049KERN: hda: output: added output widget 6
4050KERN: hda: add pin widget 7
4051KERN: hda: look at pin widget 9 (1 inputs)
4052KERN: hda: try widget 8: 0xffffffff9f28c210
4053KERN: hda: widget 8 is candidate
4054KERN: hda: output: added output widget 8
4055KERN: hda: add pin widget 9
4056KERN: hda: look at pin widget 11 (1 inputs)
4057KERN: hda: try widget 10: 0xffffffff9f28c368
4058KERN: hda: widget 10 is candidate
4059KERN: hda: output: added output widget 10
4060KERN: hda: add pin widget 11
4061KERN: hda: look at pin widget 13 (1 inputs)
4062KERN: hda: try widget 12: 0xffffffff9f28c4c0
4063KERN: hda: widget 12 is candidate
4064KERN: hda: output: added output widget 12
4065KERN: hda: add pin widget 13
4066KERN: hda: build input tree
4067KERN: hda: build input tree failed
4068KERN: hda: build tree!
4069KERN: hda: Audiogroup:
4070KERN: hda: 2: Audio output
4071KERN: hda: Supported power states:
4072KERN: hda: [Digital] [Stripe] [Stereo]
4073KERN: hda: 3: Pin complex
4074KERN: hda: [Pres Detect][Output]
4075KERN: hda: Supported power states:
4076KERN: hda: [Digital] [Conn. list] [Unsol. responses] [Stereo]
4077KERN: hda: Inputs: <2>
4078KERN: hda: 4: Audio output
4079KERN: hda: Supported power states:
4080KERN: hda: [Digital] [Stripe] [Stereo]
4081KERN: hda: 5: Pin complex
4082KERN: hda: [Pres Detect][Output]
4083KERN: hda: Supported power states:
4084KERN: hda: [Digital] [Conn. list] [Unsol. responses] [Stereo]
4085KERN: hda: Inputs: <4>
4086KERN: hda: 6: Audio output
4087KERN: hda: Supported power states:
4088KERN: hda: [Digital] [Stripe] [Stereo]
4089KERN: hda: 7: Pin complex
4090KERN: hda: [Pres Detect][Output]
4091KERN: hda: Supported power states:
4092KERN: hda: [Digital] [Conn. list] [Unsol. responses] [Stereo]
4093KERN: hda: Inputs: <6>
4094KERN: hda: 8: Audio output
4095KERN: hda: Supported power states:
4096KERN: hda: [Digital] [Stripe] [Stereo]
4097KERN: hda: 9: Pin complex
4098KERN: hda: [Pres Detect][Output]
4099KERN: hda: Supported power states:
4100KERN: hda: [Digital] [Conn. list] [Unsol. responses] [Stereo]
4101KERN: hda: Inputs: <8>
4102KERN: hda: 10: Audio output
4103KERN: hda: Supported power states:
4104KERN: hda: [Digital] [Stripe] [Stereo]
4105KERN: hda: 11: Pin complex
4106KERN: hda: [Pres Detect][Output]
4107KERN: hda: Supported power states:
4108KERN: hda: [Digital] [Conn. list] [Unsol. responses] [Stereo]
4109KERN: hda: Inputs: <10>
4110KERN: hda: 12: Audio output
4111KERN: hda: Supported power states:
4112KERN: hda: [Digital] [Stripe] [Stereo]
4113KERN: hda: 13: Pin complex
4114KERN: hda: [Pres Detect][Output]
4115KERN: hda: Supported power states:
4116KERN: hda: [Digital] [Conn. list] [Unsol. responses] [Stereo]
4117KERN: hda: Inputs: <12>
4118KERN: hda: Enabled unsolicited responses on widget 3
4119KERN: hda: Enabled unsolicited responses on widget 5
4120KERN: hda: Enabled unsolicited responses on widget 7
4121KERN: hda: Enabled unsolicited responses on widget 9
4122KERN: hda: Enabled unsolicited responses on widget 11
4123KERN: hda: Enabled unsolicited responses on widget 13
4124KERN: hda: ENABLE pin widget 3
4125KERN: hda: ENABLE pin widget 5
4126KERN: hda: ENABLE pin widget 7
4127KERN: hda: ENABLE pin widget 9
4128KERN: hda: ENABLE pin widget 11
4129KERN: hda: ENABLE pin widget 13
4130KERN: hda: hda_audio_group_get_widgets failed for playback stream
4131KERN: hda: hda_audio_group_get_widgets failed for record stream
4132KERN: hda: streams playback 0x0000000000000000, record 0x0000000000000000
4133KERN: hda: Failed to setup new audio function group (No such device)!
4134KERN: hda: no active codec
4135KERN: remove_memory_type_range(7415, 0xfeb44000, 0x4000, 0)
4136KERN: set MTRRs to:
4137KERN: mtrr: 0: base: 0x1b448000, size: 0x1000, type: 0
4138KERN: mtrr: 1: base: 0x8e400000, size: 0x400000, type: 0
4139KERN: mtrr: 2: base: 0xc0000000, size: 0x40000000, type: 0
4140KERN: mtrr: 3: base: 0xa0000000, size: 0x20000000, type: 1
4141KERN: hda: ERROR: No such device(2147512327)
4142KERN: add_memory_type_range(7417, 0xfeb40000, 0x4000, 0)
4143KERN: set MTRRs to:
4144KERN: mtrr: 0: base: 0x1b448000, size: 0x1000, type: 0
4145KERN: mtrr: 1: base: 0x8e400000, size: 0x400000, type: 0
4146KERN: mtrr: 2: base: 0xc0000000, size: 0x40000000, type: 0
4147KERN: mtrr: 3: base: 0xa0000000, size: 0x20000000, type: 1
4148KERN: hda: enabling PCI bus mastering
4149KERN: hda: DMA snooping: no
4150KERN: hda: HDA v1.0, O:4/I:4/B:0, #SDO:1, 64bit:yes
4151KERN: add_memory_type_range(7418, 0x1b450000, 0x1000, 0)
4152KERN: set MTRRs to:
4153KERN: mtrr: 0: base: 0x1b448000, size: 0x1000, type: 0
4154KERN: mtrr: 1: base: 0x1b450000, size: 0x1000, type: 0
4155KERN: mtrr: 2: base: 0x8e400000, size: 0x400000, type: 0
4156KERN: mtrr: 3: base: 0xc0000000, size: 0x40000000, type: 0
4157KERN: mtrr: 4: base: 0xa0000000, size: 0x20000000, type: 1
4158KERN: hda: Codec 0 Vendor: 10ec Product: 0269, Revision: 1.0.2.2 Quirks: 0700
4159KERN: hda: Audio Group: Output delay: 15 samples, Input delay: 15 samples, Beep Generator: yes
4160KERN: hda: #GPIO: 2, #GPO: 0, #GPI: 0, unsol: yes, wake: no
4161KERN: hda: Supported formats: 16bits 20bits 24bits
4162KERN: hda: Supported rates: 32khz 44khz 48khz 88khz 96khz 192khz
4163KERN: hda: widget start 2, count 34
4164KERN: hda: 2: Audio output
4165KERN: hda: Supported formats: 16bits 20bits 24bits
4166KERN: hda: Supported rates: 44khz 48khz 96khz 192khz
4167KERN: hda: Supported power states: D0 D1 D2 D3
4168KERN: hda: [Power] [Format override] [Amplifier override] [Out amplifier] [Stereo]
4169KERN: hda: Out Amp: step size: 0.75 dB, # steps: 87, offset to 0 dB: 87
4170KERN: hda: 3: Audio output
4171KERN: hda: Supported formats: 16bits 20bits 24bits
4172KERN: hda: Supported rates: 44khz 48khz 96khz 192khz
4173KERN: hda: Supported power states: D0 D1 D2 D3
4174KERN: hda: [Power] [Format override] [Amplifier override] [Out amplifier] [Stereo]
4175KERN: hda: Out Amp: step size: 0.75 dB, # steps: 87, offset to 0 dB: 87
4176KERN: hda: 4: Vendor defined
4177KERN: hda: Supported power states:
4178KERN: hda: 5: Vendor defined
4179KERN: hda: Supported power states:
4180KERN: hda: 6: Audio output
4181KERN: hda: Supported formats: 16bits 20bits 24bits
4182KERN: hda: Supported rates: 32khz 44khz 48khz 88khz 96khz 192khz
4183KERN: hda: Supported power states: D0 D1 D2 D3
4184KERN: hda: [Power] [Digital] [Format override] [Stereo]
4185KERN: hda: 7: Vendor defined
4186KERN: hda: Supported power states:
4187KERN: hda: 8: Audio input
4188KERN: hda: Supported formats: 16bits 20bits 24bits
4189KERN: hda: Supported rates: 44khz 48khz 96khz 192khz
4190KERN: hda: Supported power states: D0 D1 D2 D3
4191KERN: hda: [Power] [Conn. list] [Format override] [Amplifier override] [In amplifier] [Stereo]
4192KERN: hda: In Amp: supports mute, step size: 0.75 dB, # steps: 63, offset to 0 dB: 23
4193KERN: hda: Inputs: <35>
4194KERN: hda: 9: Audio input
4195KERN: hda: Supported formats: 16bits 20bits 24bits
4196KERN: hda: Supported rates: 44khz 48khz 96khz 192khz
4197KERN: hda: Supported power states: D0 D1 D2 D3
4198KERN: hda: [Power] [Conn. list] [Format override] [Amplifier override] [In amplifier] [Stereo]
4199KERN: hda: In Amp: supports mute, step size: 0.75 dB, # steps: 63, offset to 0 dB: 23
4200KERN: hda: Inputs: <34>
4201KERN: hda: 10: Vendor defined
4202KERN: hda: Supported power states:
4203KERN: hda: 11: Audio mixer
4204KERN: hda: Supported power states: D0
4205KERN: hda: [Conn. list] [Amplifier override] [In amplifier] [Stereo]
4206KERN: hda: In Amp: supports mute, step size: 1.5 dB, # steps: 31, offset to 0 dB: 23
4207KERN: hda: Inputs: 24 25 26 27 29
4208KERN: hda: 12: Audio mixer
4209KERN: hda: Supported power states: D0
4210KERN: hda: [Conn. list] [Amplifier override] [In amplifier] [Stereo]
4211KERN: hda: In Amp: supports mute, step size: 0.25 dB, # steps: 0, offset to 0 dB: 0
4212KERN: hda: Inputs: 2 11
4213KERN: hda: 13: Audio mixer
4214KERN: hda: Supported power states: D0
4215KERN: hda: [Conn. list] [Amplifier override] [In amplifier] [Stereo]
4216KERN: hda: In Amp: supports mute, step size: 0.25 dB, # steps: 0, offset to 0 dB: 0
4217KERN: hda: Inputs: 3 11
4218KERN: hda: 14: Vendor defined
4219KERN: hda: Supported power states:
4220KERN: hda: 15: Audio mixer
4221KERN: hda: Supported power states: D0
4222KERN: hda: [Conn. list] [Amplifier override] [In amplifier]
4223KERN: hda: In Amp: supports mute, step size: 0.25 dB, # steps: 0, offset to 0 dB: 0
4224KERN: hda: Inputs: 2 11
4225KERN: hda: 16: Vendor defined
4226KERN: hda: Supported power states:
4227KERN: hda: 17: Vendor defined
4228KERN: hda: Supported power states:
4229KERN: hda: 18: Pin complex
4230KERN: hda: [Input]
4231KERN: hda: None, Speaker, 1/8", Black, Association:15
4232KERN: hda: Supported power states: D0 D1 D2 D3
4233KERN: hda: [Power] [Amplifier override] [In amplifier] [Stereo]
4234KERN: hda: In Amp: step size: 10 dB, # steps: 3, offset to 0 dB: 0
4235KERN: hda: 19: Vendor defined
4236KERN: hda: Supported power states:
4237KERN: hda: 20: Pin complex
4238KERN: hda: [Output]
4239KERN: hda: Fixed, Speaker, Other analog, N/A, Association:1
4240KERN: hda: Supported power states: D0 D1 D2 D3
4241KERN: hda: [Power] [Conn. list] [Unsol. responses] [Amplifier override] [Out amplifier] [Stereo]
4242KERN: hda: Out Amp: supports mute, step size: 0.25 dB, # steps: 0, offset to 0 dB: 0
4243KERN: hda: Inputs: 12 13
4244KERN: hda: 21: Pin complex
4245KERN: hda: [Output]
4246KERN: hda: Jack, Right HP out, 1/8", Black, Association:1
4247KERN: hda: Supported power states: D0 D1 D2 D3
4248KERN: hda: [Power] [Conn. list] [Unsol. responses] [Amplifier override] [Out amplifier] [Stereo]
4249KERN: hda: Out Amp: supports mute, step size: 0.25 dB, # steps: 0, offset to 0 dB: 0
4250KERN: hda: Inputs: 12 13
4251KERN: hda: 22: Vendor defined
4252KERN: hda: Supported power states:
4253KERN: hda: 23: Pin complex
4254KERN: hda: [Output]
4255KERN: hda: None, Speaker, 1/8", Black, Association:15
4256KERN: hda: Supported power states: D0 D1 D2 D3
4257KERN: hda: [Power] [Conn. list] [Amplifier override] [Out amplifier]
4258KERN: hda: Out Amp: supports mute, step size: 0.25 dB, # steps: 0, offset to 0 dB: 0
4259KERN: hda: Inputs: <15>
4260KERN: hda: 24: Pin complex
4261KERN: hda: [Input] [Output]
4262KERN: hda: Jack, Right Mic in, 1/8", Black, Association:2
4263KERN: hda: Supported power states: D0 D1 D2 D3
4264KERN: hda: [Power] [Conn. list] [Unsol. responses] [Amplifier override] [Out amplifier] [In amplifier] [Stereo]
4265KERN: hda: In Amp: step size: 10 dB, # steps: 3, offset to 0 dB: 0
4266KERN: hda: Out Amp: supports mute, step size: 0.25 dB, # steps: 0, offset to 0 dB: 0
4267KERN: hda: Inputs: 12 13
4268KERN: hda: 25: Pin complex
4269KERN: hda: [Input] [Output]
4270KERN: hda: Fixed, Mic in, Other analog, N/A, Association:2
4271KERN: hda: Supported power states: D0 D1 D2 D3
4272KERN: hda: [Power] [Conn. list] [Unsol. responses] [Amplifier override] [Out amplifier] [In amplifier] [Stereo]
4273KERN: hda: In Amp: step size: 10 dB, # steps: 3, offset to 0 dB: 0
4274KERN: hda: Out Amp: supports mute, step size: 0.25 dB, # steps: 0, offset to 0 dB: 0
4275KERN: hda: Inputs: 12 13
4276KERN: hda: 26: Pin complex
4277KERN: hda: [Input] [Output]
4278KERN: hda: None, Speaker, 1/8", Black, Association:15
4279KERN: hda: Supported power states: D0 D1 D2 D3
4280KERN: hda: [Power] [Conn. list] [Unsol. responses] [Amplifier override] [Out amplifier] [In amplifier] [Stereo]
4281KERN: hda: In Amp: step size: 10 dB, # steps: 3, offset to 0 dB: 0
4282KERN: hda: Out Amp: supports mute, step size: 0.25 dB, # steps: 0, offset to 0 dB: 0
4283KERN: hda: Inputs: 12 13
4284KERN: hda: 27: Pin complex
4285KERN: hda: [Input] [Output]
4286KERN: hda: None, Speaker, 1/8", Black, Association:15
4287KERN: hda: Supported power states: D0 D1 D2 D3
4288KERN: hda: [Power] [Conn. list] [Unsol. responses] [Amplifier override] [Out amplifier] [In amplifier] [Stereo]
4289KERN: hda: In Amp: step size: 10 dB, # steps: 3, offset to 0 dB: 0
4290KERN: hda: Out Amp: supports mute, step size: 0.25 dB, # steps: 0, offset to 0 dB: 0
4291KERN: hda: Inputs: 12 13
4292KERN: hda: 28: Vendor defined
4293KERN: hda: Supported power states:
4294KERN: hda: 29: Pin complex
4295KERN: hda: [Input]
4296KERN: hda: None, Line out, Optical, Purple, Association:2
4297KERN: hda: Supported power states: D0 D1 D2 D3
4298KERN: hda: [Power]
4299KERN: hda: 30: Pin complex
4300KERN: hda: [Output]
4301KERN: hda: None, Speaker, 1/8", Black, Association:15
4302KERN: hda: Supported power states: D0 D1 D2 D3
4303KERN: hda: [Power] [Digital] [Conn. list] [Unsol. responses] [Stereo]
4304KERN: hda: Inputs: <6>
4305KERN: hda: 31: Vendor defined
4306KERN: hda: Supported power states:
4307KERN: hda: 32: Vendor defined
4308KERN: hda: Supported power states:
4309KERN: hda: [Proc widget]
4310KERN: hda: 33: Vendor defined
4311KERN: hda: Supported power states:
4312KERN: hda: 34: Audio mixer
4313KERN: hda: Supported power states: D0
4314KERN: hda: [Conn. list] [Amplifier override] [In amplifier] [Stereo]
4315KERN: hda: In Amp: supports mute, step size: 0.25 dB, # steps: 0, offset to 0 dB: 0
4316KERN: hda: Inputs: 24 25 26 27 29 11 18
4317KERN: hda: 35: Audio mixer
4318KERN: hda: Supported power states: D0
4319KERN: hda: [Conn. list] [Amplifier override] [In amplifier] [Stereo]
4320KERN: hda: In Amp: supports mute, step size: 0.25 dB, # steps: 0, offset to 0 dB: 0
4321KERN: hda: Inputs: 24 25 26 27 29 11
4322KERN: hda: build output tree: use mixer
4323KERN: hda: look at pin widget 20 (2 inputs)
4324KERN: hda: try widget 12: 0xffffffff829d36b8
4325KERN: hda: widget 12 is candidate
4326KERN: hda: output: added output widget 2
4327KERN: hda: output: added mixer/selector widget 12
4328KERN: hda: output: not added mixer/selector widget 11
4329KERN: hda: add pin widget 20
4330KERN: hda: look at pin widget 21 (2 inputs)
4331KERN: hda: try widget 12: 0xffffffff829d36b8
4332KERN: hda: widget 12 is candidate
4333KERN: hda: add pin widget 21
4334KERN: hda: look at pin widget 23 (1 inputs)
4335KERN: hda: try widget 15: 0xffffffff829d38bc
4336KERN: hda: widget 15 is candidate
4337KERN: hda: output: added output widget 2
4338KERN: hda: output: added mixer/selector widget 15
4339KERN: hda: output: not added mixer/selector widget 11
4340KERN: hda: add pin widget 23
4341KERN: hda: look at pin widget 26 (2 inputs)
4342KERN: hda: try widget 12: 0xffffffff829d36b8
4343KERN: hda: widget 12 is candidate
4344KERN: hda: try widget 13: 0xffffffff829d3764
4345KERN: hda: widget 13 is candidate
4346KERN: hda: output: added output widget 3
4347KERN: hda: output: added mixer/selector widget 13
4348KERN: hda: output: not added mixer/selector widget 11
4349KERN: hda: add pin widget 26
4350KERN: hda: look at pin widget 27 (2 inputs)
4351KERN: hda: try widget 12: 0xffffffff829d36b8
4352KERN: hda: widget 12 is candidate
4353KERN: hda: try widget 13: 0xffffffff829d3764
4354KERN: hda: widget 13 is candidate
4355KERN: hda: look at pin widget 30 (1 inputs)
4356KERN: hda: try widget 6: 0xffffffff829d32b0
4357KERN: hda: build input tree
4358KERN: hda: look at input widget 8 (1 inputs)
4359KERN: hda: try widget 35: 0xffffffff829d462c
4360KERN: hda: widget 35 is candidate
4361KERN: hda: input: added input widget 24
4362KERN: hda: input: added mixer/selector widget 35
4363KERN: hda: input: added input widget 25
4364KERN: hda: input: added mixer/selector widget 35
4365KERN: hda: input: not added mixer/selector widget 11
4366KERN: hda: add pin widget 8
4367KERN: hda: look at input widget 9 (1 inputs)
4368KERN: hda: try widget 34: 0xffffffff829d4580
4369KERN: hda: widget 34 is candidate
4370KERN: hda: input: not added mixer/selector widget 11
4371KERN: hda: input: not added mixer/selector widget 34
4372KERN: hda: build tree!
4373KERN: hda: Audiogroup:
4374KERN: hda: 2: Audio output
4375KERN: hda: Supported power states: D0 D1 D2 D3
4376KERN: hda: [Power] [Format override] [Amplifier override] [Out amplifier] [Stereo]
4377KERN: hda: Out Amp: step size: 0.75 dB, # steps: 87, offset to 0 dB: 87
4378KERN: hda: 3: Audio output
4379KERN: hda: Supported power states: D0 D1 D2 D3
4380KERN: hda: [Power] [Format override] [Amplifier override] [Out amplifier] [Stereo]
4381KERN: hda: Out Amp: step size: 0.75 dB, # steps: 87, offset to 0 dB: 87
4382KERN: hda: 4: Vendor defined
4383KERN: hda: Supported power states:
4384KERN: hda: 5: Vendor defined
4385KERN: hda: Supported power states:
4386KERN: hda: 6: Audio output
4387KERN: hda: Supported power states: D0 D1 D2 D3
4388KERN: hda: [Power] [Digital] [Format override] [Stereo]
4389KERN: hda: 7: Vendor defined
4390KERN: hda: Supported power states:
4391KERN: hda: 8: Audio input
4392KERN: hda: Supported power states: D0 D1 D2 D3
4393KERN: hda: [Power] [Conn. list] [Format override] [Amplifier override] [In amplifier] [Stereo]
4394KERN: hda: In Amp: supports mute, step size: 0.75 dB, # steps: 63, offset to 0 dB: 23
4395KERN: hda: Inputs: <35>
4396KERN: hda: 9: Audio input
4397KERN: hda: Supported power states: D0 D1 D2 D3
4398KERN: hda: [Power] [Conn. list] [Format override] [Amplifier override] [In amplifier] [Stereo]
4399KERN: hda: In Amp: supports mute, step size: 0.75 dB, # steps: 63, offset to 0 dB: 23
4400KERN: hda: Inputs: <34>
4401KERN: hda: 10: Vendor defined
4402KERN: hda: Supported power states:
4403KERN: hda: 11: Audio mixer
4404KERN: hda: Supported power states: D0
4405KERN: hda: [Conn. list] [Amplifier override] [In amplifier] [Stereo]
4406KERN: hda: In Amp: supports mute, step size: 1.5 dB, # steps: 31, offset to 0 dB: 23
4407KERN: hda: Inputs: <24> 25 26 27 29
4408KERN: hda: 12: Audio mixer
4409KERN: hda: Supported power states: D0
4410KERN: hda: [Conn. list] [Amplifier override] [In amplifier] [Stereo]
4411KERN: hda: In Amp: supports mute, step size: 0.25 dB, # steps: 0, offset to 0 dB: 0
4412KERN: hda: Inputs: <2> 11
4413KERN: hda: 13: Audio mixer
4414KERN: hda: Supported power states: D0
4415KERN: hda: [Conn. list] [Amplifier override] [In amplifier] [Stereo]
4416KERN: hda: In Amp: supports mute, step size: 0.25 dB, # steps: 0, offset to 0 dB: 0
4417KERN: hda: Inputs: <3> 11
4418KERN: hda: 14: Vendor defined
4419KERN: hda: Supported power states:
4420KERN: hda: 15: Audio mixer
4421KERN: hda: Supported power states: D0
4422KERN: hda: [Conn. list] [Amplifier override] [In amplifier]
4423KERN: hda: In Amp: supports mute, step size: 0.25 dB, # steps: 0, offset to 0 dB: 0
4424KERN: hda: Inputs: <2> 11
4425KERN: hda: 16: Vendor defined
4426KERN: hda: Supported power states:
4427KERN: hda: 17: Vendor defined
4428KERN: hda: Supported power states:
4429KERN: hda: 18: Pin complex
4430KERN: hda: [Input]
4431KERN: hda: Supported power states: D0 D1 D2 D3
4432KERN: hda: [Power] [Amplifier override] [In amplifier] [Stereo]
4433KERN: hda: In Amp: step size: 10 dB, # steps: 3, offset to 0 dB: 0
4434KERN: hda: 19: Vendor defined
4435KERN: hda: Supported power states:
4436KERN: hda: 20: Pin complex
4437KERN: hda: [Pres Detect][Output][EAPD]
4438KERN: hda: Supported power states: D0 D1 D2 D3
4439KERN: hda: [Power] [Conn. list] [Unsol. responses] [Amplifier override] [Out amplifier] [Stereo]
4440KERN: hda: Out Amp: supports mute, step size: 0.25 dB, # steps: 0, offset to 0 dB: 0
4441KERN: hda: Inputs: <12> 13
4442KERN: hda: 21: Pin complex
4443KERN: hda: [Pres Detect][HP Drive][Output][EAPD]
4444KERN: hda: Supported power states: D0 D1 D2 D3
4445KERN: hda: [Power] [Conn. list] [Unsol. responses] [Amplifier override] [Out amplifier] [Stereo]
4446KERN: hda: Out Amp: supports mute, step size: 0.25 dB, # steps: 0, offset to 0 dB: 0
4447KERN: hda: Inputs: <12> 13
4448KERN: hda: 22: Vendor defined
4449KERN: hda: Supported power states:
4450KERN: hda: 23: Pin complex
4451KERN: hda: [Output]
4452KERN: hda: Supported power states: D0 D1 D2 D3
4453KERN: hda: [Power] [Conn. list] [Amplifier override] [Out amplifier]
4454KERN: hda: Out Amp: supports mute, step size: 0.25 dB, # steps: 0, offset to 0 dB: 0
4455KERN: hda: Inputs: <15>
4456KERN: hda: 24: Pin complex
4457KERN: hda: [Pres Detect][Output][Input][VRef HIZ][VRef 50][VRef Gr][VRef 80][VRef 100]
4458KERN: hda: Supported power states: D0 D1 D2 D3
4459KERN: hda: [Power] [Conn. list] [Unsol. responses] [Amplifier override] [Out amplifier] [In amplifier] [Stereo]
4460KERN: hda: In Amp: step size: 10 dB, # steps: 3, offset to 0 dB: 0
4461KERN: hda: Out Amp: supports mute, step size: 0.25 dB, # steps: 0, offset to 0 dB: 0
4462KERN: hda: Inputs: <12> 13
4463KERN: hda: 25: Pin complex
4464KERN: hda: [Pres Detect][Output][Input][VRef HIZ][VRef 50][VRef Gr][VRef 80][VRef 100]
4465KERN: hda: Supported power states: D0 D1 D2 D3
4466KERN: hda: [Power] [Conn. list] [Unsol. responses] [Amplifier override] [Out amplifier] [In amplifier] [Stereo]
4467KERN: hda: In Amp: step size: 10 dB, # steps: 3, offset to 0 dB: 0
4468KERN: hda: Out Amp: supports mute, step size: 0.25 dB, # steps: 0, offset to 0 dB: 0
4469KERN: hda: Inputs: <12> 13
4470KERN: hda: 26: Pin complex
4471KERN: hda: [Pres Detect][HP Drive][Output][Input][VRef HIZ][VRef 50][VRef Gr][VRef 80][VRef 100]
4472KERN: hda: Supported power states: D0 D1 D2 D3
4473KERN: hda: [Power] [Conn. list] [Unsol. responses] [Amplifier override] [Out amplifier] [In amplifier] [Stereo]
4474KERN: hda: In Amp: step size: 10 dB, # steps: 3, offset to 0 dB: 0
4475KERN: hda: Out Amp: supports mute, step size: 0.25 dB, # steps: 0, offset to 0 dB: 0
4476KERN: hda: Inputs: 12 <13>
4477KERN: hda: 27: Pin complex
4478KERN: hda: [Pres Detect][Output][Input][VRef HIZ][VRef 50][VRef Gr][VRef 80][VRef 100]
4479KERN: hda: Supported power states: D0 D1 D2 D3
4480KERN: hda: [Power] [Conn. list] [Unsol. responses] [Amplifier override] [Out amplifier] [In amplifier] [Stereo]
4481KERN: hda: In Amp: step size: 10 dB, # steps: 3, offset to 0 dB: 0
4482KERN: hda: Out Amp: supports mute, step size: 0.25 dB, # steps: 0, offset to 0 dB: 0
4483KERN: hda: Inputs: <12> 13
4484KERN: hda: 28: Vendor defined
4485KERN: hda: Supported power states:
4486KERN: hda: 29: Pin complex
4487KERN: hda: [Input]
4488KERN: hda: Supported power states: D0 D1 D2 D3
4489KERN: hda: [Power]
4490KERN: hda: 30: Pin complex
4491KERN: hda: [Output]
4492KERN: hda: Supported power states: D0 D1 D2 D3
4493KERN: hda: [Power] [Digital] [Conn. list] [Unsol. responses] [Stereo]
4494KERN: hda: Inputs: <6>
4495KERN: hda: 31: Vendor defined
4496KERN: hda: Supported power states:
4497KERN: hda: 32: Vendor defined
4498KERN: hda: Supported power states:
4499KERN: hda: [Proc widget]
4500KERN: hda: 33: Vendor defined
4501KERN: hda: Supported power states:
4502KERN: hda: 34: Audio mixer
4503KERN: hda: Supported power states: D0
4504KERN: hda: [Conn. list] [Amplifier override] [In amplifier] [Stereo]
4505KERN: hda: In Amp: supports mute, step size: 0.25 dB, # steps: 0, offset to 0 dB: 0
4506KERN: hda: Inputs: <24> 25 26 27 29 11 18
4507KERN: hda: 35: Audio mixer
4508KERN: hda: Supported power states: D0
4509KERN: hda: [Conn. list] [Amplifier override] [In amplifier] [Stereo]
4510KERN: hda: In Amp: supports mute, step size: 0.25 dB, # steps: 0, offset to 0 dB: 0
4511KERN: hda: Inputs: <24> 25 26 27 29 11
4512KERN: hda: Enabled unsolicited responses on widget 21
4513KERN: hda: Enabled unsolicited responses on widget 24
4514KERN: hda: UNMUTE/SET OUTPUT GAIN widget 2 (offset 87)
4515KERN: hda: UNMUTE/SET OUTPUT GAIN widget 3 (offset 87)
4516KERN: hda: UNMUTE/SET INPUT GAIN widget 12 (offset 0)
4517KERN: hda: UNMUTE/SET INPUT GAIN widget 13 (offset 0)
4518KERN: hda: UNMUTE/SET INPUT GAIN widget 15 (offset 0)
4519KERN: hda: ENABLE pin widget 20
4520KERN: hda: ENABLE EAPD pin widget 20
4521KERN: hda: UNMUTE/SET OUTPUT GAIN widget 20 (offset 0)
4522KERN: hda: ENABLE pin widget 21
4523KERN: hda: ENABLE EAPD pin widget 21
4524KERN: hda: UNMUTE/SET OUTPUT GAIN widget 21 (offset 0)
4525KERN: hda: ENABLE pin widget 23
4526KERN: hda: UNMUTE/SET OUTPUT GAIN widget 23 (offset 0)
4527KERN: hda: ENABLE pin widget 26
4528KERN: hda: UNMUTE/SET OUTPUT GAIN widget 26 (offset 0)
4529KERN: hda: UNMUTE/SET INPUT GAIN widget 26 (offset 0)
4530KERN: hda: UNMUTE/SET INPUT GAIN widget 8 (offset 23)
4531KERN: hda: input vref 50 enabled
4532KERN: hda: input vref 80 enabled
4533KERN: hda: input vref 100 enabled
4534KERN: hda: ENABLE pin widget 24
4535KERN: hda: UNMUTE/SET OUTPUT GAIN widget 24 (offset 0)
4536KERN: hda: UNMUTE/SET INPUT GAIN widget 24 (offset 0)
4537KERN: hda: input vref 50 enabled
4538KERN: hda: input vref 80 enabled
4539KERN: hda: input vref 100 enabled
4540KERN: hda: ENABLE pin widget 25
4541KERN: hda: UNMUTE/SET OUTPUT GAIN widget 25 (offset 0)
4542KERN: hda: UNMUTE/SET INPUT GAIN widget 25 (offset 0)
4543KERN: hda: UNMUTE/SET INPUT GAIN widget 35 (offset 0)
4544KERN: hda: streams playback 0xffffffff9f2560c0, record 0xffffffff9f23ce88
4545KERN: hda: sensed pin widget 21, 1
4546KERN: hda: sample size 4, num channels 2, buffer length 10240
4547KERN: hda: hda_stream_setup_buffers: setup stream 1: SR=192000, SF=24 F=0x1831 (0x100)
4548KERN: add_memory_type_range(7420, 0x1b472000, 0x28000, 0)
4549KERN: set MTRRs to:
4550KERN: mtrr: 0: base: 0x1b472000, size: 0x2000, type: 0
4551KERN: mtrr: 1: base: 0x1b498000, size: 0x2000, type: 0
4552KERN: mtrr: 2: base: 0x1b474000, size: 0x4000, type: 0
4553KERN: mtrr: 3: base: 0x1b478000, size: 0x8000, type: 0
4554KERN: mtrr: 4: base: 0x1b490000, size: 0x8000, type: 0
4555KERN: mtrr: 5: base: 0x1b480000, size: 0x10000, type: 0
4556KERN: mtrr: 6: base: 0xc0000000, size: 0x40000000, type: 0
4557KERN: mtrr: 7: base: 0xa0000000, size: 0x20000000, type: 1
4558KERN: update_mtrrs(): Succeeded setting MTRRs after ignoring uncacheable ranges up to size 0x3000.
4559KERN: hda: hda_stream_setup_buffers(Playback): Allocated 163840 bytes for 2 buffers
4560KERN: add_memory_type_range(7421, 0x1b469000, 0x1000, 0)
4561KERN: set MTRRs to:
4562KERN: mtrr: 0: base: 0x1b472000, size: 0x2000, type: 0
4563KERN: mtrr: 1: base: 0x1b498000, size: 0x2000, type: 0
4564KERN: mtrr: 2: base: 0x1b474000, size: 0x4000, type: 0
4565KERN: mtrr: 3: base: 0x1b478000, size: 0x8000, type: 0
4566KERN: mtrr: 4: base: 0x1b490000, size: 0x8000, type: 0
4567KERN: mtrr: 5: base: 0x1b480000, size: 0x10000, type: 0
4568KERN: mtrr: 6: base: 0xc0000000, size: 0x40000000, type: 0
4569KERN: mtrr: 7: base: 0xa0000000, size: 0x20000000, type: 1
4570KERN: update_mtrrs(): Succeeded setting MTRRs after ignoring uncacheable ranges up to size 0x3000.
4571KERN: hda: hda_stream_setup_buffers(Playback): Allocated 4096 bytes for 2 BDLEs
4572KERN: hda: stream: 1 fifo size: 1024 num_io_widgets: 2
4573KERN: hda: widgets: 2 3
4574KERN: hda: sample size 4, num channels 2, buffer length 10240
4575KERN: hda: hda_stream_setup_buffers: setup stream 2: SR=192000, SF=24 F=0x1831 (0x100)
4576KERN: add_memory_type_range(7422, 0x1b49b000, 0x28000, 0)
4577KERN: set MTRRs to:
4578KERN: mtrr: 0: base: 0xc0000000, size: 0x40000000, type: 0
4579KERN: mtrr: 1: base: 0xa0000000, size: 0x20000000, type: 1
4580KERN: update_mtrrs(): Succeeded setting MTRRs after ignoring uncacheable ranges up to size 0x28000.
4581KERN: hda: hda_stream_setup_buffers(Recording): Allocated 163840 bytes for 2 buffers
4582KERN: add_memory_type_range(7423, 0x1b468000, 0x1000, 0)
4583KERN: set MTRRs to:
4584KERN: mtrr: 0: base: 0xc0000000, size: 0x40000000, type: 0
4585KERN: mtrr: 1: base: 0xa0000000, size: 0x20000000, type: 1
4586KERN: update_mtrrs(): Succeeded setting MTRRs after ignoring uncacheable ranges up to size 0x28000.
4587KERN: hda: hda_stream_setup_buffers(Recording): Allocated 4096 bytes for 2 BDLEs
4588KERN: hda: stream: 2 fifo size: 256 num_io_widgets: 1
4589KERN: hda: widgets: KERN: 8
4590KERN: hda_stream_start() offset 80
4591KERN: hda_stream_start() offset 0
4592KERN: /dev/net/rtl81xx/0: media change, media 0x900030 quality 1000 speed 1000000000
4593KERN: register_domain(4, link)
4594DAEMON 'DHCP': /dev/net/rtl81xx/0: Send DHCP_DISCOVER to 255.255.255.255:67
4595DAEMON 'DHCP': /dev/net/rtl81xx/0: Received DHCP_OFFER from 192.168.100.1
4596DAEMON 'DHCP': your_address: 192.168.100.2
4597DAEMON 'DHCP': server: 192.168.100.1
4598DAEMON 'DHCP': lease time: 255461 seconds
4599DAEMON 'DHCP': subnet: 255.255.255.0
4600DAEMON 'DHCP': gateway: 192.168.100.1
4601DAEMON 'DHCP': nameserver[0]: 192.168.100.1
4602DAEMON 'DHCP': /dev/net/rtl81xx/0: Send DHCP_REQUEST for 192.168.100.2 to 255.255.255.255:67
4603DAEMON 'DHCP': /dev/net/rtl81xx/0: Received DHCP_ACK from 192.168.100.1
4604DAEMON 'DHCP': server: 192.168.100.1
4605DAEMON 'DHCP': lease time: 259200 seconds
4606DAEMON 'DHCP': subnet: 255.255.255.0
4607DAEMON 'DHCP': gateway: 192.168.100.1
4608DAEMON 'DHCP': nameserver[0]: 192.168.100.1
4609DAEMON 'DHCP': /dev/net/rtl81xx/0: DHCP status = No error
4610KERN: hda: DMA position for stream (id:1) seems to be broken. Switching to using LPIB.
4611KERN: hda: DMA position for stream (id:2) seems to be broken. Switching to using LPIB.
4612KERN: PANIC: ASSERT FAILED (/home/builder/builds/haiku/src/add-ons/kernel/file_systems/bfs/BlockAllocator.cpp:413): start + length <= (int32)fNumBits
4613KERN: Welcome to Kernel Debugging Land...
4614KERN: Thread 671 "w>DriveSetup" running on CPU 1
4615KERN: stack trace for thread 671 "w>DriveSetup"
4616KERN: kernel stack: 0xffffffff8c53b000 to 0xffffffff8c540000
4617KERN: user stack: 0x00007fae4cd95000 to 0x00007fae4cdd5000
4618KERN: frame caller <image>:function + offset
4619KERN: 0 ffffffff8c53f4e8 (+ 16) ffffffff8013ff09 <kernel_x86_64> arch_debug_stack_trace + 0x13
4620KERN: 1 ffffffff8c53f4f8 (+ 16) ffffffff800a463b <kernel_x86_64> stack_trace_trampoline(void*) + 0x09
4621KERN: 2 ffffffff8c53f508 (+ 24) ffffffff8012fc1c <kernel_x86_64> arch_debug_call_with_fault_handler + 0x16
4622KERN: 3 ffffffff8c53f520 (+ 96) ffffffff800a4fd4 <kernel_x86_64> debug_call_with_fault_handler + 0x68
4623KERN: 4 ffffffff8c53f580 (+ 96) ffffffff800a5f84 <kernel_x86_64> kernel_debugger_loop(char const*, char const*, __va_list_tag*, int) + 0x225
4624KERN: 5 ffffffff8c53f5e0 (+ 80) ffffffff800a623f <kernel_x86_64> kernel_debugger_internal(char const*, char const*, __va_list_tag*, int) + 0x137
4625KERN: 6 ffffffff8c53f630 (+ 240) ffffffff800a649c <kernel_x86_64> panic + 0xc1
4626KERN: 7 ffffffff8c53f720 (+ 160) ffffffff8208a6f5 <bfs> AllocationGroup::Allocate(Transaction&, unsigned short, int) + 0x4f
4627KERN: 8 ffffffff8c53f7c0 (+ 96) ffffffff8208c5f3 <bfs> BlockAllocator::InitializeAndClearBitmap(Transaction&) + 0x1db
4628KERN: 9 ffffffff8c53f820 (+ 176) ffffffff820a3939 <bfs> Volume::Initialize(int, char const*, unsigned int, unsigned int) + 0x28f
4629KERN: 10 ffffffff8c53f8d0 (+1392) ffffffff820a7054 <bfs> bfs_initialize(int, int, char const*, char const*, long, int) + 0x83
4630KERN: 11 ffffffff8c53fe40 (+ 96) ffffffff800d5917 <kernel_x86_64> BPrivate::DiskDevice::KFileSystem::Initialize(BPrivate::DiskDevice::KPartition*, char const*, char const*, int) + 0x97
4631KERN: 12 ffffffff8c53fea0 (+ 128) ffffffff800d056b <kernel_x86_64> _user_initialize_partition + 0x258
4632KERN: 13 ffffffff8c53ff20 (+ 24) ffffffff8013a0f5 <kernel_x86_64> x86_64_syscall_entry + 0xfb
4633KERN: user iframe at 0xffffffff8c53ff38 (end = 0xffffffff8c540000)
4634KERN: rax 0x10f rbx 0xf981035c00 rcx 0x663916e424
4635KERN: rdx 0xf981046d60 rsi 0x7fae4cdd3c7c rdi 0x9
4636KERN: rbp 0x7fae4cdd3ca0 r8 0xf9810368d0 r9 0x0
4637KERN: r10 0xf98103d9e0 r11 0x3202 r12 0xf981046d60
4638KERN: r13 0xf98103d9e0 r14 0xf9810368d0 r15 0x13b1d286f88
4639KERN: rip 0x663916e424 rsp 0x7fae4cdd3c68 rflags 0x3202
4640KERN: vector: 0x63, error code: 0x0
4641KERN: 14 ffffffff8c53ff38 (+140388531256680) 000000663916e424 <libroot.so> _kern_initialize_partition + 0x0c
4642KERN: 15 00007fae4cdd3ca0 (+ 64) 0000013b1d2400d5 <libbe.so> BPrivate::DiskDeviceJobQueue::Execute() + 0x6d
4643KERN: 16 00007fae4cdd3ce0 (+ 144) 0000013b1d23e5dd <libbe.so> BDiskDevice::CommitModifications(bool, BMessenger, bool) + 0x63
4644KERN: 17 00007fae4cdd3d70 (+ 64) 000001e7d0ddc770 <_APP_> ModificationPreparer::CommitModifications() + 0x30
4645KERN: 18 00007fae4cdd3db0 (+ 928) 000001e7d0dda0ad <_APP_> MainWindow::_Initialize(BDiskDevice*, int, BString const&) + 0x9bb
4646KERN: 19 00007fae4cdd4150 (+ 144) 000001e7d0ddc423 <_APP_> MainWindow::MessageReceived(BMessage*) + 0x177
4647KERN: 20 00007fae4cdd41e0 (+ 16) 0000013b1d13daf0 <libbe.so> BLooper::DispatchMessage(BMessage*, BHandler*) + 0x34
4648KERN: 21 00007fae4cdd41f0 (+ 800) 0000013b1d1f7c1a <libbe.so> BWindow::DispatchMessage(BMessage*, BHandler*) + 0x13a4
4649KERN: 22 00007fae4cdd4510 (+ 160) 0000013b1d1f1af1 <libbe.so> BWindow::task_looper() + 0x267
4650KERN: 23 00007fae4cdd45b0 (+ 32) 0000013b1d13c847 <libbe.so> BLooper::_task0_(void*) + 0x21
4651KERN: 24 00007fae4cdd45d0 (+ 32) 000000663916cf54 <libroot.so> _thread_do_exit_work (nearest) + 0x70
4652KERN: 25 00007fae4cdd45f0 (+ 0) 00007fd7f23ab260 <commpage> commpage_thread_exit + 0x00
4653KERN: kdebug> btstack trace for thread 671 "w>DriveSetup"
4654KERN: kernel stack: 0xffffffff8c53b000 to 0xffffffff8c540000
4655KERN: user stack: 0x00007fae4cd95000 to 0x00007fae4cdd5000
4656KERN: frame caller <image>:function + offset
4657KERN: 0 ffffffff8c53f258 (+ 32) ffffffff800a7818 <kernel_x86_64> invoke_command_trampoline(void*) + 0x19
4658KERN: 1 ffffffff8c53f278 (+ 24) ffffffff8012fc1c <kernel_x86_64> arch_debug_call_with_fault_handler + 0x16
4659KERN: 2 ffffffff8c53f290 (+ 96) ffffffff800a4fd4 <kernel_x86_64> debug_call_with_fault_handler + 0x68
4660KERN: 3 ffffffff8c53f2f0 (+ 96) ffffffff800a79ee <kernel_x86_64> invoke_debugger_command + 0xcf
4661KERN: 4 ffffffff8c53f350 (+ 80) ffffffff800a7b9b <kernel_x86_64> invoke_pipe_segment(debugger_command_pipe*, int, char*) + 0xed
4662KERN: 5 ffffffff8c53f3a0 (+ 80) ffffffff800a7c83 <kernel_x86_64> invoke_debugger_command_pipe + 0x99
4663KERN: 6 ffffffff8c53f3f0 (+ 80) ffffffff800ab32b <kernel_x86_64> ExpressionParser::_ParseCommandPipe(int&) + 0x739
4664KERN: 7 ffffffff8c53f440 (+ 96) ffffffff800adaef <kernel_x86_64> ExpressionParser::EvaluateCommand(char const*, int&) + 0x12b
4665KERN: 8 ffffffff8c53f4a0 (+ 224) ffffffff800ae472 <kernel_x86_64> evaluate_debug_command + 0x93
4666KERN: 9 ffffffff8c53f580 (+ 96) ffffffff800a606f <kernel_x86_64> kernel_debugger_loop(char const*, char const*, __va_list_tag*, int) + 0x310
4667KERN: 10 ffffffff8c53f5e0 (+ 80) ffffffff800a623f <kernel_x86_64> kernel_debugger_internal(char const*, char const*, __va_list_tag*, int) + 0x137
4668KERN: 11 ffffffff8c53f630 (+ 240) ffffffff800a649c <kernel_x86_64> panic + 0xc1
4669KERN: 12 ffffffff8c53f720 (+ 160) ffffffff8208a6f5 <bfs> AllocationGroup::Allocate(Transaction&, unsigned short, int) + 0x4f
4670KERN: 13 ffffffff8c53f7c0 (+ 96) ffffffff8208c5f3 <bfs> BlockAllocator::InitializeAndClearBitmap(Transaction&) + 0x1db
4671KERN: 14 ffffffff8c53f820 (+ 176) ffffffff820a3939 <bfs> Volume::Initialize(int, char const*, unsigned int, unsigned int) + 0x28f
4672KERN: 15 ffffffff8c53f8d0 (+1392) ffffffff820a7054 <bfs> bfs_initialize(int, int, char const*, char const*, long, int) + 0x83
4673KERN: 16 ffffffff8c53fe40 (+ 96) ffffffff800d5917 <kernel_x86_64> BPrivate::DiskDevice::KFileSystem::Initialize(BPrivate::DiskDevice::KPartition*, char const*, char const*, int) + 0x97
4674KERN: 17 ffffffff8c53fea0 (+ 128) ffffffff800d056b <kernel_x86_64> _user_initialize_partition + 0x258
4675KERN: 18 ffffffff8c53ff20 (+ 24) ffffffff8013a0f5 <kernel_x86_64> x86_64_syscall_entry + 0xfb
4676KERN: user iframe at 0xffffffff8c53ff38 (end = 0xffffffff8c540000)
4677KERN: rax 0x10f rbx 0xf981035c00 rcx 0x663916e424
4678KERN: rdx 0xf981046d60 rsi 0x7fae4cdd3c7c rdi 0x9
4679KERN: rbp 0x7fae4cdd3ca0 r8 0xf9810368d0 r9 0x0
4680KERN: r10 0xf98103d9e0 r11 0x3202 r12 0xf981046d60
4681KERN: r13 0xf98103d9e0 r14 0xf9810368d0 r15 0x13b1d286f88
4682KERN: rip 0x663916e424 rsp 0x7fae4cdd3c68 rflags 0x3202
4683KERN: vector: 0x63, error code: 0x0
4684KERN: 19 ffffffff8c53ff38 (+140388531256680) 000000663916e424 <libroot.so> _kern_initialize_partition + 0x0c
4685KERN: 20 00007fae4cdd3ca0 (+ 64) 0000013b1d2400d5 <libbe.so> BPrivate::DiskDeviceJobQueue::Execute() + 0x6d
4686KERN: 21 00007fae4cdd3ce0 (+ 144) 0000013b1d23e5dd <libbe.so> BDiskDevice::CommitModifications(bool, BMessenger, bool) + 0x63
4687KERN: 22 00007fae4cdd3d70 (+ 64) 000001e7d0ddc770 <_APP_> ModificationPreparer::CommitModifications() + 0x30
4688KERN: 23 00007fae4cdd3db0 (+ 928) 000001e7d0dda0ad <_APP_> MainWindow::_Initialize(BDiskDevice*, int, BString const&) + 0x9bb
4689KERN: 24 00007fae4cdd4150 (+ 144) 000001e7d0ddc423 <_APP_> MainWindow::MessageReceived(BMessage*) + 0x177
4690KERN: 25 00007fae4cdd41e0 (+ 16) 0000013b1d13daf0 <libbe.so> BLooper::DispatchMessage(BMessage*, BHandler*) + 0x34
4691KERN: 26 00007fae4cdd41f0 (+ 800) 0000013b1d1f7c1a <libbe.so> BWindow::DispatchMessage(BMessage*, BHandler*) + 0x13a4
4692KERN: 27 00007fae4cdd4510 (+ 160) 0000013b1d1f1af1 <libbe.so> BWindow::task_looper() + 0x267
4693KERN: 28 00007fae4cdd45b0 (+ 32) 0000013b1d13c847 <libbe.so> BLooper::_task0_(void*) + 0x21
4694KERN: 29 00007fae4cdd45d0 (+ 32) 000000663916cf54 <libroot.so> _thread_do_exit_work (nearest) + 0x70
4695KERN: 30 00007fae4cdd45f0 (+ 0) 00007fd7f23ab260 <commpage> commpage_thread_exit + 0x00
4696KERN: kdebug> exitKERN: bfs: New:205: No space left on device
4697KERN: bfs: Initialize:745: No space left on device
4698KERN: bfs: Initializing volume failed: No space left on device
4699KERN: SYNAPTICS: bad mouse data, trying resync
4700KERN: Last message repeated 5 times.
4701KERN: bfs: Remove:2127: No such file or directory
4702KERN: bfs: KERN: Could not find value in index "size"!
4703KERN: bfs: Remove:2127: No such file or directory
4704KERN: bfs: KERN: Could not find value in index "last_modified"!
4705KERN: Launching x-vnd.be-tskb failed: System shutting down
4706KERN: Launching x-vnd.be-trak failed: System shutting down
4707KERN: hda_stream_stop()
4708Last message repeated 1 time
4709KERN: remove_memory_type_range(7418, 0x1b450000, 0x1000, 0)
4710KERN: set MTRRs to:
4711KERN: mtrr: 0: base: 0xc0000000, size: 0x40000000, type: 0
4712KERN: mtrr: 1: base: 0xa0000000, size: 0x20000000, type: 1
4713KERN: update_mtrrs(): Succeeded setting MTRRs after ignoring uncacheable ranges up to size 0x28000.
4714KERN: remove_memory_type_range(7417, 0xfeb40000, 0x4000, 0)
4715KERN: set MTRRs to:
4716KERN: mtrr: 0: base: 0xc0000000, size: 0x40000000, type: 0
4717KERN: mtrr: 1: base: 0xa0000000, size: 0x20000000, type: 1
4718KERN: update_mtrrs(): Succeeded setting MTRRs after ignoring uncacheable ranges up to size 0x28000.
4719KERN: remove_memory_type_range(7420, 0x1b472000, 0x28000, 0)
4720KERN: set MTRRs to:
4721KERN: mtrr: 0: base: 0x1b49b000, size: 0x1000, type: 0
4722KERN: mtrr: 1: base: 0x1b4c2000, size: 0x1000, type: 0
4723KERN: mtrr: 2: base: 0x1b4c0000, size: 0x2000, type: 0
4724KERN: mtrr: 3: base: 0x1b49c000, size: 0x4000, type: 0
4725KERN: mtrr: 4: base: 0x1b4a0000, size: 0x20000, type: 0
4726KERN: mtrr: 5: base: 0x8e400000, size: 0x400000, type: 0
4727KERN: mtrr: 6: base: 0xc0000000, size: 0x40000000, type: 0
4728KERN: mtrr: 7: base: 0xa0000000, size: 0x20000000, type: 1
4729KERN: update_mtrrs(): Succeeded setting MTRRs after ignoring uncacheable ranges up to size 0x1000.
4730KERN: remove_memory_type_range(7421, 0x1b469000, 0x1000, 0)
4731KERN: set MTRRs to:
4732KERN: mtrr: 0: base: 0x1b49b000, size: 0x1000, type: 0
4733KERN: mtrr: 1: base: 0x1b4c2000, size: 0x1000, type: 0
4734KERN: mtrr: 2: base: 0x1b4c0000, size: 0x2000, type: 0
4735KERN: mtrr: 3: base: 0x1b49c000, size: 0x4000, type: 0
4736KERN: mtrr: 4: base: 0x1b4a0000, size: 0x20000, type: 0
4737KERN: mtrr: 5: base: 0x8e400000, size: 0x400000, type: 0
4738KERN: mtrr: 6: base: 0xc0000000, size: 0x40000000, type: 0
4739KERN: mtrr: 7: base: 0xa0000000, size: 0x20000000, type: 1
4740KERN: update_mtrrs(): Succeeded setting MTRRs after ignoring uncacheable ranges up to size 0x1000.
4741KERN: remove_memory_type_range(7422, 0x1b49b000, 0x28000, 0)
4742KERN: set MTRRs to:
4743KERN: mtrr: 0: base: 0x1b448000, size: 0x1000, type: 0
4744KERN: mtrr: 1: base: 0x1b468000, size: 0x1000, type: 0
4745KERN: mtrr: 2: base: 0x8e400000, size: 0x400000, type: 0
4746KERN: mtrr: 3: base: 0xc0000000, size: 0x40000000, type: 0
4747KERN: mtrr: 4: base: 0xa0000000, size: 0x20000000, type: 1
4748KERN: remove_memory_type_range(7423, 0x1b468000, 0x1000, 0)
4749KERN: set MTRRs to:
4750KERN: mtrr: 0: base: 0x1b448000, size: 0x1000, type: 0
4751KERN: mtrr: 1: base: 0x8e400000, size: 0x400000, type: 0
4752KERN: mtrr: 2: base: 0xc0000000, size: 0x40000000, type: 0
4753KERN: mtrr: 3: base: 0xa0000000, size: 0x20000000, type: 1