Ticket #13722: syslog

File syslog, 175.9 KB (added by vidrep, 2 years ago)
Line 
1KERN: options = 0
2KERN: No APM available.
3KERN: smp: using ACPI to detect MP configuration
4KERN: smp: local apic address is 0xfee00000
5KERN: smp: found local APIC with id 0
6KERN: smp: found local APIC with id 2
7KERN: smp: found local APIC with id 4
8KERN: smp: found local APIC with id 6
9KERN: smp: found io APIC with id 2 and address 0xfec00000
10KERN: VESA version = 3.0, capabilities 1
11KERN: OEM string: AMD ATOMBIOS
12KERN: 0x100: 640 x 400 x 8 (a = 187, mem = 4, phy = e0000000, p = 1, b = 1)
13KERN: mask: r: 0 0 g: 0 0 b: 0 0 dcmi: 0
14KERN: 0x101: 640 x 480 x 8 (a = 187, mem = 4, phy = e0000000, p = 1, b = 1)
15KERN: mask: r: 0 0 g: 0 0 b: 0 0 dcmi: 0
16KERN: 0x103: 800 x 600 x 8 (a = 187, mem = 4, phy = e0000000, p = 1, b = 1)
17KERN: mask: r: 0 0 g: 0 0 b: 0 0 dcmi: 0
18KERN: 0x105: 1024 x 768 x 8 (a = 187, mem = 4, phy = e0000000, p = 1, b = 1)
19KERN: mask: r: 0 0 g: 0 0 b: 0 0 dcmi: 0
20KERN: 0x107: 1280 x 1024 x 8 (a = 187, mem = 4, phy = e0000000, p = 1, b = 1)
21KERN: mask: r: 0 0 g: 0 0 b: 0 0 dcmi: 0
22KERN: 0x110: 640 x 480 x 16 (a = 187, mem = 6, phy = e0000000, p = 1, b = 1)
23KERN: mask: r: 5 10 g: 5 5 b: 5 0 dcmi: 0
24KERN: 0x111: 640 x 480 x 16 (a = 187, mem = 6, phy = e0000000, p = 1, b = 1)
25KERN: mask: r: 5 11 g: 6 5 b: 5 0 dcmi: 0
26KERN: 0x113: 800 x 600 x 16 (a = 187, mem = 6, phy = e0000000, p = 1, b = 1)
27KERN: mask: r: 5 10 g: 5 5 b: 5 0 dcmi: 0
28KERN: 0x114: 800 x 600 x 16 (a = 187, mem = 6, phy = e0000000, p = 1, b = 1)
29KERN: mask: r: 5 11 g: 6 5 b: 5 0 dcmi: 0
30KERN: 0x116: 1024 x 768 x 16 (a = 187, mem = 6, phy = e0000000, p = 1, b = 1)
31KERN: mask: r: 5 10 g: 5 5 b: 5 0 dcmi: 0
32KERN: 0x117: 1024 x 768 x 16 (a = 187, mem = 6, phy = e0000000, p = 1, b = 1)
33KERN: mask: r: 5 11 g: 6 5 b: 5 0 dcmi: 0
34KERN: 0x119: 1280 x 1024 x 16 (a = 187, mem = 6, phy = e0000000, p = 1, b = 1)
35KERN: mask: r: 5 10 g: 5 5 b: 5 0 dcmi: 0
36KERN: 0x11a: 1280 x 1024 x 16 (a = 187, mem = 6, phy = e0000000, p = 1, b = 1)
37KERN: mask: r: 5 11 g: 6 5 b: 5 0 dcmi: 0
38KERN: 0x10d: 320 x 200 x 16 (a = 187, mem = 6, phy = e0000000, p = 1, b = 1)
39KERN: mask: r: 5 10 g: 5 5 b: 5 0 dcmi: 0
40KERN: 0x10e: 320 x 200 x 16 (a = 187, mem = 6, phy = e0000000, p = 1, b = 1)
41KERN: mask: r: 5 11 g: 6 5 b: 5 0 dcmi: 0
42KERN: 0x120: 320 x 200 x 32 (a = 187, mem = 6, phy = e0000000, p = 1, b = 1)
43KERN: mask: r: 8 16 g: 8 8 b: 8 0 dcmi: 0
44KERN: 0x193: 320 x 240 x 8 (a = 187, mem = 4, phy = e0000000, p = 1, b = 1)
45KERN: mask: r: 0 0 g: 0 0 b: 0 0 dcmi: 0
46KERN: 0x195: 320 x 240 x 16 (a = 187, mem = 6, phy = e0000000, p = 1, b = 1)
47KERN: mask: r: 5 11 g: 6 5 b: 5 0 dcmi: 0
48KERN: 0x196: 320 x 240 x 32 (a = 187, mem = 6, phy = e0000000, p = 1, b = 1)
49KERN: mask: r: 8 16 g: 8 8 b: 8 0 dcmi: 0
50KERN: 0x1b3: 512 x 384 x 8 (a = 187, mem = 4, phy = e0000000, p = 1, b = 1)
51KERN: mask: r: 0 0 g: 0 0 b: 0 0 dcmi: 0
52KERN: 0x1b5: 512 x 384 x 16 (a = 187, mem = 6, phy = e0000000, p = 1, b = 1)
53KERN: mask: r: 5 11 g: 6 5 b: 5 0 dcmi: 0
54KERN: 0x1b6: 512 x 384 x 32 (a = 187, mem = 6, phy = e0000000, p = 1, b = 1)
55KERN: mask: r: 8 16 g: 8 8 b: 8 0 dcmi: 0
56KERN: 0x1c3: 640 x 350 x 8 (a = 187, mem = 4, phy = e0000000, p = 1, b = 1)
57KERN: mask: r: 0 0 g: 0 0 b: 0 0 dcmi: 0
58KERN: 0x1c5: 640 x 350 x 16 (a = 187, mem = 6, phy = e0000000, p = 1, b = 1)
59KERN: mask: r: 5 11 g: 6 5 b: 5 0 dcmi: 0
60KERN: 0x1c6: 640 x 350 x 32 (a = 187, mem = 6, phy = e0000000, p = 1, b = 1)
61KERN: mask: r: 8 16 g: 8 8 b: 8 0 dcmi: 0
62KERN: 0x133: 720 x 400 x 8 (a = 187, mem = 4, phy = e0000000, p = 1, b = 1)
63KERN: mask: r: 0 0 g: 0 0 b: 0 0 dcmi: 0
64KERN: 0x135: 720 x 400 x 16 (a = 187, mem = 6, phy = e0000000, p = 1, b = 1)
65KERN: mask: r: 5 11 g: 6 5 b: 5 0 dcmi: 0
66KERN: 0x136: 720 x 400 x 32 (a = 187, mem = 6, phy = e0000000, p = 1, b = 1)
67KERN: mask: r: 8 16 g: 8 8 b: 8 0 dcmi: 0
68KERN: 0x153: 1152 x 864 x 8 (a = 187, mem = 4, phy = e0000000, p = 1, b = 1)
69KERN: mask: r: 0 0 g: 0 0 b: 0 0 dcmi: 0
70KERN: 0x155: 1152 x 864 x 16 (a = 187, mem = 6, phy = e0000000, p = 1, b = 1)
71KERN: mask: r: 5 11 g: 6 5 b: 5 0 dcmi: 0
72KERN: 0x156: 1152 x 864 x 32 (a = 187, mem = 6, phy = e0000000, p = 1, b = 1)
73KERN: mask: r: 8 16 g: 8 8 b: 8 0 dcmi: 0
74KERN: 0x163: 1280 x 960 x 8 (a = 187, mem = 4, phy = e0000000, p = 1, b = 1)
75KERN: mask: r: 0 0 g: 0 0 b: 0 0 dcmi: 0
76KERN: 0x165: 1280 x 960 x 16 (a = 187, mem = 6, phy = e0000000, p = 1, b = 1)
77KERN: mask: r: 5 11 g: 6 5 b: 5 0 dcmi: 0
78KERN: 0x166: 1280 x 960 x 32 (a = 187, mem = 6, phy = e0000000, p = 1, b = 1)
79KERN: mask: r: 8 16 g: 8 8 b: 8 0 dcmi: 0
80KERN: 0x121: 640 x 480 x 32 (a = 187, mem = 6, phy = e0000000, p = 1, b = 1)
81KERN: mask: r: 8 16 g: 8 8 b: 8 0 dcmi: 0
82KERN: 0x122: 800 x 600 x 32 (a = 187, mem = 6, phy = e0000000, p = 1, b = 1)
83KERN: mask: r: 8 16 g: 8 8 b: 8 0 dcmi: 0
84KERN: 0x123: 1024 x 768 x 32 (a = 187, mem = 6, phy = e0000000, p = 1, b = 1)
85KERN: mask: r: 8 16 g: 8 8 b: 8 0 dcmi: 0
86KERN: 0x124: 1280 x 1024 x 32 (a = 187, mem = 6, phy = e0000000, p = 1, b = 1)
87KERN: mask: r: 8 16 g: 8 8 b: 8 0 dcmi: 0
88KERN: 0x143: 1400 x 1050 x 8 (a = 187, mem = 4, phy = e0000000, p = 1, b = 1)
89KERN: mask: r: 0 0 g: 0 0 b: 0 0 dcmi: 0
90KERN: 0x145: 1400 x 1050 x 16 (a = 187, mem = 6, phy = e0000000, p = 1, b = 1)
91KERN: mask: r: 5 11 g: 6 5 b: 5 0 dcmi: 0
92KERN: 0x146: 1400 x 1050 x 32 (a = 187, mem = 6, phy = e0000000, p = 1, b = 1)
93KERN: mask: r: 8 16 g: 8 8 b: 8 0 dcmi: 0
94KERN: 0x173: 1600 x 1200 x 8 (a = 186, mem = 4, phy = e0000000, p = 1, b = 1)
95KERN: mask: r: 0 0 g: 0 0 b: 0 0 dcmi: 0
96KERN: 0x175: 1600 x 1200 x 16 (a = 186, mem = 6, phy = e0000000, p = 1, b = 1)
97KERN: mask: r: 5 11 g: 6 5 b: 5 0 dcmi: 0
98KERN: 0x176: 1600 x 1200 x 32 (a = 186, mem = 6, phy = e0000000, p = 1, b = 1)
99KERN: mask: r: 8 16 g: 8 8 b: 8 0 dcmi: 0
100KERN: 0x183: 1792 x 1344 x 8 (a = 186, mem = 4, phy = e0000000, p = 1, b = 1)
101KERN: mask: r: 0 0 g: 0 0 b: 0 0 dcmi: 0
102KERN: 0x185: 1792 x 1344 x 16 (a = 186, mem = 6, phy = e0000000, p = 1, b = 1)
103KERN: mask: r: 5 11 g: 6 5 b: 5 0 dcmi: 0
104KERN: 0x186: 1792 x 1344 x 32 (a = 186, mem = 6, phy = e0000000, p = 1, b = 1)
105KERN: mask: r: 8 16 g: 8 8 b: 8 0 dcmi: 0
106KERN: 0x1d3: 1856 x 1392 x 8 (a = 186, mem = 4, phy = e0000000, p = 1, b = 1)
107KERN: mask: r: 0 0 g: 0 0 b: 0 0 dcmi: 0
108KERN: 0x1d5: 1856 x 1392 x 16 (a = 186, mem = 6, phy = e0000000, p = 1, b = 1)
109KERN: mask: r: 5 11 g: 6 5 b: 5 0 dcmi: 0
110KERN: 0x1d6: 1856 x 1392 x 32 (a = 186, mem = 6, phy = e0000000, p = 1, b = 1)
111KERN: mask: r: 8 16 g: 8 8 b: 8 0 dcmi: 0
112KERN: 0x1e3: 1920 x 1440 x 8 (a = 186, mem = 4, phy = e0000000, p = 1, b = 1)
113KERN: mask: r: 0 0 g: 0 0 b: 0 0 dcmi: 0
114KERN: 0x1e5: 1920 x 1440 x 16 (a = 186, mem = 6, phy = e0000000, p = 1, b = 1)
115KERN: mask: r: 5 11 g: 6 5 b: 5 0 dcmi: 0
116KERN: 0x1e6: 1920 x 1440 x 32 (a = 186, mem = 6, phy = e0000000, p = 1, b = 1)
117KERN: mask: r: 8 16 g: 8 8 b: 8 0 dcmi: 0
118KERN: Using mode 0x123
119KERN: VESA compatible graphics!
120KERN: EDID1: 4f
121KERN: EDID2: ebx 102
122KERN: EDID3: 4f
123KERN: Vendor: DEL
124KERN: Product ID: 16462
125KERN: Serial #: 892482899
126KERN: Produced in week/year: 1/2011
127KERN: EDID version: 1.3
128KERN: Type: Digital
129KERN: Size: 47 cm x 30 cm
130KERN: Gamma=2.2
131KERN: White (X,Y)=(0.313,0.329)
132KERN: Supported Future Video Modes:
133KERN: 1152x864@75Hz (id=20337)
134KERN: 1280x1024@60Hz (id=32897)
135KERN: 1680x1680@60Hz (id=179)
136KERN: Supported VESA Video Modes:
137KERN: 720x400@70Hz
138KERN: 640x480@60Hz
139KERN: 640x480@75Hz
140KERN: 800x600@60Hz
141KERN: 800x600@75Hz
142KERN: 1024x768@60Hz
143KERN: 1024x768@75Hz
144KERN: 1280x1024@75Hz
145KERN: Additional Video Mode (1680x1050@59Hz):
146KERN: clock=119 MHz
147KERN: h: (1680, 1728, 1760, 1840)
148KERN: v: (1050, 1053, 1059, 1080)
149KERN: size: 47.4 cm x 29.6 cm
150KERN: border: 0 cm x 0 cm
151KERN: Serial Number: W466K117525S
152KERN: Monitor Name: DELL P2210
153KERN: Horizontal frequency range = 30..83 kHz
154KERN: Vertical frequency range = 56..75 Hz
155KERN: Maximum pixel clock = 160 MHz
156KERN: Welcome to the Haiku boot loader!
157KERN: number of drives: 1
158KERN: add_partitions_for(0x00105538, mountFS = no)
159KERN: add_partitions_for(fd = 0, mountFS = no)
160KERN: 0x001056a0 Partition::Partition
161KERN: 0x001056a0 Partition::Scan()
162KERN: check for partitioning_system: GUID Partition Map
163KERN: EFI header: EFI PART
164KERN: EFI revision: 10000
165KERN: header size: 92
166KERN: header CRC: 8a5754fb
167KERN: absolute block: 1
168KERN: alternate block: 625142447
169KERN: first usable block: 34
170KERN: last usable block: 625142414
171KERN: disk GUID: 33989eaa-1edd-5942-b895-0a697ad2cb49
172KERN: entries block: 2
173KERN: entry size: 128
174KERN: entry count: 128
175KERN: entries CRC: 338d80cd
176KERN: EFI header: EFI PART
177KERN: EFI revision: 10000
178KERN: header size: 92
179KERN: header CRC: 8a5754fb
180KERN: absolute block: 625142447
181KERN: alternate block: 1
182KERN: first usable block: 34
183KERN: last usable block: 625142414
184KERN: disk GUID: 33989eaa-1edd-5942-b895-0a697ad2cb49
185KERN: entries block: 625142415
186KERN: entry size: 128
187KERN: entry count: 128
188KERN: entries CRC: 338d80cd
189KERN: [ 0] partition type: 42465331-3ba3-10f1-802a-4861696b7521
190KERN: unique id: 12bc1b5b-d7ec-1747-bf31-d0c51e6ace37
191KERN: start block: 40
192KERN: end block: 312571943
193KERN: size: 152622.999 MB
194KERN: attributes: 0
195KERN: name: Haiku x86_gcc2h
196KERN: [ 1] partition type: 42465331-3ba3-10f1-802a-4861696b7521
197KERN: unique id: f676ea09-9d71-444a-be87-89f09ec93a0eKERN:
198KERN: start block: 312571944
199KERN: end block: 625141799
200KERN: size: 152621.999 MB
201KERN: attributes: 0
202KERN: name: Haiku x86_64
203KERN: priority: 750
204KERN: check for partitioning_system: Intel Partition Map
205KERN: priority: 500
206KERN: check for partitioning_system: Intel Extended Partition
207KERN: efi_gpt_scan_partition(cookie = 0x00105748)
208KERN: 0x00105830 Partition::Partition
209KERN: 0x001056a0 Partition::AddChild 0x00105830
210KERN: 0x00105830 Partition::SetParent 0x001056a0
211KERN: new child partition!
212KERN: 0x001058e8 Partition::Partition
213KERN: 0x001056a0 Partition::AddChild 0x001058e8
214KERN: 0x001058e8 Partition::SetParent 0x001056a0
215KERN: new child partition!
216KERN: 0x001056a0 Partition::Scan(): scan child 0x00105830 (start = 20480, size = 160036814848, parent = 0x001056a0)!
217KERN: 0x00105830 Partition::Scan()
218KERN: check for partitioning_system: GUID Partition Map
219KERN: check for partitioning_system: Intel Partition Map
220KERN: check for partitioning_system: Intel Extended Partition
221KERN: 0x001056a0 Partition::Scan(): scan child 0x001058e8 (start = 160036835328, size = 160035766272, parent = 0x001056a0)!
222KERN: 0x001058e8 Partition::Scan()
223KERN: check for partitioning_system: GUID Partition Map
224KERN: check for partitioning_system: Intel Partition Map
225KERN: check for partitioning_system: Intel Extended Partition
226KERN: 0x001056a0 Partition::~Partition
227KERN: 0x00105830 Partition::SetParent 0x00000000
228KERN: 0x001058e8 Partition::SetParent 0x00000000
229KERN: boot partition offset: 20480
230KERN: 0x00105830 Partition::_Mount check for file_system: BFS Filesystem
231KERN: PackageVolumeInfo::SetTo()
232KERN: PackageVolumeInfo::_InitState(): failed to parse activated-packages: No such file or directory
233KERN: PackageVolumeInfo::SetTo(): failed to open administrative directory: No such file or directory
234KERN: load kernel kernel_x86...
235KERN: video mode: 1280x1024x32
236KERN: maximum boot loader heap usage: 488176, currently used: 478000
237KERN: smp: found 4 cpus
238KERN: smp: apic_phys = 0xfee00000
239KERN: smp: ioapic_phys = 0xfec00000
240KERN: smp: apic (mapped) = 0x81a55000
241KERN: APIC ticks/sec = 99699152
242KERN: trampolining other cpus
243KERN: wait for delivery
244KERN: deassert INIT
245KERN: wait for delivery
246KERN: num startups = 2
247KERN: send STARTUP
248KERN: wait for delivery
249KERN: send STARTUP
250KERN: wait for delivery
251Last message repeated 1 time
252KERN: deassert INIT
253KERN: wait for delivery
254KERN: num startups = 2
255KERN: send STARTUP
256KERN: wait for delivery
257KERN: send STARTUP
258KERN: wait for delivery
259Last message repeated 1 time
260KERN: deassert INIT
261KERN: wait for delivery
262KERN: num startups = 2
263KERN: send STARTUP
264KERN: wait for delivery
265KERN: send STARTUP
266KERN: wait for delivery
267KERN: done trampolining
268KERN: kernel entry at 800688e0
269KERN: Welcome to kernel debugger output!
270KERN: Haiku revision: hrev51451
271KERN: reserve_io_interrupt_vectors: reserved 2 vectors starting from 98
272KERN: CPU 0: type 0 family 6 extended_family 0 model 10 extended_model 3 stepping 9, string 'GenuineIntel'
273KERN: CPU 0: vendor 'Intel' model name 'Intel(R) Core(TM) i5-3570 CPU @ 3.40GHz'
274KERN: CPU 0: apic id 0, package 0, core 0, smt 0
275KERN: CPU 0: cache sharing: L1 id 0, L2 id 0, L3 id 0
276KERN: CPU 0: features: fpu vme de pse tsc msr pae mce cx8 apic sep mtrr pge mca cmov pat pse36 clfsh ds acpi mmx fxsr sse sse2 ss htt tm pbe sse3 pclmulqdq dtes64 monitor dscpl vmx smx est tm2 ssse3 cx16 xtpr pdcm pcid sse4_1 sse4_2 x2apic popcnt tscdeadline aes xsave avx f16c rdrnd nx long dts itb arat pln ecmd ptm aperfmperf epb
277KERN: reserve_io_interrupt_vectors: reserved 16 vectors starting from 0
278KERN: using PAE paging
279KERN: mark_page_range_in_use(0x0, 0x100): start page is before free list
280KERN: mark_page_range_in_use(0x0, 0xa0): start page is before free list
281KERN: add_memory_type_range(4, 0x0, 0xa0000, 6)
282KERN: add_memory_type_range(5, 0xe0000, 0x20000, 6)
283KERN: add_memory_type_range(92, 0xe0000000, 0x500000, 0)
284KERN: <DROP>Welcome to syslog debug output!
285KERN: Haiku revision: hrev51451
286KERN: found x2apic
287KERN: mapping local apic at 0x81a55000
288KERN: add_memory_type_range(95, 0xfee00000, 0x1000, 0)
289KERN: CPU 2: type 0 family 6 extended_family 0 model 10 extended_model 3 stepping 9, string 'GenuineIntel'
290KERN: CPU 1: type 0 family 6 extended_family 0 model 10 extended_model 3 stepping 9, string 'GenuineIntel'
291KERN: CPU 2: vendor 'Intel' model name 'Intel(R) Core(TM) i5-3570 CPU @ 3.40GHz'
292KERN: CPU 3: type 0 family 6 extended_family 0 model 10 extended_model 3 stepping 9, string 'GenuineIntel'
293KERN: CPU 1: vendor 'Intel' model name 'Intel(R) Core(TM) i5-3570 CPU @ 3.40GHz'
294KERN: CPU 2: apic id 4, package 0, core 2, smt 0
295KERN: CPU 3: vendor 'Intel' model name 'Intel(R) Core(TM) i5-3570 CPU @ 3.40GHz'
296KERN: CPU 1: apic id 2, package 0, core 1, smt 0
297KERN: CPU 2: cache sharing: L1 id 4, L2 id 4, L3 id 0
298KERN: CPU 3: apic id 6, package 0, core 3, smt 0
299KERN: CPU 1: cache sharing: L1 id 2, L2 id 2, L3 id 0
300KERN: CPU 2: features: fpu vme de pse tsc msr pae mce cx8 apic sep mtrr pge mca cmov pat pse36 clfsh ds acpi mmx fxsr sse sse2 ss htt tm pbe sse3 pclmulqdq dtes64 monitor dscpl vmx smx est tm2 ssse3 cx16 xtpr pdcm pcid sse4_1 sse4_2 x2apic popcnt tscdeadline aes xsave avx f16c rdrnd nx long dts itb arat pln ecmd ptm aperfmperf epb
301KERN: CPU 3: cache sharing: L1 id 6, L2 id 6, L3 id 0
302KERN: CPU 1: features: fpu vme de pse tsc msr pae mce cx8 apic sep mtrr pge mca cmov pat pse36 clfsh ds acpi mmx fxsr sse sse2 ss htt tm pbe sse3 pclmulqdq dtes64 monitor dscpl vmx smx est tm2 ssse3 cx16 xtpr pdcm pcid sse4_1 sse4_2 x2apic popcnt tscdeadline aes xsave avx f16c rdrnd nx long dts itb arat pln ecmd ptm aperfmperf epb
303KERN: CPU 3: features: fpu vme de pse tsc msr pae mce cx8 apic sep mtrr pge mca cmov pat pse36 clfsh ds acpi mmx fxsr sse sse2 ss htt tm pbe sse3 pclmulqdq dtes64 monitor dscpl vmx smx est tm2 ssse3 cx16 xtpr pdcm pcid sse4_1 sse4_2 x2apic popcnt tscdeadline aes xsave avx f16c rdrnd nx long dts itb arat pln ecmd ptm aperfmperf epb
304KERN: setting up apic for CPU 0: apic id 0, version 17170453
305KERN: CPU 0: logical apic id: 0x1
306KERN: x86_init_fpu: CPU has SSE... enabling FXSR and XMM.
307KERN: reserve_io_interrupt_vectors: reserved 3 vectors starting from 221
308KERN: reserve_io_interrupt_vectors: reserved 1 vectors starting from 219
309KERN: arch_init_timer: using APIC timer.
310KERN: allocate_commpage_entry(2, 12) -> 0x00000100
311KERN: scheduler_init: found 4 logical cpus and 3 cache levels
312KERN: scheduler switches: single core: false, cpu load tracking: false, core load tracking: true
313KERN: scheduler: switching to low latency mode
314KERN: apm_init()
315KERN: msi support enabled
316KERN: PCI: pci_module_init
317KERN: add_memory_type_range(101, 0x0, 0x1000, 0)
318KERN: remove_memory_type_range(101, 0x0, 0x1000, 0)
319KERN: add_memory_type_range(102, 0x9f000, 0x1000, 0)
320KERN: remove_memory_type_range(102, 0x9f000, 0x1000, 0)
321KERN: add_memory_type_range(103, 0xe0000, 0x20000, 0)
322KERN: add_memory_type_range(104, 0xdd1e4000, 0x1000, 0)
323KERN: remove_memory_type_range(103, 0xe0000, 0x20000, 0)
324KERN: add_memory_type_range(105, 0xdd1ee000, 0x1000, 0)
325KERN: remove_memory_type_range(105, 0xdd1ee000, 0x1000, 0)
326KERN: add_memory_type_range(106, 0xdd1ee000, 0x1000, 0)
327KERN: remove_memory_type_range(106, 0xdd1ee000, 0x1000, 0)
328KERN: add_memory_type_range(107, 0xdd1ee000, 0x1000, 0)
329KERN: remove_memory_type_range(107, 0xdd1ee000, 0x1000, 0)
330KERN: add_memory_type_range(108, 0xdd1ee000, 0x1000, 0)
331KERN: remove_memory_type_range(108, 0xdd1ee000, 0x1000, 0)
332KERN: add_memory_type_range(109, 0xdd1ee000, 0x1000, 0)
333KERN: PCI: mechanism addr: f8000000, seg: 0, start: 0, end: 3f
334KERN: add_memory_type_range(110, 0xf8000000, 0x4000000, 0)
335KERN: PCI: mechanism pcie controller found
336KERN: PCI: FixupDevices: checking bus 1 behind 8086:0151
337KERN: PCI: FixupDevices: checking bus 2 behind 8086:244e
338KERN: PCI: dom 0, bus 0, dev 1, func 0, changed PCI bridge control from 0x001a to 0x001b
339KERN: PCI: dom 0, bus 0, dev 30, func 0, changed PCI bridge control from 0x0012 to 0x0833
340KERN: PCI: [dom 0, bus 0] bus 0, device 0, function 0: vendor 8086, device 0150, revision 09
341KERN: PCI: class_base 06, class_function 00, class_api 00
342KERN: PCI: vendor 8086: Intel Corporation
343KERN: PCI: device 0150: Xeon E3-1200 v2/3rd Gen Core processor DRAM Controller
344KERN: PCI: info: Bridge (Host bridge)
345KERN: PCI: line_size 00, latency 00, header_type 00, BIST 00
346KERN: PCI: ROM base host 00000000, pci 00000000, size 00000000
347KERN: PCI: cardbus_CIS 00000000, subsystem_id 3397, subsystem_vendor_id 103c
348KERN: PCI: interrupt_line 00, interrupt_pin 00, min_grant 00, max_latency 00
349KERN: PCI: base reg 0: host 00000000, pci 00000000, size 00000000, flags 00
350KERN: PCI: base reg 1: host 00000000, pci 00000000, size 00000000, flags 00
351KERN: PCI: base reg 2: host 00000000, pci 00000000, size 00000000, flags 00
352KERN: PCI: base reg 3: host 00000000, pci 00000000, size 00000000, flags 00
353KERN: PCI: base reg 4: host 00000000, pci 00000000, size 00000000, flags 00
354KERN: PCI: base reg 5: host 00000000, pci 00000000, size 00000000, flags 00
355KERN: PCI: CapaKERN: bilities: vendspec
356KERN: PCI: [dom 0, bus 0] bus 0, device 1, function 0: vendor 8086, device 0151, revision 09
357KERN: PCI: class_base 06, class_function 04, class_api 00
358KERN: PCI: vendor 8086: Intel Corporation
359KERN: PCI: device 0151: Xeon E3-1200 v2/3rd Gen Core processor PCI Express Root Port
360KERN: PCI: info: Bridge (PCI bridge, Normal decode)
361KERN: PCI: line_size 10, latency 00, header_type 81, BIST 00
362KERN: PCI: subsystem_id 0000, subsystem_vendor_id 0088
363KERN: PCI: primary_bus 00, secondary_bus 01, subordinate_bus 01, secondary_latency 00
364KERN: PCI: I/O window e000-efff
365KERN: PCI: memory window f7e00000-f7efffff
366KERN: PCI: prefetchable memory window 00000000e0000000-00000000efffffff
367KERN: PCI: bridge_control 001b, secondary_status 0000
368KERN: PCI: interrupt_line 0b, interrupt_pin 01
369KERN: PCI: ROM base host 00000000, pci 00000000, size ??
370KERN: PCI: base reg 0: host 00000000, pci 00000000, size 00000000, flags 00
371KERN: PCI: base reg 1: host 00000000, pci 00000000, size 00000000, flags 00
372KERN: PCI: Capabilities: subvendor, PM, MSI, PCIe
373KERN: PCI: Extended capabilities: Virtual Channel, Root Complex Link Declaration, Secondary PCIe
374KERN: PCI: [dom 0, bus 1] bus 1, device 0, function 0: vendor 1002, device 675d, revision 00
375KERN: PCI: class_base 03, class_function 00, class_api 00
376KERN: PCI: vendor 1002: Advanced Micro Devices, Inc. [AMD/ATI]
377KERN: PCI: device 675d: Turks PRO [Radeon HD 7570]
378KERN: PCI: info: Display controller (VGA compatible controller, VGA controller)
379KERN: PCI: line_size 10, latency 00, header_type 80, BIST 00
380KERN: PCI: ROM base host f7e00000, pci f7e00000, size 00020000
381KERN: PCI: cardbus_CIS 00000000, subsystem_id 2b20, subsystem_vendor_id 1028
382KERN: PCI: interrupt_line 0b, interrupt_pin 01, min_grant 00, max_latency 00
383KERN: PCI: base reg 0: host e0000000, pci e0000000, size 10000000, flags 0c
384KERN: PCI: base reg 1: host 00000000, pci 00000000, size 00000000, flags 00
385KERN: PCI: base reg 2: host f7e20000, pci f7e20000, size 00020000, flags 04
386KERN: PCI: base reg 3: host 00000000, pci 00000000, size 00000000, flags 00
387KERN: PCI: base reg 4: host 0000e000, pci 0000e000, size 00000100, flags 01
388KERN: PCI: base reg 5: host 00000000, pci 00000000, size 00000000, flags 00
389KERN: PCI: Capabilities: PM, PCIe, MSI
390KERN: PCI: Extended capabilities: Vendor Unique, Advanced Error Reporting
391KERN: PCI: [dom 0, bus 1] bus 1, device 0, function 1: vendor 1002, device aa90, revision 00
392KERN: PCI: class_base 04, class_function 03, class_api 00
393KERN: PCI: vendor 1002: Advanced Micro Devices, Inc. [AMD/ATI]
394KERN: PCI: device aa90: Turks HDMI Audio [Radeon HD 6500/6600 / 6700M Series]
395KERN: PCI: info: Multimedia controller (Audio device)
396KERN: PCI: line_size 10, latency 00, header_type 80, BIST 00
397KERN: PCI: ROM base host 00000000, pci 00000000, size 00000000
398KERN: PCI: cardbus_CIS 00000000, subsystem_id aa90, subsystem_vendor_id 1028
399KERN: PCI: interrupt_line 0a, interrupt_pin 02, min_grant 00, max_latency 00
400KERN: PCI: base reg 0: host f7e40000, pci f7e40000, size 00004000, flags 04
401KERN: PCI: base reg 1: host 00000000, pci 00000000, size 00000000, flags 00
402KERN: PCI: base reg 2: host 00000000, pci 00000000, size 00000000, flags 00
403KERN: PCI: base reg 3: host 00000000, pci 00000000, size 00000000, flags 00
404KERN: PCI: base reg 4: host 00000000, pci 00000000, size 00000000, flags 00
405KERN: PCI: base reg 5: host 00000000, pci 00000000, size 00000000, flags 00
406KERN: PCI: Capabilities: PM, PCIe, MSI
407KERN: PCI: Extended capabilities: Vendor Unique, Advanced Error Reporting
408KERN: PCI: [dom 0, bus 0] bus 0, device 20, function 0: vendor 8086, device 1e31, revision 04
409KERN: PCI: class_base 0c, class_function 03, class_api 30
410KERN: PCI: vendor 8086: Intel Corporation
411KERN: PCI: device 1e31: 7 Series/C210 Series Chipset Family USB xHCI Host Controller
412KERN: PCI: info: Serial bus controller (USB controller, XHCI)
413KERN: PCI: line_size 00, latency 00, header_type 00, BIST 00
414KERN: PCI: ROM base host 00000000, pci 00000000, size 00000000
415KERN: PCI: cardbus_CIS 00000000, subsystem_id 3397, subsystem_vendor_id 103c
416KERN: PCI: interrupt_line 0b, interrupt_pin 01, min_grant 00, max_latency 00
417KERN: PCI: base reg 0: host f7f20000, pci f7f20000, size 00010000, flags 04
418KERN: PCI: base reg 1: host 00000000, pci 00000000, size 00000000, flags 00
419KERN: PCI: base reg 2: host 00000000, pci 00000000, size 00000000, flags 00
420KERN: PCI: base reg 3: host 00000000, pci 00000000, size 00000000, flags 00
421KERN: PCI: base reg 4: host 00000000, pci 00000000, size 00000000, flags 00
422KERN: PCI: base reg 5: host 00000000, pci 00000000, size 00000000, flags 00
423KERN: PCI: Capabilities: PM, MSI
424KERN: PCI: [dom 0, bus 0] bus 0, device 25, function 0: vendor 8086, device 1502, revision 04
425KERN: PCI: class_base 02, class_function 00, class_api 00
426KERN: PCI: vendor 8086: Intel Corporation
427KERN: PCI: device 1502: 82579LM Gigabit Network Connection (Lewisville)
428KERN: PCI: info: Network controller (Ethernet controller)
429KERN: PCI: line_size 00, latency 00, header_type 00, BIST 00
430KERN: PCI: ROM base host 00000000, pci 00000000, size 00000000
431KERN: PCI: cardbus_CIS 00000000, subsystem_id 3397, subsystem_vendor_id 103c
432KERN: PCI: interrupt_line 0a, interrupt_pin 01, min_grant 00, max_latency 00
433KERN: PCI: base reg 0: host f7f00000, pci f7f00000, size 00020000, flags 00
434KERN: PCI: base reg 1: host f7f39000, pci f7f39000, size 00001000, flags 00
435KERN: PCI: base reg 2: host 0000f040, pci 0000f040, size 00000020, flags 01
436KERN: PCI: base reg 3: host 00000000, pci 00000000, size 00000000, flags 00
437KERN: PCI: base reg 4: host 00000000, pci 00000000, size 00000000, flags 00
438KERN: PCI: base reg 5: host 00000000, pci 00000000, size 00000000, flags 00
439KERN: PCI: Capabilities: PM, MSI, AdvancedFeatures
440KERN: PCI: [dom 0, bus 0] bus 0, device 26, function 0: vendor 8086, device 1e2d, revision 04
441KERN: PCI: class_base 0c, class_function 03, class_api 20
442KERN: PCI: vendor 8086: Intel Corporation
443KERN: PCI: device 1e2d: 7 Series/C216 Chipset Family USB Enhanced Host Controller #2
444KERN: PCI: info: Serial bus controller (USB controller, EHCI)
445KERN: PCI: line_size 00, latency 00, header_type 00, BIST 00
446KERN: PCI: ROM base host 00000000, pci 00000000, size 00000000
447KERN: PCI: cardbus_CIS 00000000, subsystem_id 3397, subsystem_vendor_id 103c
448KERN: PCI: interrupt_line 0b, interrupt_pin 01, min_grant 00, max_latency 00
449KERN: PCI: base reg 0: host f7f38000, pci f7f38000, size 00000400, flags 00
450KERN: PCI: base reg 1: host 00000000, pci 00000000, size 00000000, flags 00
451KERN: PCI: base reg 2: host 00000000, pci 00000000, size 00000000, flags 00
452KERN: PCI: base reg 3: host 00000000, pci 00000000, size 00000000, flags 00
453KERN: PCI: base reg 4: host 00000000, pci 00000000, size 00000000, flags 00
454KERN: PCI: base reg 5: host 00000000, pci 00000000, size 00000000, flags 00
455KERN: PCI: Capabilities: PM, DebugPort, AdvancedFeatures
456KERN: PCI: [dom 0, bus 0] bus 0, device 27, function 0: vendor 8086, device 1e20, revision 04
457KERN: PCI: class_base 04, class_function 03, class_api 00
458KERN: PCI: vendor 8086: Intel Corporation
459KERN: PCI: device 1e20: 7 Series/C216 Chipset Family High Definition Audio Controller
460KERN: PCI: info: Multimedia controller (Audio device)
461KERN: PCI: line_size 10, latency 00, header_type 00, BIST 00
462KERN: PCI: ROM base host 00000000, pci 00000000, size 00000000
463KERN: PCI: cardbus_CIS 00000000, subsystem_id 3397, subsystem_vendor_id 103c
464KERN: PCI: interrupt_line 05, interrupt_pin 01, min_grant 00, max_latency 00
465KERN: PCI: base reg 0: host f7f30000, pci f7f30000, size 00004000, flags 04
466KERN: PCI: base reg 1: host 00000000, pci 00000000, size 00000000, flags 00
467KERN: PCI: base reg 2: host 00000000, pci 00000000, size 00000000, flags 00
468KERN: PCI: base reg 3: host 00000000, pci 00000000, size 00000000, flags 00
469KERN: PCI: base reg 4: host 00000000, pci 00000000, size 00000000, flags 00
470KERN: PCI: base reg 5: host 00000000, pci 00000000, size 00000000, flags 00
471KERN: PCI: Capabilities: PM, MSI, PCIe
472KERN: PCI: Extended capabilities: Virtual Channel, Root Complex Link Declaration
473KERN: PCI: [dom 0, bus 0] bus 0, device 29, function 0: vendor 8086, device 1e26, revision 04
474KERN: PCI: class_base 0c, class_function 03, class_api 20
475KERN: PCI: vendor 8086: Intel Corporation
476KERN: PCI: device 1e26: 7 Series/C216 Chipset Family USB Enhanced Host Controller #1
477KERN: PCI: info: Serial bus controller (USB controller, EHCI)
478KERN: PCI: line_size 00, latency 00, header_type 00, BIST 00
479KERN: PCI: ROM base host 00000000, pci 00000000, size 00000000
480KERN: PCI: cardbus_CIS 00000000, subsystem_id 3397, subsystem_vendor_id 103c
481KERN: PCI: KERN: interrupt_line 0b, interrupt_pin 01, min_grant 00, max_latency 00
482KERN: PCI: base reg 0: host f7f37000, pci f7f37000, size 00000400, flags 00
483KERN: PCI: base reg 1: host 00000000, pci 00000000, size 00000000, flags 00
484KERN: PCI: base reg 2: host 00000000, pci 00000000, size 00000000, flags 00
485KERN: PCI: base reg 3: host 00000000, pci 00000000, size 00000000, flags 00
486KERN: PCI: base reg 4: host 00000000, pci 00000000, size 00000000, flags 00
487KERN: PCI: base reg 5: host 00000000, pci 00000000, size 00000000, flags 00
488KERN: PCI: Capabilities: PM, DebugPort, AdvancedFeatures
489KERN: PCI: [dom 0, bus 0] bus 0, device 30, function 0: vendor 8086, device 244e, revision a4
490KERN: PCI: class_base 06, class_function 04, class_api 01
491KERN: PCI: vendor 8086: Intel Corporation
492KERN: PCI: device 244e: 82801 PCI Bridge
493KERN: PCI: info: Bridge (PCI bridge, Subtractive decode)
494KERN: PCI: line_size 00, latency 00, header_type 01, BIST 00
495KERN: PCI: subsystem_id 0000, subsystem_vendor_id 0050
496KERN: PCI: primary_bus 00, secondary_bus 02, subordinate_bus 02, secondary_latency 20
497KERN: PCI: I/O window f000-0fff
498KERN: PCI: memory window fff00000-000fffff
499KERN: PCI: prefetchable memory window 00000000fff00000-00000000000fffff
500KERN: PCI: bridge_control 0833, secondary_status 0280
501KERN: PCI: interrupt_line ff, interrupt_pin 00
502KERN: PCI: ROM base host 00000000, pci 00000000, size ??
503KERN: PCI: base reg 0: host 00000000, pci 00000000, size 00000000, flags 00
504KERN: PCI: base reg 1: host 00000000, pci 00000000, size 00000000, flags 00
505KERN: PCI: Capabilities: subvendor
506KERN: PCI: [dom 0, bus 0] bus 0, device 31, function 0: vendor 8086, device 1e47, revision 04
507KERN: PCI: class_base 06, class_function 01, class_api 00
508KERN: PCI: vendor 8086: Intel Corporation
509KERN: PCI: device 1e47: Q77 Express Chipset LPC Controller
510KERN: PCI: info: Bridge (ISA bridge)
511KERN: PCI: line_size 00, latency 00, header_type 80, BIST 00
512KERN: PCI: ROM base host 00000000, pci 00000000, size 00000000
513KERN: PCI: cardbus_CIS 00000000, subsystem_id 3397, subsystem_vendor_id 103c
514KERN: PCI: interrupt_line 00, interrupt_pin 00, min_grant 00, max_latency 00
515KERN: PCI: base reg 0: host 00000000, pci 00000000, size 00000000, flags 00
516KERN: PCI: base reg 1: host 00000000, pci 00000000, size 00000000, flags 00
517KERN: PCI: base reg 2: host 00000000, pci 00000000, size 00000000, flags 00
518KERN: PCI: base reg 3: host 00000000, pci 00000000, size 00000000, flags 00
519KERN: PCI: base reg 4: host 00000000, pci 00000000, size 00000000, flags 00
520KERN: PCI: base reg 5: host 00000000, pci 00000000, size 00000000, flags 00
521KERN: PCI: Capabilities: vendspec
522KERN: PCI: [dom 0, bus 0] bus 0, device 31, function 2: vendor 8086, device 1e02, revision 04
523KERN: PCI: class_base 01, class_function 06, class_api 01
524KERN: PCI: vendor 8086: Intel Corporation
525KERN: PCI: device 1e02: 7 Series/C210 Series Chipset Family 6-port SATA Controller [AHCI mode]
526KERN: PCI: info: Mass storage controller (SATA controller, AHCI 1.0)
527KERN: PCI: line_size 00, latency 00, header_type 00, BIST 00
528KERN: PCI: ROM base host 00000000, pci 00000000, size 00000000
529KERN: PCI: cardbus_CIS 00000000, subsystem_id 3397, subsystem_vendor_id 103c
530KERN: PCI: interrupt_line 05, interrupt_pin 02, min_grant 00, max_latency 00
531KERN: PCI: base reg 0: host 0000f090, pci 0000f090, size 00000008, flags 01
532KERN: PCI: base reg 1: host 0000f080, pci 0000f080, size 00000004, flags 01
533KERN: PCI: base reg 2: host 0000f070, pci 0000f070, size 00000008, flags 01
534KERN: PCI: base reg 3: host 0000f060, pci 0000f060, size 00000004, flags 01
535KERN: PCI: base reg 4: host 0000f020, pci 0000f020, size 00000020, flags 01
536KERN: PCI: base reg 5: host f7f36000, pci f7f36000, size 00000800, flags 00
537KERN: PCI: Capabilities: MSI, PM, SATA, AdvancedFeatures
538KERN: PCI: [dom 0, bus 0] bus 0, device 31, function 3: vendor 8086, device 1e22, revision 04
539KERN: PCI: class_base 0c, class_function 05, class_api 00
540KERN: PCI: vendor 8086: Intel Corporation
541KERN: PCI: device 1e22: 7 Series/C216 Chipset Family SMBus Controller
542KERN: PCI: info: Serial bus controller (SMBus)
543KERN: PCI: line_size 00, latency 00, header_type 00, BIST 00
544KERN: PCI: ROM base host 00000000, pci 00000000, size 00000000
545KERN: PCI: cardbus_CIS 00000000, subsystem_id 3397, subsystem_vendor_id 103c
546KERN: PCI: interrupt_line 0b, interrupt_pin 03, min_grant 00, max_latency 00
547KERN: PCI: base reg 0: host f7f35000, pci f7f35000, size 00000100, flags 04
548KERN: PCI: base reg 1: host 00000000, pci 00000000, size 00000000, flags 00
549KERN: PCI: base reg 2: host 00000000, pci 00000000, size 00000000, flags 00
550KERN: PCI: base reg 3: host 00000000, pci 00000000, size 00000000, flags 00
551KERN: PCI: base reg 4: host 0000f000, pci 0000f000, size 00000020, flags 01
552KERN: PCI: base reg 5: host 00000000, pci 00000000, size 00000000, flags 00
553KERN: PCI: Capabilities: (not supported)
554KERN: add_memory_type_range(112, 0x0, 0x1000, 0)
555KERN: remove_memory_type_range(112, 0x0, 0x1000, 0)
556KERN: add_memory_type_range(113, 0x9d000, 0x1000, 0)
557KERN: remove_memory_type_range(113, 0x9d000, 0x1000, 0)
558KERN: add_memory_type_range(114, 0xe0000, 0x20000, 0)
559KERN: remove_memory_type_range(114, 0xe0000, 0x20000, 0)
560KERN: add_memory_type_range(115, 0xf9000, 0x1000, 0)
561KERN: ACPI: RSDP 0x00000000000F9810 000024 (v02 HPQOEM)
562KERN: remove_memory_type_range(115, 0xf9000, 0x1000, 0)
563KERN: add_memory_type_range(116, 0xdd1e4000, 0x1000, 0)
564KERN: ACPI: XSDT 0x00000000DD1E4080 000084 (v01 HPQOEM SLIC-BPC 01072009 AMI 00010013)
565KERN: remove_memory_type_range(116, 0xdd1e4000, 0x1000, 0)
566KERN: add_memory_type_range(117, 0xdd1e4000, 0x1000, 0)
567KERN: add_memory_type_range(118, 0xdd1ee000, 0x1000, 0)
568KERN: remove_memory_type_range(118, 0xdd1ee000, 0x1000, 0)
569KERN: add_memory_type_range(119, 0xdd1ee000, 0x1000, 0)
570KERN: ACPI: FACP 0x00000000DD1EE620 00010C (v05 HPQOEM SLIC-BPC 01072009 AMI 00010013)
571KERN: remove_memory_type_range(119, 0xdd1ee000, 0x1000, 0)
572KERN: add_memory_type_range(120, 0xdd1ee000, 0x1000, 0)
573KERN: remove_memory_type_range(120, 0xdd1ee000, 0x1000, 0)
574KERN: add_memory_type_range(121, 0xdd1e4000, 0x1000, 0)
575KERN: remove_memory_type_range(121, 0xdd1e4000, 0x1000, 0)
576KERN: add_memory_type_range(122, 0xdd1e4000, 0xb000, 0)
577KERN: ACPI: DSDT 0x00000000DD1E4198 00A485 (v02 HPQOEM SLIC-BPC 00000017 INTL 20051117)
578KERN: remove_memory_type_range(122, 0xdd1e4000, 0xb000, 0)
579KERN: add_memory_type_range(123, 0xddbbd000, 0x1000, 0)
580KERN: remove_memory_type_range(123, 0xddbbd000, 0x1000, 0)
581KERN: add_memory_type_range(124, 0xddbbd000, 0x1000, 0)
582KERN: ACPI: FACS 0x00000000DDBBD080 000040
583KERN: remove_memory_type_range(124, 0xddbbd000, 0x1000, 0)
584KERN: add_memory_type_range(125, 0xdd1ee000, 0x1000, 0)
585KERN: remove_memory_type_range(125, 0xdd1ee000, 0x1000, 0)
586KERN: add_memory_type_range(126, 0xdd1ee000, 0x1000, 0)
587KERN: ACPI: APIC 0x00000000DD1EE730 000072 (v03 HPQOEM SLIC-BPC 01072009 AMI 00010013)
588KERN: remove_memory_type_range(126, 0xdd1ee000, 0x1000, 0)
589KERN: add_memory_type_range(127, 0xdd1ee000, 0x1000, 0)
590KERN: remove_memory_type_range(127, 0xdd1ee000, 0x1000, 0)
591KERN: add_memory_type_range(128, 0xdd1ee000, 0x1000, 0)
592KERN: ACPI: FPDT 0x00000000DD1EE7A8 000044 (v01 HPQOEM SLIC-BPC 01072009 AMI 00010013)
593KERN: remove_memory_type_range(128, 0xdd1ee000, 0x1000, 0)
594KERN: add_memory_type_range(129, 0xdd1ee000, 0x1000, 0)
595KERN: remove_memory_type_range(129, 0xdd1ee000, 0x1000, 0)
596KERN: add_memory_type_range(130, 0xdd1ee000, 0x1000, 0)
597KERN: ACPI: MCFG 0x00000000DD1EE7F0 00003C (v01 HPQOEM SLIC-BPC 01072009 MSFT 00000097)
598KERN: remove_memory_type_range(130, 0xdd1ee000, 0x1000, 0)
599KERN: add_memory_type_range(131, 0xdd1ee000, 0x1000, 0)
600KERN: remove_memory_type_range(131, 0xdd1ee000, 0x1000, 0)
601KERN: add_memory_type_range(132, 0xdd1ee000, 0x1000, 0)
602KERN: ACPI: HPET 0x00000000DD1EE830 000038 (v01 HPQOEM SLIC-BPC 01072009 AMI. 00000005)
603KERN: remove_memory_type_range(132, 0xdd1ee000, 0x1000, 0)
604KERN: add_memory_type_range(133, 0xdd1ee000, 0x1000, 0)
605KERN: remove_memory_type_range(133, 0xdd1ee000, 0x1000, 0)
606KERN: add_memory_type_range(134, 0xdd1ee000, 0x1000, 0)
607KERN: ACPI: SSDT 0x00000000DD1EE868 00036D (v01 SataRe SataTabl 00001000 INTL 20091112)
608KERN: remove_memory_type_range(134, 0xdd1ee000, 0x1000, 0)
609KERN: add_memory_type_range(135, 0xdd1ee000, 0x1000, 0)
610KERN: remove_memory_type_range(135, 0xdd1ee000, 0x1000, 0)
611KERN: add_memory_type_range(136, 0xdd1ee000, 0x8000, 0)
612KERN: ACPI: SSDT 0x00000000DD1EEBD8 00668F (v01 COMPAQ WMI 00000001 MSFT 03000001)
613KERN: remove_memory_type_range(136, 0xdd1ee000, 0x8000, 0)
614KERN: add_memory_type_range(137, 0xdd1f5000, 0x1000, 0)
615KERN: remove_memory_type_range(137, 0xdd1f5000, 0x1000, 0)
616KERN: add_memory_type_range(138, 0xdd1f5000, 0x1000, 0)
617KERN: ACPI: SLIC 0x00000000DD1F5268 000176 (v01 HPQOEM SLIC-BPC 00000001 00000000)
618KERN: remove_memoryKERN: _type_range(138, 0xdd1f5000, 0x1000, 0)
619KERN: add_memory_type_range(139, 0xdd1f5000, 0x1000, 0)
620KERN: remove_memory_type_range(139, 0xdd1f5000, 0x1000, 0)
621KERN: add_memory_type_range(140, 0xdd1f5000, 0x1000, 0)
622KERN: ACPI: SSDT 0x00000000DD1F53E0 0009AA (v01 PmRef Cpu0Ist 00003000 INTL 20051117)
623KERN: remove_memory_type_range(140, 0xdd1f5000, 0x1000, 0)
624KERN: add_memory_type_range(141, 0xdd1f5000, 0x1000, 0)
625KERN: remove_memory_type_range(141, 0xdd1f5000, 0x1000, 0)
626KERN: add_memory_type_range(142, 0xdd1f5000, 0x2000, 0)
627KERN: ACPI: SSDT 0x00000000DD1F5D90 000A92 (v01 PmRef CpuPm 00003000 INTL 20051117)
628KERN: remove_memory_type_range(142, 0xdd1f5000, 0x2000, 0)
629KERN: add_memory_type_range(143, 0xdd1f6000, 0x1000, 0)
630KERN: remove_memory_type_range(143, 0xdd1f6000, 0x1000, 0)
631KERN: add_memory_type_range(144, 0xdd1f6000, 0x1000, 0)
632KERN: ACPI: TCPA 0x00000000DD1F6828 000032 (v02 APTIO4 NAPAASF 00000001 MSFT 01000013)
633KERN: remove_memory_type_range(144, 0xdd1f6000, 0x1000, 0)
634KERN: add_memory_type_range(145, 0xdd1f6000, 0x1000, 0)
635KERN: remove_memory_type_range(145, 0xdd1f6000, 0x1000, 0)
636KERN: add_memory_type_range(146, 0xdd1f6000, 0x1000, 0)
637KERN: ACPI: ASF! 0x00000000DD1F6860 0000A5 (v32 INTEL HCG 00000001 TFSM 000F4240)
638KERN: remove_memory_type_range(146, 0xdd1f6000, 0x1000, 0)
639KERN: remove_memory_type_range(117, 0xdd1e4000, 0x1000, 0)
640KERN: add_memory_type_range(147, 0xdd1e4000, 0xb000, 0)
641KERN: remove_memory_type_range(147, 0xdd1e4000, 0xb000, 0)
642KERN: ACPI: Forced DSDT copy: length 0x0A485 copied locally, original unmapped
643KERN: ACPI: Executed 1 blocks of module-level executable AML code
644KERN: add_memory_type_range(148, 0xdd1ee000, 0x1000, 0)
645KERN: add_memory_type_range(149, 0xdd1ee000, 0x8000, 0)
646KERN: add_memory_type_range(150, 0xdd1f5000, 0x1000, 0)
647KERN: add_memory_type_range(151, 0xdd1f5000, 0x2000, 0)
648KERN: ACPI: 5 ACPI AML tables successfully acquired and loaded
649KERN: add_memory_type_range(152, 0xddbbc000, 0x1000, 0)
650KERN: add_memory_type_range(153, 0xddbbd000, 0x1000, 0)
651KERN: remove_memory_type_range(152, 0xddbbc000, 0x1000, 0)
652KERN: add_memory_type_range(154, 0xddbbc000, 0x1000, 0)
653KERN: ACPI: Enabled 14 GPEs in block 00 to 3F
654KERN: add_memory_type_range(155, 0xdd1ee000, 0x1000, 0)
655KERN: found io-apic with address 0xfec00000, global interrupt base 0, apic-id 2
656KERN: mapping io-apic 0 at physical address 0xfec00000
657KERN: add_memory_type_range(156, 0xfec00000, 0x1000, 0)
658KERN: io-apic 0 has range 0-23, 24 entries, version 0x00170020, apic-id 2
659KERN: setting ACPI interrupt model to APIC
660KERN: IRQ routing table with 10 entries
661KERN: address 0x1fffff; pin 1; GSI 19; pci 0:31 pin 2 func mask 4; bios irq: 5; gsi 19; config 0x06
662KERN: address 0x1fffff; pin 2; GSI 18; pci 0:31 pin 3 func mask 8; bios irq: 11; gsi 18; config 0x06
663KERN: address 0x14ffff; pin 0; GSI 16; pci 0:20 pin 1 func mask 1; bios irq: 11; gsi 16; config 0x06
664KERN: address 0x1dffff; pin 0; GSI 23; pci 0:29 pin 1 func mask 1; bios irq: 11; gsi 23; config 0x06
665KERN: address 0x1affff; pin 0; GSI 16; pci 0:26 pin 1 func mask 1; bios irq: 11; gsi 16; config 0x06
666KERN: address 0x1bffff; pin 0; GSI 22; pci 0:27 pin 1 func mask 1; bios irq: 5; gsi 22; config 0x06
667KERN: address 0x1ffff; pin 0; GSI 16; pci 0:1 pin 1 func mask 1; bios irq: 11; gsi 16; config 0x06
668KERN: address 0x19ffff; pin 0; GSI 20; pci 0:25 pin 1 func mask 1; bios irq: 10; gsi 20; config 0x06
669KERN: address 0xffff; pin 0; GSI 16; pci 1:0 pin 1 func mask 1; bios irq: 11; gsi 16; config 0x06
670KERN: address 0xffff; pin 1; GSI 17; pci 1:0 pin 2 func mask 2; bios irq: 10; gsi 17; config 0x06
671KERN: found interrupt override for bus 0, source irq 0, global irq 2, flags 0x00000000
672KERN: found interrupt override for bus 0, source irq 9, global irq 9, flags 0x0000000d
673KERN: free_io_interrupt_vectors: freeing 16 vectors starting from 0
674KERN: reserve_io_interrupt_vectors: reserved 24 vectors starting from 0
675KERN: using io-apics for interrupt routing
676KERN: setting up apic for CPU 3: apic id 6, version 17170453
677KERN: setting up apic for CPU 2: apic id 4, version 17170453
678KERN: CPU 3: logical apic id: 0x8
679KERN: setting up apic for CPU 1: apic id 2, version 17170453
680KERN: CPU 2: logical apic id: 0x4
681KERN: x86_init_fpu: CPU has SSE... enabling FXSR and XMM.
682KERN: CPU 1: logical apic id: 0x2
683KERN: x86_init_fpu: CPU has SSE... enabling FXSR and XMM.
684Last message repeated 1 time
685KERN: slab memory manager: created area 0x80801000 (167)
686KERN: initialize_commpage_syscall(): sysenter/sysexit supported
687KERN: allocate_commpage_entry(3, 5) -> 0x00000110
688KERN: allocate_commpage_entry(4, 34) -> 0x00000118
689KERN: allocate_commpage_entry(5, 74) -> 0x00000140
690KERN: allocate_commpage_entry(6, 86) -> 0x00000190
691KERN: allocate_commpage_entry(7, 97) -> 0x000001e8
692KERN: publish device: node 0x8283eaa0, path acpi/namespace, module bus_managers/acpi/namespace/device_v1
693KERN: registering power button
694KERN: add_memory_type_range(231, 0xfed1f000, 0x1000, 0)
695KERN: add_memory_type_range(288, 0xfed40000, 0x1000, 0)
696KERN: add_memory_type_range(293, 0xddb97000, 0x1000, 0)
697KERN: EC: can't evaluate _GPE
698KERN: driver drivers/power/acpi_embedded_controller/driver_v1 init failed: Device not accessible
699KERN: add_memory_type_range(650, 0xfed40000, 0x1000, 0)
700KERN: add_memory_type_range(786, 0xf7f20000, 0x10000, 0)
701KERN: usb xhci -1: interface version: 0x0100
702KERN: usb xhci -1: structural parameters: 1:0x08000820 2:0x84000054 3:0x0200000a
703KERN: usb xhci -1: capability params: 0x20007181
704KERN: allocate_io_interrupt_vectors: allocated 1 vectors starting from 24
705KERN: msi_allocate_vectors: allocated 1 vectors starting from 24
706KERN: msi enabled: 0x0087
707KERN: usb xhci -1: using message signaled interrupts
708KERN: usb xhci -1: starting XHCI host controller
709KERN: usb xhci -1: successfully started the controller
710KERN: usb uhci: no devices found
711KERN: usb ohci: no devices found
712KERN: add_memory_type_range(807, 0xf7f38000, 0x1000, 0)
713KERN: usb ehci -1: the host controller is bios owned, claiming ownership
714KERN: usb ehci -1: successfully took ownership of the host controller
715KERN: sitd entry size 64, itd entry size 128
716KERN: usb ehci -1: successfully started the controller
717KERN: add_memory_type_range(812, 0xf7f37000, 0x1000, 0)
718KERN: usb ehci -1: the host controller is bios owned, claiming ownership
719KERN: usb ehci -1: successfully took ownership of the host controller
720KERN: sitd entry size 64, itd entry size 128
721KERN: usb ehci -1: successfully started the controller
722KERN: usb hub 7: port 0: new device connected
723KERN: usb hub 18: port 5: new device connected
724KERN: usb hub 24: port 1: new device connected
725KERN: usb hub 24: port 2: new device connected
726KERN: usb hub 24: port 3: new device connected
727KERN: usb hub 12: port 0: new device connected
728KERN: usb hub 48: port 4: new device connected
729KERN: usb hub 48: port 5: new device connected
730KERN: usb_disk: device reports a lun count of 4
731KERN: usb_disk: vendor_identification "Generic-"
732KERN: usb_disk: product_identification "Compact Flash "
733KERN: usb_disk: product_revision_level "1.00"
734KERN: usb_disk: vendor_identification "Generic-"
735KERN: usb_disk: product_identification "SM/xD-Picture "
736KERN: usb_disk: product_revision_level "1.00"
737KERN: usb_disk: vendor_identification "Generic-"
738KERN: usb_disk: product_identification "SD/MMC "
739KERN: usb_disk: product_revision_level "1.00"
740KERN: usb_disk: vendor_identification "Generic-"
741KERN: usb_disk: product_identification "MS/MS-Pro "
742KERN: usb_disk: product_revision_level "1.00"
743KERN: get_boot_partitions(): boot volume message:
744KERN: KMessage: buffer: 0x81a179c0 (size/capacity: 347/347), flags: 0xa
745KERN: field: "booted from image" (BOOL): false
746KERN: field: "partition offset" (LLNG): 20480 (0x5000)
747KERN: field: "packaged" (BOOL): true
748KERN: field: "boot method" (LONG): 0 (0x0)
749KERN: field: "boot drive number" (LLNG): 128 (0x80)
750KERN: field: "disk identifier" (RAWT): data at 0x81a17acc, 79 bytes
751KERN: get_boot_partitions(): boot method type: 0
752KERN: partitioning system: partitioning_systems/intel/extended/v1
753KERN: KDiskDeviceManager::_AddDiskSystem(partitioning_systems/intel/extended/v1)
754KERN: intel: ep_std_ops(0x1)
755KERN: intel: ep_std_ops(0x2)
756KERN: KDiskDeviceManager::_AddDiskSystem() done: No error
757KERN: partitioning system: partitioning_systems/intel/map/v1
758KERN: KDiskDeviceManager::_AddDiskSystem(partitioning_systems/intel/map/v1)
759KERN: intel: pm_std_ops(0x1)
760KERN: intel: pm_std_ops(0x2)
761KERN: KDiskDeviceManager::_AddDiskSystem() done: No error
762KERN: partitioning system: partitioning_systems/efi_gpt/v1
763KERN: KDiskDeviceManager::_AddDiskSystem(partitioning_systems/efi_gpt/v1)
764KERN: KDiskDeviceManager::_AddDiskSystem() done: No error
765KERN: file system: file_systems/devfs/v1
766KERN: KDiskDeviceManager::_AddDiskSystem(file_systems/devfs/v1)
767KERN: KDiskDeviceManager::_AddDiskSystem() done: No error
768KERN: file system: file_systems/packagefs/v1
769KERN: KDiskDeviceManager::_AddDiskSystem(file_systems/packagefs/v1)
770KERN: KDiskDevicKERN: eManager::_AddDiskSystem() done: No error
771KERN: file system: file_systems/rootfs/v1
772KERN: KDiskDeviceManager::_AddDiskSystem(file_systems/rootfs/v1)
773KERN: KDiskDeviceManager::_AddDiskSystem() done: No error
774KERN: file system: file_systems/bfs/v1
775KERN: KDiskDeviceManager::_AddDiskSystem(file_systems/bfs/v1)
776KERN: KDiskDeviceManager::_AddDiskSystem() done: No error
777KERN: number of disk systems: 7
778KERN: KDiskDeviceManager::_Scan(/dev/disk)
779KERN: ahci: generic AHCI controller found! vendor 0x8086, device 0x1e02
780KERN: ahci: ahci_register_device
781KERN: ahci: ahci_init_driver
782KERN: ahci: ahci_sim_init_bus
783KERN: ahci: ahci_sim_init_bus: pciDevice 0x82c0d5d0
784KERN: ahci: AHCIController::Init 0:31:2 vendor 8086, device 1e02
785KERN: ahci: PCI SATA capability found at offset 0xa8
786KERN: ahci: satacr0 = 0x0010b012, satacr1 = 0x00000048
787KERN: ahci: pcicmd old 0x0007
788KERN: ahci: pcicmd new 0x0006
789KERN: allocate_io_interrupt_vectors: allocated 1 vectors starting from 25
790KERN: msi_allocate_vectors: allocated 1 vectors starting from 25
791KERN: msi enabled: 0x0001
792KERN: ahci: using MSI vector 25
793KERN: ahci: registers at 0xf7f36000, size 0x800
794KERN: ahci: mapping physical address 0xf7f36000 with 2048 bytes for AHCI HBA regs
795KERN: add_memory_type_range(833, 0xf7f36000, 0x1000, 0)
796KERN: ahci: physical = 0xf7f36000, virtual = 0x81bfe000, offset = 0, phyadr = 0xf7f36000, mapadr = 0x81bfe000, size = 4096, area = 0x00000341
797KERN: ahci: cap: Interface Speed Support: generation 3
798KERN: ahci: cap: Number of Command Slots: 32 (raw 0x1f)
799KERN: ahci: cap: Number of Ports: 6 (raw 0x5)
800KERN: ahci: cap: Supports Port Multiplier: no
801KERN: ahci: cap: Supports External SATA: no
802KERN: ahci: cap: Enclosure Management Supported: yes
803KERN: ahci: cap: FIS-based Switching Control: no
804KERN: ahci: cap: Supports Command List Override: yes
805KERN: ahci: cap: Supports Staggered Spin-up: no
806KERN: ahci: cap: Supports Mechanical Presence Switch: no
807KERN: ahci: cap: Supports 64-bit Addressing: yes
808KERN: ahci: cap: Supports Native Command Queuing: yes
809KERN: ahci: cap: Supports SNotification Register: no
810KERN: ahci: cap: Supports Command List Override: yes
811KERN: ahci: cap: Supports AHCI mode only: no
812KERN: ahci: cap2: DevSleep Entrance from Slumber Only: no
813KERN: ahci: cap2: Supports Aggressive Device Sleep Management: no
814KERN: ahci: cap2: Supports Device Sleep: no
815KERN: ahci: cap2: Automatic Partial to Slumber Transitions: yes
816KERN: ahci: cap2: NVMHCI Present: no
817KERN: ahci: cap2: BIOS/OS Handoff: no
818KERN: ahci: ghc: AHCI Enable: yes
819KERN: ahci: Ports Implemented Mask: 0x000005 Number of Available Ports: 2
820KERN: ahci: AHCI Version 0001.03.00 Interrupt 25
821KERN: ahci: allocating 4096 bytes for AHCI port 0
822KERN: ahci: area = 834, size = 4096, virt = 0x81bff000, phy = 0xabc2000
823KERN: ahci: allocating 4096 bytes for AHCI port 2
824KERN: ahci: area = 835, size = 4096, virt = 0x81c3d000, phy = 0xabbd000
825KERN: ahci: Probe: port 0 link speed 1.5Gb/s
826KERN: ahci: Probe: port 2 link speed 1.5Gb/s
827KERN: ahci: cookie = 0x8280ab40
828KERN: ahci: ahci_path_inquiry, cookie 0x8280ab40
829Last message repeated 1 time
830KERN: ahci: ahci_scan_bus, cookie 0x8280ab40
831KERN: ahci: sg_memcpy phyAddr 0x26fa1e4, size 96
832KERN: ahci: ahci_get_restrictions, cookie 0x8280ab40
833KERN: publish device: node 0x82bd4a60, path disk/scsi/0/0/0/raw, module drivers/disk/scsi/scsi_disk/device_v1
834KERN: ahci: ahci_get_restrictions, cookie 0x8280ab40
835KERN: publish device: node 0x82bd4920, path disk/scsi/0/2/0/raw, module drivers/disk/scsi/scsi_cd/device_v1
836KERN: ata 0: controller doesn't support DMA, disabling
837KERN: ata 0: _DevicePresent: device selection failed for device 0
838KERN: ata 0: _DevicePresent: device 1, presence 0
839KERN: ata 0: deviceMask 0
840KERN: ata 0: ignoring device 0
841KERN: ata 0: ignoring device 1
842KERN: ata 0 error: target device not present
843Last message repeated 1 time
844KERN: ata 0 error: invalid target device
845KERN: Last message repeated 12 times.
846KERN: ata 1: controller doesn't support DMA, disabling
847KERN: ata 1: _DevicePresent: device selection failed for device 0
848KERN: ata 1: _DevicePresent: device 1, presence 0
849KERN: ata 1: deviceMask 0
850KERN: ata 1: ignoring device 0
851KERN: ata 1: ignoring device 1
852KERN: ata 1 error: target device not present
853Last message repeated 1 time
854KERN: ata 1 error: invalid target device
855KERN: Last message repeated 12 times.
856KERN: KDiskDeviceManager::_Scan(/dev/disk/scsi)
857KERN: KDiskDeviceManager::_Scan(/dev/disk/scsi/0)
858KERN: KDiskDeviceManager::_Scan(/dev/disk/scsi/0/0)
859KERN: KDiskDeviceManager::_Scan(/dev/disk/scsi/0/0/0)
860KERN: KDiskDeviceManager::_Scan(/dev/disk/scsi/0/0/0/raw)
861KERN: found device: /dev/disk/scsi/0/0/0/raw
862KERN: ahci: sg_memcpy phyAddr 0x26fa360, size 8
863KERN: DMAResource@0x82809a00: low/high 0/100000000, max segment count 32, align 2, boundary 65536, max transfer 130560, max segment size 33554432
864KERN: ahci: sg_memcpy phyAddr 0x26fa250, size 8
865KERN: ahci: ahci_ioctl, cookie 0x8280ab40
866KERN: KDiskDeviceManager::_Scan(/dev/disk/scsi/0/2)
867KERN: KDiskDeviceManager::_Scan(/dev/disk/scsi/0/2/0)
868KERN: KDiskDeviceManager::_Scan(/dev/disk/scsi/0/2/0/raw)
869KERN: found device: /dev/disk/scsi/0/2/0/raw
870KERN: ahci: Probe: port 2 link speed 1.5Gb/s
871KERN: ahci: sata_request::finish ATA command 0xa0 failed: status 0x51, error 0x20
872KERN: ahci: sata_request::finish ATAPI packet 25 00 00 00 00 00 00 00 00 00 00 00 00 00 00 00 (len 10)
873KERN: ahci: ahci_ioctl, cookie 0x8280ab40
874KERN: KDiskDeviceManager::_Scan(/dev/disk/usb)
875KERN: KDiskDeviceManager::_Scan(/dev/disk/usb/0)
876KERN: KDiskDeviceManager::_Scan(/dev/disk/usb/0/0)
877KERN: KDiskDeviceManager::_Scan(/dev/disk/usb/0/0/raw)
878KERN: found device: /dev/disk/usb/0/0/raw
879KERN: usb_disk: got device name "Generic- Compact Flash 1.00": No error
880KERN: KDiskDeviceManager::_Scan(/dev/disk/usb/0/1)
881KERN: KDiskDeviceManager::_Scan(/dev/disk/usb/0/1/raw)
882KERN: found device: /dev/disk/usb/0/1/raw
883KERN: usb_disk: got device name "Generic- SM/xD-Picture 1.00": No error
884KERN: KDiskDeviceManager::_Scan(/dev/disk/usb/0/2)
885KERN: KDiskDeviceManager::_Scan(/dev/disk/usb/0/2/raw)
886KERN: found device: /dev/disk/usb/0/2/raw
887KERN: usb_disk: got device name "Generic- SD/MMC 1.00": No error
888KERN: KDiskDeviceManager::_Scan(/dev/disk/usb/0/3)
889KERN: KDiskDeviceManager::_Scan(/dev/disk/usb/0/3/raw)
890KERN: found device: /dev/disk/usb/0/3/raw
891KERN: usb_disk: got device name "Generic- MS/MS-Pro 1.00": No error
892KERN: KDiskDeviceManager::_ScanPartition(/dev/disk/scsi/0/0/0/raw)
893KERN: intel: ep_std_ops(0x1)
894KERN: trying: partitioning_systems/intel/extended/v1
895KERN: returned: -1
896KERN: intel: ep_std_ops(0x2)
897KERN: intel: pm_std_ops(0x1)
898KERN: trying: partitioning_systems/intel/map/v1
899KERN: intel: pm_identify_partition(0, 0: 0, 320072933376, 512)
900KERN: returned: 0.5
901KERN: trying: partitioning_systems/efi_gpt/v1
902KERN: EFI header: EFI PART
903KERN: EFI revision: 10000
904KERN: header size: 92
905KERN: header CRC: 8a5754fb
906KERN: absolute block: 1
907KERN: alternate block: 625142447
908KERN: first usable block: 34
909KERN: last usable block: 625142414
910KERN: disk GUID: 33989eaa-1edd-5942-b895-0a697ad2cb49
911KERN: entries block: 2
912KERN: entry size: 128
913KERN: entry count: 128
914KERN: entries CRC: 338d80cd
915KERN: EFI header: EFI PART
916KERN: EFI revision: 10000
917KERN: header size: 92
918KERN: header CRC: 8a5754fb
919KERN: absolute block: 625142447
920KERN: alternate block: 1
921KERN: first usable block: 34
922KERN: last usable block: 625142414
923KERN: disk GUID: 33989eaa-1edd-5942-b895-0a697ad2cb49
924KERN: entries block: 625142415
925KERN: entry size: 128
926KERN: entry count: 128
927KERN: entries CRC: 338d80cd
928KERN: [ 0] partition type: 42465331-3ba3-10f1-802a-4861696b7521
929KERN: unique id: 12bc1b5b-d7ec-1747-bf31-d0c51e6ace37
930KERN: start block: 40
931KERN: end block: 312571943
932KERN: size: 152622.999 MB
933KERN: attributes: 0
934KERN: name: Haiku x86_gcc2h
935KERN: [ 1] partition type: 42465331-3ba3-10f1-802a-4861696b7521
936KERN: unique id: f676ea09-9d71-444a-be87-89f09ec93a0e
937KERN: start block: 312571944
938KERN: end block: 625141799
939KERN: size: 152621.999 MB
940KERN: attributes: 0
941KERN: name: Haiku x86_64
942KERN: returned: 0.75
943KERN: intel: pm_std_ops(0x2)
944KERN: trying: file_systems/devfs/v1
945KERN: returned: -1
946KERN: trying: file_systems/packagefs/v1
947KERN: returned: -1
948KERN: trying: file_systems/rootfs/v1
949KERN: returned: -1
950KERN: trying: file_systems/bfs/v1
951KERN: returned: -1
952KERN: scanning with: partitioning_systems/efi_gpt/v1
953KERN: efi_gpt_scan_partition(cookie = 0x82c76a88)
954KERN: KDiskDeviceManager::_ScanPartition(/dev/disk/scsi/0/0/0/0)
955KERN: intel: ep_std_ops(0x1)
956KERN: trying: partitioning_systems/intel/extended/v1
957KERN: returned: -1
958KERN: intel: ep_std_ops(0x2)
959KERN: intel: pm_std_ops(0x1)
960KERN: trying: partitioning_systems/intel/map/v1
961KERN: intel: pm_identify_partition(0, 6: 20480, 160036814848, 512)
962KERN: returned: -1
963KERN: intel: pm_std_ops(0x2)
964KERN: trying: partitioning_systems/efi_gpt/v1
965KERN: returned: -1
966KERN: trying: file_systems/devfs/v1
967KERN: returned: -1
968KERN: trying: file_systems/packagefs/v1
969KERN: returned: -1
970KERN: trying: file_systems/rootfs/v1
971KERN: returned: -1
972KERN: trying: file_systems/bfs/v1
973KERN: returned: 0.8
974KERN: scanning with: file_systems/bfs/v1
975KERN: KDiskDeviceManager::_ScanPartition(/dev/disk/scsi/0/0/0/1)
976KERN: intel: ep_KERN: std_ops(0x1)
977KERN: trying: partitioning_systems/intel/extended/v1
978KERN: intel: ep_identify_partition(0, 160036835328, 160035766272, 512)
979KERN: returned: -1
980KERN: intel: ep_std_ops(0x2)
981KERN: intel: pm_std_ops(0x1)
982KERN: trying: partitioning_systems/intel/map/v1
983KERN: intel: pm_identify_partition(0, 7: 160036835328, 160035766272, 512)
984KERN: returned: -1
985KERN: intel: pm_std_ops(0x2)
986KERN: trying: partitioning_systems/efi_gpt/v1
987KERN: returned: -1
988KERN: trying: file_systems/devfs/v1
989KERN: returned: -1
990KERN: trying: file_systems/packagefs/v1
991KERN: returned: -1
992KERN: trying: file_systems/rootfs/v1
993KERN: returned: -1
994KERN: trying: file_systems/bfs/v1
995KERN: returned: 0.8
996KERN: scanning with: file_systems/bfs/v1
997KERN: device 0: /dev/disk/scsi/0/0/0/raw
998KERN: media status: No error
999KERN: device flags: 2
1000KERN: offset: 0
1001KERN: size: 320072933376 (305245.335 MB)
1002KERN: content size: 320072933376
1003KERN: block size: 512
1004KERN: child count: 2
1005KERN: index: -1
1006KERN: status: 0
1007KERN: flags: 5
1008KERN: volume: -1
1009KERN: disk system: partitioning_systems/efi_gpt/v1
1010KERN: name: ST332062 0AS
1011KERN: content name: <NULL>
1012KERN: type: <NULL>
1013KERN: content type: GUID Partition Map
1014KERN: params: <NULL>
1015KERN: content params: <NULL>
1016KERN: partition 6: /dev/disk/scsi/0/0/0/0
1017KERN: offset: 20480
1018KERN: size: 160036814848 (152623 MB)
1019KERN: content size: 160036814848
1020KERN: block size: 2048
1021KERN: child count: 0
1022KERN: index: 0
1023KERN: status: 0
1024KERN: flags: 2
1025KERN: volume: -1
1026KERN: disk system: file_systems/bfs/v1
1027KERN: name: Haiku x86_gcc2h
1028KERN: content name: Haiku x86_gcc2h
1029KERN: type: Be File System
1030KERN: content type: Be File System
1031KERN: params: <NULL>
1032KERN: content params: <NULL>
1033KERN: partition 7: /dev/disk/scsi/0/0/0/1
1034KERN: offset: 160036835328
1035KERN: size: 160035766272 (152622 MB)
1036KERN: content size: 160035766272
1037KERN: block size: 2048
1038KERN: child count: 0
1039KERN: index: 1
1040KERN: status: 0
1041KERN: flags: 2
1042KERN: volume: -1
1043KERN: disk system: file_systems/bfs/v1
1044KERN: name: Haiku x86_64
1045KERN: content name: Haiku x86_64
1046KERN: type: Be File System
1047KERN: content type: Be File System
1048KERN: params: <NULL>
1049KERN: content params: <NULL>
1050KERN: device 1: /dev/disk/scsi/0/2/0/raw
1051KERN: media status: No media present
1052KERN: device flags: 5
1053KERN: device 2: /dev/disk/usb/0/0/raw
1054KERN: media status: No media present
1055KERN: device flags: 5
1056KERN: device 3: /dev/disk/usb/0/1/raw
1057KERN: media status: No media present
1058KERN: device flags: 5
1059KERN: device 4: /dev/disk/usb/0/2/raw
1060KERN: media status: No media present
1061KERN: device flags: 5
1062KERN: device 5: /dev/disk/usb/0/3/raw
1063KERN: media status: No media present
1064KERN: device flags: 5
1065KERN: Identified boot partition by partition offset.
1066KERN: ahci: sg_memcpy phyAddr 0x26fa530, size 8
1067KERN: ahci: sg_memcpy phyAddr 0x26fa4f0, size 8
1068KERN: bfs: mounted "Haiku x86_gcc2h" (root node at 524288, device = /dev/disk/scsi/0/0/0/0)
1069KERN: Mounted boot partition: /dev/disk/scsi/0/0/0/0
1070KERN: packagefs [7490982: 18] Adding packages from "/boot/system/packages"
1071KERN: packagefs [7497164: 18] Failed to open packages activation file: No such file or directory
1072KERN: packagefs [7505398: 18] Loading packages from activation file failed. Loading all packages in packages directory.
1073KERN: slab memory manager: created area 0xd2001000 (881)
1074KERN: slab memory manager: created area 0xd2801000 (882)
1075KERN: packagefs [9865692: 18] StringPool usage:
1076KERN: packagefs [9869533: 18] total unique strings: 24490, 307769 bytes, overhead: 367350 bytes
1077KERN: packagefs [9878552: 18] total strings with dups: 126613, 1364342 bytes
1078KERN: packagefs [9885491: 18] unshared strings: 1243
1079KERN: packagefs [9891040: 18] bytes saved: 689223
1080KERN: packagefs [9918615: 18] Adding packages from "/boot/home/config/packages"
1081KERN: packagefs [9925232: 18] Failed to open packages activation file: No such file or directory
1082KERN: packagefs [9933465: 18] Loading packages from activation file failed. Loading all packages in packages directory.
1083KERN: packagefs [9949419: 18] StringPool usage:
1084KERN: packagefs [9953251: 18] total unique strings: 24490, 307769 bytes, overhead: 367350 bytes
1085KERN: packagefs [9962267: 18] total strings with dups: 126624, 1364407 bytes
1086KERN: packagefs [9969203: 18] unshared strings: 1240
1087KERN: packagefs [9974753: 18] bytes saved: 689288
1088KERN: module: Search for file_cache/launch_speedup/v1 failed.
1089KERN: partitioning system: partitioning_systems/session/v1
1090KERN: KDiskDeviceManager::_AddDiskSystem(partitioning_systems/session/v1)
1091KERN: KDiskDeviceManager::_AddDiskSystem() done: No error
1092KERN: file system: file_systems/btrfs/v1
1093KERN: KDiskDeviceManager::_AddDiskSystem(file_systems/btrfs/v1)
1094KERN: KDiskDeviceManager::_AddDiskSystem() done: No error
1095KERN: file system: file_systems/cdda/v1
1096KERN: KDiskDeviceManager::_AddDiskSystem(file_systems/cdda/v1)
1097KERN: KDiskDeviceManager::_AddDiskSystem() done: No error
1098KERN: file system: file_systems/udf/v1
1099KERN: KDiskDeviceManager::_AddDiskSystem(file_systems/udf/v1)
1100KERN: KDiskDeviceManager::_AddDiskSystem() done: No error
1101KERN: file system: file_systems/nfs/v1
1102KERN: KDiskDeviceManager::_AddDiskSystem(file_systems/nfs/v1)
1103KERN: KDiskDeviceManager::_AddDiskSystem() done: No error
1104KERN: file system: file_systems/bindfs/v1
1105KERN: KDiskDeviceManager::_AddDiskSystem(file_systems/bindfs/v1)
1106KERN: KDiskDeviceManager::_AddDiskSystem() done: No error
1107KERN: file system: file_systems/iso9660/v1
1108KERN: KDiskDeviceManager::_AddDiskSystem(file_systems/iso9660/v1)
1109KERN: KDiskDeviceManager::_AddDiskSystem() done: No error
1110KERN: file system: file_systems/reiserfs/v1
1111KERN: KDiskDeviceManager::_AddDiskSystem(file_systems/reiserfs/v1)
1112KERN: KDiskDeviceManager::_AddDiskSystem() done: No error
1113KERN: file system: file_systems/fat/v1
1114KERN: KDiskDeviceManager::_AddDiskSystem(file_systems/fat/v1)
1115KERN: dos_std_ops()
1116Last message repeated 1 time
1117KERN: KDiskDeviceManager::_AddDiskSystem() done: No error
1118KERN: file system: file_systems/ntfs/v1
1119KERN: KDiskDeviceManager::_AddDiskSystem(file_systems/ntfs/v1)
1120KERN: KDiskDeviceManager::_AddDiskSystem() done: No error
1121KERN: file system: file_systems/log_overlay/v1
1122KERN: KDiskDeviceManager::_AddDiskSystem(file_systems/log_overlay/v1)
1123KERN: KDiskDeviceManager::_AddDiskSystem() done: No error
1124KERN: file system: file_systems/exfat/v1
1125KERN: KDiskDeviceManager::_AddDiskSystem(file_systems/exfat/v1)
1126KERN: KDiskDeviceManager::_AddDiskSystem() done: No error
1127KERN: file system: file_systems/write_overlay/v1
1128KERN: KDiskDeviceManager::_AddDiskSystem(file_systems/write_overlay/v1)
1129KERN: KDiskDeviceManager::_AddDiskSystem() done: No error
1130KERN: file system: file_systems/nfs4/v1
1131KERN: KDiskDeviceManager::_AddDiskSystem(file_systems/nfs4/v1)
1132KERN: KDiskDeviceManager::_AddDiskSystem() done: No error
1133KERN: file system: file_systems/attribute_overlay/v1
1134KERN: KDiskDeviceManager::_AddDiskSystem(file_systems/attribute_overlay/v1)
1135KERN: KDiskDeviceManager::_AddDiskSystem() done: No error
1136KERN: file system: file_systems/ext2/v1
1137KERN: KDiskDeviceManager::_AddDiskSystem(file_systems/ext2/v1)
1138KERN: KDiskDeviceManager::_AddDiskSystem() done: No error
1139KERN: KDiskDeviceManager::_ScanPartition(/dev/disk/scsi/0/0/0/1)
1140KERN: trying: partitioning_systems/session/v1
1141KERN: publish device: node 0x82973680, path disk/virtual/ram/control, module drivers/disk/virtual/ram_disk/control/device_v1
1142KERN: loaded driver /boot/system/add-ons/kernel/drivers/dev/null
1143KERN: usb_modeswitch: init_hardware()
1144KERN: usb_modeswitch: init_driver()
1145KERN: usb_modeswitch: trying module bus_managers/usb/v3
1146KERN: usb_modeswitch: publish_devices()
1147KERN: usb_modeswitch: uninit_driver()
1148KERN: loaded driver /boot/system/add-ons/kernel/drivers/dev/usb_modeswitch
1149KERN: con_init: trying module console/frame_buffer/v1
1150KERN: loaded driver /boot/system/add-ons/kernel/drivers/dev/console
1151KERN: loaded driver /boot/system/add-ons/kernel/drivers/dev/dprintf
1152KERN: loaded driver /boot/system/add-ons/kernel/drivers/dev/zero
1153KERN: loaded driver /boot/system/add-ons/kernel/drivers/dev/tty
1154KERN: returned: -1
1155KERN: trying: file_systems/btrfs/v1
1156KERN: [34mbtrfs:[0m invalid superblock!
1157KERN: returned: -1
1158KERN: trying: file_systems/cdda/v1
1159KERN: raw_command:
1160KERN: ahci: AHCIPort::ScsiExecuteRequest port 0 unsupported request opcode 0x43
1161KERN: returned: -1
1162KERN: trying: file_systems/udf/v1
1163KERN: read_pos(pos:327755438784512, len:2048) failed with: 0xffffffff
1164KERN: udf_recognize: Invalid sequence. status = -1
1165KERN: returned: -1
1166KERN: trying: file_systems/nfs/v1
1167KERN: KERN: returned: -1
1168KERN: trying: file_systems/bindfs/v1
1169KERN: returned: -1
1170KERN: trying: file_systems/iso9660/v1
1171KERN: identify(11, 0x82a5b6b0)
1172KERN: returned: -1
1173KERN: trying: file_systems/reiserfs/v1
1174KERN: returned: -1
1175KERN: dos_std_ops()
1176KERN: trying: file_systems/fat/v1
1177KERN: returned: -1
1178KERN: dos_std_ops()
1179KERN: trying: file_systems/ntfs/v1
1180KERN: fs_identify_partition: boot signature NTFS doesn't match
1181KERN: returned: -1
1182KERN: trying: file_systems/log_overlay/v1
1183KERN: returned: -1
1184KERN: trying: file_systems/exfat/v1
1185KERN: [34mexfat:[0m invalid superblock!
1186KERN: returned: -1
1187KERN: trying: file_systems/write_overlay/v1
1188KERN: returned: -1
1189KERN: trying: file_systems/nfs4/v1
1190KERN: returned: -1
1191KERN: trying: file_systems/attribute_overlay/v1
1192KERN: returned: -1
1193KERN: trying: file_systems/ext2/v1
1194KERN: [34mext2:[0m invalid superblock!
1195KERN: returned: -1
1196KERN: KDiskDeviceManager::_Scan(/dev/disk)
1197KERN: KDiskDeviceManager::_Scan(/dev/disk/floppy)
1198KERN: config_manager: driver module: init
1199KERN: driver_get_next_device_info(bus = 0, cookie = 0)
1200KERN: loaded driver /boot/system/add-ons/kernel/drivers/dev/disk/floppy/pc_floppy
1201KERN: KDiskDeviceManager::_Scan(/dev/disk/scsi)
1202KERN: KDiskDeviceManager::_Scan(/dev/disk/scsi/0)
1203KERN: KDiskDeviceManager::_Scan(/dev/disk/scsi/0/0)
1204KERN: KDiskDeviceManager::_Scan(/dev/disk/scsi/0/0/0)
1205KERN: KDiskDeviceManager::_Scan(/dev/disk/scsi/0/0/0/0)
1206KERN: KDiskDeviceManager::_Scan(/dev/disk/scsi/0/0/0/1)
1207KERN: KDiskDeviceManager::_Scan(/dev/disk/scsi/0/0/0/raw)
1208KERN: KDiskDeviceManager::_Scan(/dev/disk/scsi/0/2)
1209KERN: KDiskDeviceManager::_Scan(/dev/disk/scsi/0/2/0)
1210KERN: KDiskDeviceManager::_Scan(/dev/disk/scsi/0/2/0/raw)
1211KERN: KDiskDeviceManager::_Scan(/dev/disk/usb)
1212KERN: loaded driver /boot/system/add-ons/kernel/drivers/dev/disk/usb/usb_disk
1213KERN: loaded driver /boot/system/add-ons/kernel/drivers/dev/disk/usb/usb_floppy
1214KERN: KDiskDeviceManager::_Scan(/dev/disk/usb/0)
1215KERN: KDiskDeviceManager::_Scan(/dev/disk/usb/0/0)
1216KERN: KDiskDeviceManager::_Scan(/dev/disk/usb/0/0/raw)
1217KERN: KDiskDeviceManager::_Scan(/dev/disk/usb/0/1)
1218KERN: KDiskDeviceManager::_Scan(/dev/disk/usb/0/1/raw)
1219KERN: KDiskDeviceManager::_Scan(/dev/disk/usb/0/2)
1220KERN: KDiskDeviceManager::_Scan(/dev/disk/usb/0/2/raw)
1221KERN: KDiskDeviceManager::_Scan(/dev/disk/usb/0/3)
1222KERN: KDiskDeviceManager::_Scan(/dev/disk/usb/0/3/raw)
1223KERN: KDiskDeviceManager::_Scan(/dev/disk/virtual)
1224KERN: KDiskDeviceManager::_Scan(/dev/disk/virtual/ram)
1225KERN: KDiskDeviceManager::_Scan(/dev/disk/virtual/ram/control)
1226KERN: KDiskDeviceManager::_ScanPartition(/dev/disk/scsi/0/0/0/1)
1227KERN: intel: ep_std_ops(0x1)
1228KERN: trying: partitioning_systems/intel/extended/v1
1229KERN: intel: ep_identify_partition(11, 160036835328, 160035766272, 2048)
1230KERN: returned: -1
1231KERN: intel: ep_std_ops(0x2)
1232KERN: intel: pm_std_ops(0x1)
1233KERN: trying: partitioning_systems/intel/map/v1
1234KERN: intel: pm_identify_partition(11, 7: 160036835328, 160035766272, 2048)
1235KERN: returned: -1
1236KERN: intel: pm_std_ops(0x2)
1237KERN: trying: partitioning_systems/efi_gpt/v1
1238KERN: returned: -1
1239KERN: trying: file_systems/devfs/v1
1240KERN: returned: -1
1241KERN: trying: file_systems/packagefs/v1
1242KERN: returned: -1
1243KERN: trying: file_systems/rootfs/v1
1244KERN: returned: -1
1245KERN: trying: file_systems/bfs/v1
1246KERN: returned: 0.8
1247KERN: trying: partitioning_systems/session/v1
1248KERN: returned: -1
1249KERN: trying: file_systems/btrfs/v1
1250KERN: [34mbtrfs:[0m invalid superblock!
1251KERN: returned: -1
1252KERN: trying: file_systems/cdda/v1
1253KERN: raw_command:
1254KERN: ahci: AHCIPort::ScsiExecuteRequest port 0 unsupported request opcode 0x43
1255KERN: returned: -1
1256KERN: trying: file_systems/udf/v1
1257KERN: read_pos(pos:327755438784512, len:2048) failed with: 0xffffffff
1258KERN: udf_recognize: Invalid sequence. status = -1
1259KERN: returned: -1
1260KERN: trying: file_systems/nfs/v1
1261KERN: returned: -1
1262KERN: trying: file_systems/bindfs/v1
1263KERN: returned: -1
1264KERN: trying: file_systems/iso9660/v1
1265KERN: identify(11, 0x82a5bd30)
1266KERN: returned: -1
1267KERN: trying: file_systems/reiserfs/v1
1268KERN: returned: -1
1269KERN: dos_std_ops()
1270KERN: trying: file_systems/fat/v1
1271KERN: returned: -1
1272KERN: dos_std_ops()
1273KERN: trying: file_systems/ntfs/v1
1274KERN: fs_identify_partition: boot signature NTFS doesn't match
1275KERN: returned: -1
1276KERN: trying: file_systems/log_overlay/v1
1277KERN: returned: -1
1278KERN: trying: file_systems/exfat/v1
1279KERN: [34mexfat:[0m invalid superblock!
1280KERN: returned: -1
1281KERN: trying: file_systems/write_overlay/v1
1282KERN: returned: -1
1283KERN: trying: file_systems/nfs4/v1
1284KERN: returned: -1
1285KERN: trying: file_systems/attribute_overlay/v1
1286KERN: returned: -1
1287KERN: trying: file_systems/ext2/v1
1288KERN: [34mext2:[0m invalid superblock!
1289KERN: returned: -1
1290KERN: allocate_commpage_entry(8, 20) -> 0x00000250
1291KERN: using Intel P-States: min 16, max 34, boost 38
1292KERN: found cpufreq module: power/cpufreq/intel_pstates/v1
1293KERN: using Intel C-States: C0, C1, C2, C3
1294KERN: found cpuidle module: power/cpuidle/intel_cstates/v1
1295KERN: add_memory_type_range(-1, 0x100000, 0xdd0e4000, 6)
1296KERN: set MTRRs to:
1297KERN: mtrr: 0: base: 0xdd1e4000, size: 0x4000, type: 0
1298KERN: mtrr: 1: base: 0xdd1e8000, size: 0x8000, type: 0
1299KERN: mtrr: 2: base: 0xdd1f0000, size: 0x10000, type: 0
1300KERN: mtrr: 3: base: 0xdd800000, size: 0x800000, type: 0
1301KERN: mtrr: 4: base: 0xe0000000, size: 0x20000000, type: 0
1302KERN: add_memory_type_range(-1, 0xdd1f7000, 0x7ee000, 6)
1303KERN: set MTRRs to:
1304KERN: mtrr: 0: base: 0xdd1e4000, size: 0x4000, type: 0
1305KERN: mtrr: 1: base: 0xdd1f6000, size: 0x1000, type: 0
1306KERN: mtrr: 2: base: 0xdd1f4000, size: 0x2000, type: 0
1307KERN: mtrr: 3: base: 0xdd1f0000, size: 0x4000, type: 0
1308KERN: mtrr: 4: base: 0xdd1e8000, size: 0x8000, type: 0
1309KERN: mtrr: 5: base: 0xdda00000, size: 0x200000, type: 0
1310KERN: mtrr: 6: base: 0xe0000000, size: 0x20000000, type: 0
1311KERN: add_memory_type_range(-1, 0xdda82000, 0x8b000, 6)
1312KERN: set MTRRs to:
1313KERN: mtrr: 0: base: 0xdd1e4000, size: 0x4000, type: 0
1314KERN: mtrr: 1: base: 0xdd1f6000, size: 0x1000, type: 0
1315KERN: mtrr: 2: base: 0xdd1f4000, size: 0x2000, type: 0
1316KERN: mtrr: 3: base: 0xdd1f0000, size: 0x4000, type: 0
1317KERN: mtrr: 4: base: 0xdd1e8000, size: 0x8000, type: 0
1318KERN: mtrr: 5: base: 0xddb80000, size: 0x80000, type: 0
1319KERN: mtrr: 6: base: 0xe0000000, size: 0x20000000, type: 0
1320KERN: add_memory_type_range(-1, 0xddfad000, 0xe63000, 6)
1321KERN: set MTRRs to:
1322KERN: mtrr: 0: base: 0xdd1e4000, size: 0x4000, type: 0
1323KERN: mtrr: 1: base: 0xdd1f6000, size: 0x1000, type: 0
1324KERN: mtrr: 2: base: 0xdd1f4000, size: 0x2000, type: 0
1325KERN: mtrr: 3: base: 0xdd1f0000, size: 0x4000, type: 0
1326KERN: mtrr: 4: base: 0xdd1e8000, size: 0x8000, type: 0
1327KERN: mtrr: 5: base: 0xddb80000, size: 0x80000, type: 0
1328KERN: mtrr: 6: base: 0xe0000000, size: 0x20000000, type: 0
1329KERN: add_memory_type_range(-1, 0x100000000, 0x11e000000, 6)
1330KERN: set MTRRs to:
1331KERN: mtrr: 0: base: 0xdd1e4000, size: 0x4000, type: 0
1332KERN: mtrr: 1: base: 0xdd1f6000, size: 0x1000, type: 0
1333KERN: mtrr: 2: base: 0xdd1f4000, size: 0x2000, type: 0
1334KERN: mtrr: 3: base: 0xdd1f0000, size: 0x4000, type: 0
1335KERN: mtrr: 4: base: 0xdd1e8000, size: 0x8000, type: 0
1336KERN: mtrr: 5: base: 0xddb80000, size: 0x80000, type: 0
1337KERN: mtrr: 6: base: 0xe0000000, size: 0x20000000, type: 0
1338KERN: kernel debugger extension "debugger/run_on_exit/v1": loaded
1339KERN: kernel debugger extension "debugger/usb_keyboard/v1": loaded
1340KERN: kernel debugger extension "debugger/disasm/v1": loaded
1341KERN: kernel debugger extension "debugger/invalidate_on_exit/v1": loaded
1342KERN: kernel debugger extension "debugger/hangman/v1": loaded
1343KERN: add_memory_type_range(92, 0xe0000000, 0x500000, 1)
1344KERN: set MTRRs to:
1345KERN: mtrr: 0: base: 0xdd1e4000, size: 0x4000, type: 0
1346KERN: mtrr: 1: base: 0xdd1f6000, size: 0x1000, type: 0
1347KERN: mtrr: 2: base: 0xdd1f4000, size: 0x2000, type: 0
1348KERN: mtrr: 3: base: 0xdd1f0000, size: 0x4000, type: 0
1349KERN: mtrr: 4: base: 0xdd1e8000, size: 0x8000, type: 0
1350KERN: mtrr: 5: base: 0xddb80000, size: 0x80000, type: 0
1351KERN: mtrr: 6: base: 0xf0000000, size: 0x10000000, type: 0
1352KERN: mtrr: 7: base: 0xe0000000, size: 0x20000000, type: 1
1353KERN: publish device: node 0xd2527418, path random, module bus_managers/random/device_v1
1354KERN: publish device: node 0xd2527418, path urandom, module bus_managers/random/device_v1
1355KERN: publish device: node 0xd2527378, path power/button/power, module drivers/power/acpi_button/device_v1
1356KERN: publish device: node 0xd2527328, path power/acpi_battery/0, module drivers/power/acpi_battery/device_v1
1357KERN: publish device: node 0xd25272d8, path power/acpi_battery/1, module drivers/power/acpi_battery/device_v1
1358KERN: publish device: node 0xd2527288, path power/acpi_battery/2, module drivers/power/acpi_battery/device_v1
1359KERN: publish device: node 0xd2527238, path power/button/power_fixed, module drivers/power/acpi_button/device_v1
1360KERN: REG: Failed to open shadow passwd DB file "/etc/shadow": No such file or directory
1361KERN: Running post install script /boot/system/boot/post-install/add_catalog_entry_KERN: attributes.sh ...
1362KERN: slab memory manager: created area 0xd3001000 (3576)
1363KERN: package_daemon [12881868: 673] root at "/boot" (device: 3, node: 524288) registered
1364KERN: package_daemon [12890005: 673] volume at "/boot/system" registered
1365KERN: package_daemon [12895966: 673] volume at "/boot/home/config" registered
1366KERN: register_domain(5, internet6)
1367KERN: unregister_domain(0x8282b0c0, 5, internet6)
1368KERN: register_domain(9, unix)
1369KERN: unregister_domain(0x8282b0c0, 9, unix)
1370KERN: register_domain(5, internet6)
1371KERN: unregister_domain(0xd27f7e80, 5, internet6)
1372KERN: register_domain(1, internet)
1373KERN: unregister_domain(0x8282b0c0, 1, internet)
1374KERN: register_domain(5, internet6)
1375KERN: unregister_domain(0xd27f7ec0, 5, internet6)
1376KERN: register_domain(5, internet6)
1377KERN: unregister_domain(0xd27f7ec0, 5, internet6)
1378KERN: register_domain(4, link)
1379KERN: unregister_domain(0x8282b280, 4, link)
1380KERN: register_domain(5, internet6)
1381KERN: unregister_domain(0x8282b640, 5, internet6)
1382KERN: register_domain(9, unix)
1383KERN: unregister_domain(0x8282b640, 9, unix)
1384KERN: register_domain(5, internet6)
1385KERN: unregister_domain(0xd27f7e80, 5, internet6)
1386KERN: register_domain(1, internet)
1387KERN: unregister_domain(0x8282b640, 1, internet)
1388KERN: register_domain(5, internet6)
1389KERN: unregister_domain(0xd27f7f40, 5, internet6)
1390KERN: register_domain(5, internet6)
1391KERN: unregister_domain(0xd27f7f40, 5, internet6)
1392KERN: register_domain(1, internet)
1393KERN: unregister_domain(0x8282b300, 1, internet)
1394KERN: register_domain(5, internet6)
1395KERN: unregister_domain(0x8282b280, 5, internet6)
1396KERN: register_domain(9, unix)
1397KERN: unregister_domain(0x8282b280, 9, unix)
1398KERN: register_domain(5, internet6)
1399KERN: unregister_domain(0xd27f7e80, 5, internet6)
1400KERN: register_domain(1, internet)
1401KERN: unregister_domain(0x8282b280, 1, internet)
1402KERN: register_domain(5, internet6)
1403KERN: unregister_domain(0xd27f7ec0, 5, internet6)
1404KERN: register_domain(5, internet6)
1405KERN: unregister_domain(0xd27f7ec0, 5, internet6)
1406KERN: register_domain(1, internet)
1407KERN: unregister_domain(0x8282b1c0, 1, internet)
1408KERN: register_domain(5, internet6)
1409KERN: unregister_domain(0x8282b0c0, 5, internet6)
1410KERN: register_domain(9, unix)
1411KERN: unregister_domain(0x8282b0c0, 9, unix)
1412KERN: register_domain(5, internet6)
1413KERN: unregister_domain(0xd27f7e80, 5, internet6)
1414KERN: register_domain(1, internet)
1415KERN: unregister_domain(0x8282b0c0, 1, internet)
1416KERN: register_domain(5, internet6)
1417KERN: unregister_domain(0xd27f7f40, 5, internet6)
1418KERN: register_domain(5, internet6)
1419KERN: unregister_domain(0xd27f7f40, 5, internet6)
1420KERN: register_domain(5, internet6)
1421KERN: unregister_domain(0x8282b640, 5, internet6)
1422KERN: register_domain(5, internet6)
1423KERN: unregister_domain(0x8282b180, 5, internet6)
1424KERN: register_domain(9, unix)
1425KERN: unregister_domain(0x8282b180, 9, unix)
1426KERN: register_domain(5, internet6)
1427KERN: package_daemon [13144027: 696] unregister_domain(0xd27f7e80, 5, internet6)
1428KERN: Failed to open packages activation file: No such file or directory
1429KERN: package_daemon [13157353: 696] Failed to get activated packages info from activated packages file. Assuming all package files in package directory are activated.
1430KERN: package_daemon [13171712: 696] latest volume state:
1431KERN: package_daemon [13176428: 696] active package: "findutils-4.4.2-3-x86_gcc2.hpkg"
1432KERN: package_daemon [13183712: 696] active package: "cdrtools-3.02~a07-1-x86_gcc2.hpkg"
1433KERN: package_daemon [13191169: 696] active package: "tiff4-4.0.6-3-x86_gcc2.hpkg"
1434KERN: package_daemon [13198105: 696] active package: "pkgconfig-0.29-2-x86_gcc2.hpkg"
1435KERN: package_daemon [13205301: 696] active package: "m4-1.4.17-3-x86_gcc2.hpkg"
1436KERN: package_daemon [13212064: 696] register_domain(1, internet)
1437KERN: active package: "libtheora_x86-1.1.1-3-x86_gcc2.hpkg"
1438KERN: unregister_domain(0xd27f7f80, 1, internet)
1439KERN: package_daemon [13222294: 696] active package: "libiconv_x86-1.13.1-9-x86_gcc2.hpkg"
1440KERN: package_daemon [13233737: 696] active package: "jpeg-9b-2-x86_gcc2.hpkg"
1441KERN: package_daemon [13240325: 696] active package: "grep-2.24-1-x86_gcc2.hpkg"
1442KERN: package_daemon [13247091: 696] active package: "gettext_libintl-0.19.8.1-4-x86_gcc2.hpkg"
1443KERN: package_daemon [13255152: 696] active package: "flex-2.5.39-2-x86_gcc2.hpkg"
1444KERN: package_daemon [13262092: 696] active package: "coreutils-8.24-1-x86_gcc2.hpkg"
1445KERN: package_daemon [13269288: 696] register_domain(5, internet6)
1446KERN: active package: "tiff4_x86-4.0.6-1-x86_gcc2.hpkg"
1447KERN: unregister_domain(0xd27f7e40, 5, internet6)
1448KERN: package_daemon [13279259: 696] active package: "python-2.7.12-1-x86_gcc2.hpkg"
1449KERN: package_daemon [13290272: 696] active package: "ncurses6-6.0-2-x86_gcc2.hpkg"
1450KERN: package_daemon [13297299: 696] register_domain(5, internet6)
1451KERN: active package: "make-4.1-1-x86_gcc2.hpkg"
1452KERN: unregister_domain(0xd27f7e40, 5, internet6)
1453KERN: package_daemon [13306665: 696] active package: "libtool-2.4.2-1-x86_gcc2.hpkg"
1454KERN: package_daemon [13317676: 696] active package: "libmodplug-0.8.8.5-3-x86_gcc2.hpkg"
1455KERN: package_daemon [13325224: 696] active package: "jpeg_devel-9b-2-x86_gcc2.hpkg"
1456KERN: package_daemon [13332334: 696] active package: "groff-1.20.1-3-x86_gcc2.hpkg"
1457KERN: package_daemon [13339361: 696] active package: "giflib6-5.0.5-2-x86_gcc2.hpkg"
1458KERN: package_daemon [13346472: 696] active package: "fontconfig-2.12.1-2-x86_gcc2.hpkg"
1459KERN: package_daemon [13353932: 696] active package: "ctags-5.8-4-x86_gcc2.hpkg"
1460KERN: package_daemon [13360696: 696] active package: "unzip-6.0-3-x86_gcc2.hpkg"
1461KERN: register_domain(1, internet)
1462KERN: package_daemon [13367461: 696] active package: "qrencode-3.4.4-1-x86_gcc2.hpkg"
1463KERN: package_daemon [13377259: 696] active package: "netcat-1.10-2-x86_gcc2.hpkg"
1464KERN: package_daemon [13384198: 696] active package: "makefile_engine-r1~alpha4_pm_hrev51451-1-any.hpkg"
1465KERN: package_daemon [13393046: 696] unregister_domain(0x8282b280, 1, internet)
1466KERN: active package: "libtool_libltdl-2.4.2-1-x86_gcc2.hpkg"
1467KERN: package_daemon [13404670: 696] active package: "libmodplug_x86-0.8.8.5-3-x86_gcc2.hpkg"
1468KERN: package_daemon [13412559: 696] active package: "jpeg_x86-9b-2-x86_gcc2.hpkg"
1469KERN: package_daemon [13419499: 696] active package: "gutenprint-5.2.12-2-x86_gcc2.hpkg"
1470KERN: package_daemon [13426959: 696] active package: "giflib_x86-5.1.2-1-x86_gcc2.hpkg"
1471KERN: package_daemon [13434332: 696] active package: "fontconfig_devel-2.12.1-2-x86_gcc2.hpkg"
1472KERN: package_daemon [13442311: 696] active package: "curl-7.45.0-2-x86_gcc2.hpkg"
1473KERN: package_daemon [13449250: 696] active package: "vision-0.10.1-1-x86_gcc2.hpkg"
1474KERN: package_daemon [13456364: 696] register_domain(5, internet6)
1475KERN: active package: "readline-6.3.8-3-x86_gcc2.hpkg"
1476KERN: unregister_domain(0x8282b300, 5, internet6)
1477KERN: package_daemon [13466250: 696] active package: "nettle_x86-3.2-1-x86_gcc2.hpkg"
1478KERN: package_daemon [13477349: 696] active package: "man-1.6g-4-x86_gcc2.hpkg"
1479KERN: package_daemon [13484025: 696] active package: "libvorbis-1.3.5-2-x86_gcc2.hpkg"
1480KERN: register_domain(9, unix)
1481KERN: package_daemon [13491313: 696] unregister_domain(0x8282b300, 9, unix)
1482KERN: active package: "libogg-1.3.2-2-x86_gcc2.hpkg"
1483KERN: package_daemon [13504062: 696] active package: "jpeg_x86_devel-9b-2-x86_gcc2.hpkg"
1484KERN: package_daemon [13511521: 696] active package: "gzip-1.6-2-x86_gcc2.hpkg"
1485KERN: package_daemon [13518203: 696] active package: "git-2.7.0-3-x86_gcc2.hpkg"
1486KERN: package_daemon [13524966: 696] active package: "fontconfig_x86-2.12.1-2-x86_gcc2.hpkg"
1487KERN: package_daemon [13532774: 696] register_domain(5, internet6)
1488KERN: active package: "curl_devel-7.45.0-2-x86_gcc2.hpkg"
1489KERN: unregister_domain(0x8282b440, 5, internet6)
1490KERN: package_daemon [13542918: 696] active package: "autoconf-2.69-6-x86_gcc2.hpkg"
1491KERN: package_daemon [13553930: 696] active package: "webpositive_x86-r1~alpha4_pm_hrev51451-1-x86_gcc2.hpkg"
1492KERN: package_daemon [13563206: 696] active package: "scons-2.3.1-4-x86_gcc2.hpkg"
1493KERN: package_daemon [13570141: 696] active package: "noto-20170202-6-any.hpkg"
1494KERN: package_daemon [13576815: 696] active package: "mesa-7.9.2-10-x86_gcc2.hpkg"
1495KERN: package_daemon [13583751: 696] active package: "libvorbis_x86-1.3.5-2-x86_gcc2.hpkg"
1496KERN: package_daemon [13591381: 696] active package: "libogg_x86-1.3.2-2-x86_gcc2.hpkg"
1497KERN: register_domain(1, internet)
1498KERN: package_daemon [13598751: 696] unregister_domain(0x8282b300, 1, internet)
1499KERN: active package: "less-481-1-x86_gcc2.hpkg"
1500KERN: package_daemon [13611839: 696] active package: "haiku-r1~alpha4_pm_hrev51451-1-x86_gcc2.hpkg"
1501KERN: package_daemon [13620250: 696] active package: "git_arch-2.7.0-3-x86_gcc2.hpkg"
1502KERN: package_daemon [13627449: 696] active package: "fontconfig_x86_devel-2.12.1-2-x86_gcc2.hpkg"
1503KERN: package_daemon [13635774: 696] active package: "curl_x86-7.45.0-2-x86_gcc2.hpkKERN: g"
1504KERN: package_daemon [13643058: 696] active package: "automake-1.15.0-1-x86_gcc2.hpkg"
1505KERN: register_domain(5, internet6)
1506KERN: package_daemon [13650344: 696] unregister_domain(0xd27f7ec0, 5, internet6)
1507KERN: active package: "wget-1.18-2-x86_gcc2.hpkg"
1508KERN: package_daemon [13663700: 696] active package: "sed-4.2.1-6-x86_gcc2.hpkg"
1509KERN: package_daemon [13670463: 696] active package: "noto_sans_cjk_jp-1.004-2-any.hpkg"
1510KERN: package_daemon [13677922: 696] active package: "mesa_devel-7.9.2-10-x86_gcc2.hpkg"
1511KERN: package_daemon [13685380: 696] register_domain(5, internet6)
1512KERN: active package: "libvpx-1.0.0-2-x86_gcc2.hpkg"
1513KERN: unregister_domain(0xd27f7ec0, 5, internet6)
1514KERN: package_daemon [13695098: 696] active package: "libpcap-1.7.4-1-x86_gcc2.hpkg"
1515KERN: package_daemon [13706109: 696] active package: "libedit-2015_03_21_3.1-5-x86_gcc2.hpkg"
1516KERN: package_daemon [13713999: 696] active package: "haiku_devel-r1~alpha4_pm_hrev51451-1-x86_gcc2.hpkg"
1517KERN: package_daemon [13722931: 696] active package: "git_cvs-2.7.0-3-x86_gcc2.hpkg"
1518KERN: package_daemon [13730039: 696] active package: "freetype-2.7-1-x86_gcc2.hpkg"
1519KERN: package_daemon [13737060: 696] active package: "curl_x86_devel-7.45.0-2-x86_gcc2.hpkg"
1520KERN: package_daemon [13744863: 696] active package: "bash-4.3.42-4-x86_gcc2.hpkg"
1521KERN: package_daemon [13751798: 696] active package: "which-2.21-3-x86_gcc2.hpkg"
1522KERN: package_daemon [13758646: 696] active package: "sharutils-4.15.2-2-x86_gcc2.hpkg"
1523KERN: package_daemon [13766016: 696] active package: "openssh-7.4p1-2-x86_gcc2.hpkg"
1524KERN: package_daemon [13773130: 696] active package: "mesa_swrast-7.9.2-10-x86_gcc2.hpkg"
1525KERN: register_domain(1, internet)
1526KERN: package_daemon [13780674: 696] active package: "libvpx_x86-1.0.0-2-x86_gcc2.hpkg"
1527KERN: package_daemon [13790645: 696] active package: "libpcre-8.40-3-x86_gcc2.hpkg"
1528KERN: package_daemon [13797670: 696] active package: "libexecinfo_x86-1.1-1-x86_gcc2.hpkg"
1529KERN: package_daemon [13805300: 696] active package: "haiku_loader-r1~alpha4_pm_hrev51451-1-x86_gcc2.hpkg"
1530KERN: package_daemon [13814315: 696] active package: "git_daemon-2.7.0-3-x86_gcc2.hpkg"
1531KERN: package_daemon [13821687: 696] active package: "freetype_devel-2.7-1-x86_gcc2.hpkg"
1532KERN: package_daemon [13829230: 696] active package: "cvsps_x86-2.2b1-1-x86_gcc2.hpkg"
1533KERN: package_daemon [13836514: 696] active package: "binutils-2.17_2016_07_24-2-x86_gcc2.hpkg"
1534KERN: package_daemon [13844579: 696] active package: "wpa_supplicant-2.0-4-x86_gcc2.hpkg"
1535KERN: package_daemon [13852126: 696] active package: "speex-1.2~rc2-2-x86_gcc2.hpkg"
1536KERN: package_daemon [13859236: 696] active package: "openssl-1.0.2g-1-x86_gcc2.hpkg"
1537KERN: package_daemon [13866433: 696] active package: "mesa_x86-17.1.4-1-x86_gcc2.hpkg"
1538KERN: package_daemon [13873717: 696] active package: "libwebp-0.6.0-1-x86_gcc2.hpkg"
1539KERN: package_daemon [13880829: 696] active package: "libpng16-1.6.20-2-x86_gcc2.hpkg"
1540KERN: package_daemon [13888113: 696] active package: "libffi-3.0.13-2-x86_gcc2.hpkg"
1541KERN: package_daemon [13895222: 696] active package: "haiku_x86-r1~alpha4_pm_hrev51451-1-x86_gcc2.hpkg"
1542KERN: register_domain(5, internet6)
1543KERN: package_daemon [13903985: 696] 3dfx: init_hardware() - no supported devices
1544KERN: active package: "git_email-2.7.0-3-x86_gcc2.hpkg"
1545KERN: package_daemon [13917940: 696] active package: "freetype_x86-2.7-1-x86_gcc2.hpkg"
1546KERN: package_daemon [13925313: 696] active package: "diffutils-3.3-4-x86_gcc2.hpkg"
1547KERN: package_daemon [13932426: 696] active package: "binutils_x86-2.28.1_2017_08_05-1-x86_gcc2.hpkg"
1548KERN: package_daemon [13941011: 696] active package: "xz_utils_x86-5.2.2-1-x86_gcc2.hpkg"
1549KERN: package_daemon [13948550: 696] active package: "speex_x86-1.2~rc2-2-x86_gcc2.hpkg"
1550KERN: package_daemon [13956008: 696] active package: "openssl_devel-1.0.2g-1-x86_gcc2.hpkg"
1551KERN: package_daemon [13963727: 696] active package: "mesa_x86_swpipe-17.1.4-1-x86_gcc2.hpkg"
1552KERN: package_daemon [13971619: 696] devfs: "intel_810" api_version missing
1553KERN: active package: "libwebp_x86-0.6.0-1-x86_gcc2.hpkg"
1554KERN: package_daemon [13982547: 696] i810: init_hardware() - no supported devices
1555KERN: active package: "libpng16_devel-1.6.20-2-x86_gcc2.hpkg"
1556KERN: package_daemon [13994340: 696] active package: "libgcrypt_x86-1.7.2-2-x86_gcc2.hpkg"
1557KERN: package_daemon [14001973: 696] active package: "haiku_x86_devel-r1~alpha4_pm_hrev51451-1-x86_gcc2.hpkg"
1558KERN: package_daemon [14011254: 696] active package: "git_svn-2.7.0-3-x86_gcc2.hpkg"
1559KERN: package_daemon [14018365: 696] active package: "expat-2.2.0-1-x86_gcc2.hpkg"
1560KERN: package_daemon [14025304: 696] active package: "bison-3.0.4-3-x86_gcc2.hpkg"
1561KERN: package_daemon [14032238: 696] active package: "zip-3.0-3-x86_gcc2.hpkg"
1562KERN: package_daemon [14038827: 696] active package: "speex_x86_devel-1.2~rc2-2-x86_gcc2.hpkg"
1563KERN: package_daemon [14046804: 696] active package: "openssl_x86-1.0.2g-1-x86_gcc2.hpkg"
1564KERN: ati: init_hardware() - no supported devices
1565KERN: package_daemon [14054349: 696] active package: "mkdepend-1.7-3-x86_gcc2.hpkg"
1566KERN: package_daemon [14065275: 696] active package: "libxml2-2.9.3-2-x86_gcc2.hpkg"
1567KERN: package_daemon [14072386: 696] active package: "libpng16_x86-1.6.20-2-x86_gcc2.hpkg"
1568KERN: package_daemon [14080018: 696] active package: "libgpg_error_x86-1.27-2-x86_gcc2.hpkg"
1569KERN: package_daemon [14087822: 696] active package: "haikuwebkit_x86-1.6.2-1-x86_gcc2.hpkg"
1570KERN: package_daemon [14095626: 696] active package: "glu-9.0.0-4-x86_gcc2.hpkg"
1571KERN: package_daemon [14102389: 696] active package: "expat_x86-2.2.0-1-x86_gcc2.hpkg"
1572KERN: package_daemon [14109674: 696] active package: "bzip2-1.0.6-5-x86_gcc2.hpkg"
1573KERN: package_daemon [14116611: 696] active package: "zlib-1.2.11-2-x86_gcc2.hpkg"
1574KERN: package_daemon [14123548: 696] active package: "sqlite-3.15.2.0-1-x86_gcc2.hpkg"
1575KERN: package_daemon [14130835: 696] active package: "openssl_x86_devel-1.0.2g-1-x86_gcc2.hpkg"
1576KERN: package_daemon [14138895: 696] active package: "mpc_x86-1.0.3-1-x86_gcc2.hpkg"
1577KERN: package_daemon [14146005: 696] active package: "libxml2_devel-2.9.3-2-x86_gcc2.hpkg"
1578KERN: package_daemon [14153635: 696] active package: "libpng16_x86_devel-1.6.20-2-x86_gcc2.hpkg"
1579KERN: package_daemon [14161789: 696] active package: "libicns-0.8.1-3-x86_gcc2.hpkg"
1580KERN: package_daemon [14168898: 696] active package: "icu-57.1-1-x86_gcc2.hpkg"
1581KERN: package_daemon [14175575: 696] active package: "glu_devel-9.0.0-4-x86_gcc2.hpkg"
1582KERN: package_daemon [14182860: 696] active package: "freetype_x86_devel-2.7-1-x86_gcc2.hpkg"
1583KERN: package_daemon [14190750: 696] active package: "ffmpeg-0.10.16-1-x86_gcc2.hpkg"
1584KERN: package_daemon [14197947: 696] active package: "bzip2_devel-1.0.6-5-x86_gcc2.hpkg"
1585KERN: package_daemon [14205404: 696] active package: "zlib_devel-1.2.11-2-x86_gcc2.hpkg"
1586KERN: package_daemon [14212863: 696] active package: "sqlite_x86-3.8.11.1-1-x86_gcc2.hpkg"
1587KERN: package_daemon [14220496: 696] active package: "p7zip-9.20.1-6-x86_gcc2.hpkg"
1588KERN: package_daemon [14227519: 696] active package: "mpfr_x86-3.1.4-1-x86_gcc2.hpkg"
1589KERN: package_daemon [14234717: 696] active package: "libxml2_x86-2.9.3-2-x86_gcc2.hpkg"
1590KERN: package_daemon [14242175: 696] active package: "libsolv-0.3.0_haiku_2014_12_22-1-x86_gcc2.hpkg"
1591KERN: package_daemon [14250758: 696] active package: "icu_x86-57.1-1-x86_gcc2.hpkg"
1592KERN: package_daemon [14257780: 696] active package: "glu_x86-9.0.0-4-x86_gcc2.hpkg"
1593KERN: package_daemon [14264891: 696] active package: "gawk-4.1.3-1-x86_gcc2.hpkg"
1594KERN: package_daemon [14271744: 696] active package: "ffmpeg_devel-0.10.16-1-x86_gcc2.hpkg"
1595KERN: package_daemon [14279461: 696] active package: "bzip2_x86-1.0.6-5-x86_gcc2.hpkg"
1596KERN: package_daemon [14286745: 696] intel_extreme: CALLED status_t init_hardware()
1597KERN: active package: "zlib_x86-1.2.11-2-x86_gcc2.hpkg"
1598KERN: package_daemon [14298196: 696] active package: "tar-1.28-1-x86_gcc2.hpkg"
1599KERN: package_daemon [14304872: 696] active package: "patch-2.7.5-1-x86_gcc2.hpkg"
1600KERN: package_daemon [14311810: 696] active package: "nano-2.5.3-1-x86_gcc2.hpkg"
1601KERN: package_daemon [14318662: 696] active package: "libxml2_x86_devel-2.9.3-2-x86_gcc2.hpkg"
1602KERN: package_daemon [14326641: 696] active package: "libsolv_x86-0.3.0_haiku_2014_12_22-1-x86_gcc2.hpkg"
1603KERN: package_daemon [14335575: 696] active package: "jam-2.5_2012_10_12-4-x86_gcc2.hpkg"
1604KERN: package_daemon [14343120: 696] active package: "glu_x86_devel-9.0.0-4-x86_gcc2.hpkg"
1605KERN: package_daemon [14350751: 696] active package: "gcc-2.95.3_2017_07_20-1-x86_gccKERN: 2.hpkg"
1606KERN: package_daemon [14358558: 696] active package: "ffmpeg_x86-3.2.2-1-x86_gcc2.hpkg"
1607KERN: package_daemon [14365931: 696] active package: "bzip2_x86_devel-1.0.6-5-x86_gcc2.hpkg"
1608KERN: package_daemon [14373736: 696] active package: "zlib_x86_devel-1.2.11-2-x86_gcc2.hpkg"
1609KERN: package_daemon [14381541: 696] active package: "tcpdump-4.7.4-2-x86_gcc2.hpkg"
1610KERN: package_daemon [14388653: 696] active package: "pe-2.4.5-5-x86_gcc2.hpkg"
1611KERN: package_daemon [14395331: 696] active package: "nasm-2.11.08-1-x86_gcc2.hpkg"
1612KERN: package_daemon [14402357: 696] active package: "libxslt_x86-1.1.28-6-x86_gcc2.hpkg"
1613KERN: package_daemon [14409901: 696] active package: "libtasn1_x86-4.12-1-x86_gcc2.hpkg"
1614KERN: package_daemon [14417361: 696] active package: "libicns_x86-0.8.1-3-x86_gcc2.hpkg"
1615KERN: package_daemon [14424814: 696] active package: "jasper-1.900.1-4-x86_gcc2.hpkg"
1616KERN: package_daemon [14432013: 696] active package: "gmp_x86-6.1.0-1-x86_gcc2.hpkg"
1617KERN: package_daemon [14439125: 696] active package: "gcc_x86-5.4.0_2016_06_04-1-x86_gcc2.hpkg"
1618KERN: package_daemon [14447189: 696] active package: "ffmpeg_x86_devel-3.2.2-1-x86_gcc2.hpkg"
1619KERN: package_daemon [14455079: 696] active package: "ca_root_certificates-2017_01_18-1-any.hpkg"
1620KERN: package_daemon [14463316: 696] active package: "texinfo-6.1-1-x86_gcc2.hpkg"
1621KERN: package_daemon [14470253: 696] active package: "perl-5.18.2-2-x86_gcc2.hpkg"
1622KERN: package_daemon [14477189: 696] active package: "llvm_x86_libs-4.0.1-1-x86_gcc2.hpkg"
1623KERN: package_daemon [14484820: 696] active package: "libtheora-1.1.1-3-x86_gcc2.hpkg"
1624KERN: package_daemon [14492103: 696] active package: "libiconv-1.13.1-9-x86_gcc2.hpkg"
1625KERN: package_daemon [14499388: 696] active package: "jasper_x86-1.900.1-4-x86_gcc2.hpkg"
1626KERN: package_daemon [14506930: 696] active package: "gnutls_x86-3.4.10-1-x86_gcc2.hpkg"
1627KERN: package_daemon [14514389: 696] active package: "gcc_x86_syslibs-5.4.0_2016_06_04-1-x86_gcc2.hpkg"
1628KERN: package_daemon [14523174: 696] The latest volume state is also the currently active one
1629KERN: package_daemon [14531756: 696] Volume::InitialVerify((nil), (nil))
1630KERN: radeon_hd: init_hardware
1631KERN: radeon_hd: init_driver
1632KERN: radeon_hd: init_driver: GPU(0) Radeon HD 7570, revision = 0x0
1633KERN: radeon_hd: publish_devices
1634KERN: radeon_hd: find_device
1635KERN: loaded driver /boot/system/add-ons/kernel/drivers/dev/graphics/radeon_hd
1636KERN: Running post install script /boot/system/boot/post-install/fix_openssh_config_paths.sh ...
1637KERN: Radeon - init_hardware: Version: 5.1.6.0
1638KERN: Radeon - Radeon_CardDetect: no supported devices found
1639KERN: package_daemon [14609008: 696] Volume::InitialVerify(): volume at "/boot/system" is consistent
1640KERN: vesa: init_hardware()
1641KERN: package_daemon [14618287: 696] vesa: init_driver()
1642KERN: Failed to open packages activation file: No such file or directory
1643KERN: package_daemon [14629934: 696] vesa: publish_devices()
1644KERN: Failed to get activated packages info from activated packages file. Assuming all package files in package directory are activated.
1645KERN: vesa: find_device()
1646KERN: package_daemon [14646420: 696] loaded driver /boot/system/add-ons/kernel/drivers/dev/graphics/vesa
1647KERN: latest volume state:
1648KERN: package_daemon [14658986: 696] The latest volume state is also the currently active one
1649KERN: S3: init_hardware() - no supported devices
1650KERN: package_daemon [14700303: 696] Volume::InitialVerify(0x18415438, (nil))
1651KERN: package_daemon [14710046: 696] Volume::InitialVerify(): volume at "/boot/home/config" is consistent
1652KERN: radeon_hd: device_open: open(name = graphics/radeon_hd_010000)
1653KERN: radeon_hd: card(0): radeon_hd_init: called
1654KERN: radeon_hd: radeon_hd_init: card(0): Radeon Turks 1002:675D
1655KERN: add_memory_type_range(7629, 0xf7e20000, 0x20000, 0)
1656KERN: set MTRRs to:
1657KERN: mtrr: 0: base: 0xdd1e4000, size: 0x4000, type: 0
1658KERN: mtrr: 1: base: 0xdd1f6000, size: 0x1000, type: 0
1659KERN: mtrr: 2: base: 0xdd1f4000, size: 0x2000, type: 0
1660KERN: mtrr: 3: base: 0xdd1f0000, size: 0x4000, type: 0
1661KERN: mtrr: 4: base: 0xdd1e8000, size: 0x8000, type: 0
1662KERN: mtrr: 5: base: 0xddb80000, size: 0x80000, type: 0
1663KERN: mtrr: 6: base: 0xf0000000, size: 0x10000000, type: 0
1664KERN: mtrr: 7: base: 0xe0000000, size: 0x20000000, type: 1
1665KERN: radeon_hd: radeon_hd_init: shrinking frame buffer to PCI bar...
1666KERN: radeon_hd: radeon_hd_init: mapping a frame buffer of 256MB out of 1024MB video ram
1667KERN: add_memory_type_range(7631, 0xe0000000, 0x10000000, 0)
1668KERN: set MTRRs to:
1669KERN: mtrr: 0: base: 0xdd1e4000, size: 0x4000, type: 0
1670KERN: mtrr: 1: base: 0xdd1f6000, size: 0x1000, type: 0
1671KERN: mtrr: 2: base: 0xdd1f4000, size: 0x2000, type: 0
1672KERN: mtrr: 3: base: 0xdd1f0000, size: 0x4000, type: 0
1673KERN: mtrr: 4: base: 0xdd1e8000, size: 0x8000, type: 0
1674KERN: mtrr: 5: base: 0xddb80000, size: 0x80000, type: 0
1675KERN: mtrr: 6: base: 0xe0000000, size: 0x20000000, type: 0
1676KERN: add_memory_type_range(7631, 0xe0000000, 0x10000000, 1)
1677KERN: set MTRRs to:
1678KERN: mtrr: 0: base: 0xdd1e4000, size: 0x4000, type: 0
1679KERN: mtrr: 1: base: 0xdd1f6000, size: 0x1000, type: 0
1680KERN: mtrr: 2: base: 0xdd1f4000, size: 0x2000, type: 0
1681KERN: mtrr: 3: base: 0xdd1f0000, size: 0x4000, type: 0
1682KERN: mtrr: 4: base: 0xdd1e8000, size: 0x8000, type: 0
1683KERN: mtrr: 5: base: 0xddb80000, size: 0x80000, type: 0
1684KERN: mtrr: 6: base: 0xf0000000, size: 0x10000000, type: 0
1685KERN: mtrr: 7: base: 0xe0000000, size: 0x20000000, type: 1
1686KERN: radeon_hd: card(0): radeon_hd_getbios: called
1687KERN: radeon_hd: radeon_hd_getbios: ACPI ATRM AtomBIOS TODO
1688KERN: radeon_hd: radeon_hd_getbios: AtomBIOS not found using active method 0 at 0x0
1689KERN: radeon_hd: mapAtomBIOS: seeking AtomBIOS @ 0xE0000000 [size: 0x40000]
1690KERN: add_memory_type_range(7642, 0xe0000000, 0x40000, 0)
1691KERN: set MTRRs to:
1692KERN: mtrr: 0: base: 0xdd1e4000, size: 0x4000, type: 0
1693KERN: mtrr: 1: base: 0xdd1f6000, size: 0x1000, type: 0
1694KERN: mtrr: 2: base: 0xdd1f4000, size: 0x2000, type: 0
1695KERN: mtrr: 3: base: 0xdd1f0000, size: 0x4000, type: 0
1696KERN: mtrr: 4: base: 0xdd1e8000, size: 0x8000, type: 0
1697KERN: mtrr: 5: base: 0xddb80000, size: 0x80000, type: 0
1698KERN: mtrr: 6: base: 0xe0000000, size: 0x40000, type: 0
1699KERN: mtrr: 7: base: 0xf0000000, size: 0x10000000, type: 0
1700KERN: mtrr: 8: base: 0xe0000000, size: 0x20000000, type: 1
1701KERN: radeon_hd: mapAtomBIOS: BIOS signature incorrect @ 0xE0000000 (0)
1702KERN: remove_memory_type_range(7642, 0xe0000000, 0x40000, 0)
1703KERN: set MTRRs to:
1704KERN: mtrr: 0: base: 0xdd1e4000, size: 0x4000, type: 0
1705KERN: mtrr: 1: base: 0xdd1f6000, size: 0x1000, type: 0
1706KERN: mtrr: 2: base: 0xdd1f4000, size: 0x2000, type: 0
1707KERN: mtrr: 3: base: 0xdd1f0000, size: 0x4000, type: 0
1708KERN: mtrr: 4: base: 0xdd1e8000, size: 0x8000, type: 0
1709KERN: mtrr: 5: base: 0xddb80000, size: 0x80000, type: 0
1710KERN: mtrr: 6: base: 0xf0000000, size: 0x10000000, type: 0
1711KERN: mtrr: 7: base: 0xe0000000, size: 0x20000000, type: 1
1712KERN: radeon_hd: radeon_hd_getbios: AtomBIOS not found using active method 1 at 0xE0000000
1713KERN: radeon_hd: radeon_hd_getbios: PCI ROM decode enabled
1714KERN: radeon_hd: mapAtomBIOS: seeking AtomBIOS @ 0xF7E00000 [size: 0x20000]
1715KERN: add_memory_type_range(7671, 0xf7e00000, 0x20000, 0)
1716KERN: set MTRRs to:
1717KERN: mtrr: 0: base: 0xdd1e4000, size: 0x4000, type: 0
1718KERN: mtrr: 1: base: 0xdd1f6000, size: 0x1000, type: 0
1719KERN: mtrr: 2: base: 0xdd1f4000, size: 0x2000, type: 0
1720KERN: mtrr: 3: base: 0xdd1f0000, size: 0x4000, type: 0
1721KERN: mtrr: 4: base: 0xdd1e8000, size: 0x8000, type: 0
1722KERN: mtrr: 5: base: 0xddb80000, size: 0x80000, type: 0
1723KERN: mtrr: 6: base: 0xf0000000, size: 0x10000000, type: 0
1724KERN: mtrr: 7: base: 0xe0000000, size: 0x20000000, type: 1
1725KERN: Running post install script /boot/system/boot/post-install/move-bash-files.sh ...
1726KERN: Running post install script /boot/system/boot/post-install/sshd_keymaker.sh ...
1727KERN: etherpci: init_driver init_driver: etherpci not found
1728KERN: [33musb_asix:[0m00.15.223:init_driver::ver.0.10.1
1729KERN: loaded driver /boot/system/add-ons/kernel/drivers/dev/net/usb_asix
1730KERN: loaded driver /boot/system/add-ons/kernel/drivers/dev/net/pegasus
1731KERN: [ipro1000] (em) bus_alloc_resource(3, [16], 0x0, 0xffffffff, 0x1,0x2)
1732KERN: add_memory_type_range(8039, 0xf7f00000, 0x20000, 0)
1733KERN: set MTRRs to:
1734KERN: mtrr: 0: base: 0xdd1e4000, size: 0x4000, type: 0
1735KERN: mtrr: 1: base: 0xdd1f6000, size: 0x1000, type: 0
1736KERN: mtrr: 2: base: 0xdd1f4000, size: 0x2000, type: 0
1737KERN: mtrr: 3: base: 0xdd1f0000, size: 0x4000, type: 0
1738KERN: mtrr: 4: base: 0xdd1e8000, size: 0x8000, type: 0
1739KERN: mtrr: 5: base: 0xddb80000, size: 0x80000, type: 0
1740KERN: mKERN: trr: 6: base: 0xf0000000, size: 0x10000000, type: 0
1741KERN: mtrr: 7: base: 0xe0000000, size: 0x20000000, type: 1
1742KERN: allocate_io_interrupt_vectors: allocated 1 vectors starting from 26
1743KERN: msi_allocate_vectors: allocated 1 vectors starting from 26
1744KERN: [ipro1000] (em) Using an MSI interrupt
1745KERN: [ipro1000] (em) bus_alloc_resource(3, [20], 0x0, 0xffffffff, 0x1,0x2)
1746KERN: add_memory_type_range(8040, 0xf7f39000, 0x20000, 0)
1747KERN: set MTRRs to:
1748KERN: mtrr: 0: base: 0xdd1e4000, size: 0x4000, type: 0
1749KERN: mtrr: 1: base: 0xdd1f6000, size: 0x1000, type: 0
1750KERN: mtrr: 2: base: 0xdd1f4000, size: 0x2000, type: 0
1751KERN: mtrr: 3: base: 0xdd1f0000, size: 0x4000, type: 0
1752KERN: mtrr: 4: base: 0xdd1e8000, size: 0x8000, type: 0
1753KERN: mtrr: 5: base: 0xddb80000, size: 0x80000, type: 0
1754KERN: mtrr: 6: base: 0xf0000000, size: 0x10000000, type: 0
1755KERN: mtrr: 7: base: 0xe0000000, size: 0x20000000, type: 1
1756KERN: radeon_hd: mapAtomBIOS: AtomBIOS verified and locked
1757KERN: remove_memory_type_range(7671, 0xf7e00000, 0x20000, 0)
1758KERN: set MTRRs to:
1759KERN: mtrr: 0: base: 0xdd1e4000, size: 0x4000, type: 0
1760KERN: mtrr: 1: base: 0xdd1f6000, size: 0x1000, type: 0
1761KERN: mtrr: 2: base: 0xdd1f4000, size: 0x2000, type: 0
1762KERN: mtrr: 3: base: 0xdd1f0000, size: 0x4000, type: 0
1763KERN: mtrr: 4: base: 0xdd1e8000, size: 0x8000, type: 0
1764KERN: mtrr: 5: base: 0xddb80000, size: 0x80000, type: 0
1765KERN: mtrr: 6: base: 0xf0000000, size: 0x10000000, type: 0
1766KERN: mtrr: 7: base: 0xe0000000, size: 0x20000000, type: 1
1767KERN: radeon_hd: radeon_hd_getbios: AtomBIOS found using active method 2 at 0xF7E00000
1768KERN: [ipro1000] (em) bus_alloc_resource(1, [1], 0x0, 0xffffffff, 0x1,0x6)
1769KERN: radeon_hd: card(0): radeon_hd_init found VESA EDID information.
1770KERN: msi enabled: 0x0081
1771KERN: radeon_hd: card(0): radeon_hd_init completed successfully!
1772KERN: if_initname(0x828d0400, em, 25)
1773KERN: radeon_hd: card(0): GPU thermal status: 35C
1774KERN: [ipro1000] ipro1000: /dev/net/ipro1000/0
1775KERN: radeon_hd: device_ioctl: accelerant: radeon_hd.accelerant
1776KERN: ifmedia_add: Adding Entry...
1777KERN: Type: Ethernet
1778KERN: SubType: 10baseT/UTP
1779KERN: ifmedia_add: Adding Entry...
1780KERN: Type: Ethernet
1781KERN: SubType: 10baseT/UTP
1782KERN: Shared Option[0]: full-duplex
1783KERN: ifmedia_add: Adding Entry...
1784KERN: Type: Ethernet
1785KERN: SubType: 100baseTX
1786KERN: ifmedia_add: Adding Entry...
1787KERN: Type: Ethernet
1788KERN: SubType: 100baseTX
1789KERN: Shared Option[0]: full-duplex
1790KERN: ifmedia_add: Adding Entry...
1791KERN: Type: Ethernet
1792KERN: SubType: 1000baseT
1793KERN: Shared Option[0]: full-duplex
1794KERN: ifmedia_add: Adding Entry...
1795KERN: Type: Ethernet
1796KERN: SubType: 1000baseT
1797KERN: ifmedia_add: Adding Entry...
1798KERN: Type: Ethernet
1799KERN: SubType: autoselect
1800KERN: ifmedia_set: target Type: Ethernet
1801KERN: SubType: autoselect
1802KERN: ifmedia_set: setting to Type: Ethernet
1803KERN: SubType: autoselect
1804KERN: radeon_hd: radeon_init_accelerant enter
1805KERN: radeon_hd: radeon_dump_bios: Dumping AtomBIOS as ATOM_DEBUG is set...
1806KERN: radeon_hd: radeon_dump_bios: AtomBIOS dumped to /boot/system/cache/tmp/radeon_hd_bios_1002_675d_0.bin
1807KERN: radeon_hd: radeon_init_bios: AtomBIOS is already posted
1808KERN: radeon_hd: radeon_gpu_probe: table 2.2
1809KERN: radeon_hd: gpio_general_populate: general GPIO @ 0, valid: true, hwPin: 0x1
1810KERN: radeon_hd: gpio_general_populate: general GPIO @ 1, valid: true, hwPin: 0x2
1811KERN: radeon_hd: gpio_general_populate: general GPIO @ 2, valid: true, hwPin: 0x3
1812KERN: radeon_hd: gpio_general_populate: general GPIO @ 3, valid: true, hwPin: 0x4
1813KERN: radeon_hd: gpio_general_populate: general GPIO @ 4, valid: true, hwPin: 0x5
1814KERN: radeon_hd: gpio_general_populate: general GPIO @ 5, valid: true, hwPin: 0x6
1815KERN: radeon_hd: gpio_i2c_populate: i2c GPIO @ 6, valid: true, hwPin: 0x90
1816KERN: radeon_hd: gpio_i2c_populate: i2c GPIO @ 7, valid: true, hwPin: 0x91
1817KERN: radeon_hd: gpio_i2c_populate: i2c GPIO @ 8, valid: true, hwPin: 0x92
1818KERN: radeon_hd: gpio_i2c_populate: i2c GPIO @ 9, valid: true, hwPin: 0x93
1819KERN: ipro1000: init_driver(0x81de1a08) at 5
1820KERN: radeon_hd: gpio_i2c_populate: i2c GPIO @ 10, valid: true, hwPin: 0x94
1821KERN: radeon_hd: gpio_i2c_populate: i2c GPIO @ 11, valid: true, hwPin: 0x95
1822KERN: radeon_hd: gpio_i2c_populate: i2c GPIO @ 12, valid: true, hwPin: 0x96
1823KERN: radeon_hd: gpio_i2c_populate: i2c GPIO @ 13, valid: true, hwPin: 0x97
1824KERN: radeon_hd: connector_probe: found 3 potential display paths.
1825KERN: radeon_hd: pll_limit_probe: table 2.2
1826KERN: radeon_hd: pll_limit_probe: referenceFreq: 27000; pllOutMin: 600000; pllOutMax: 1200000; pllInMin: 6750;pllInMax: 27000
1827KERN: radeon_hd: pll_limit_probe: table 2.2
1828KERN: radeon_hd: pll_limit_probe: referenceFreq: 27000; pllOutMin: 600000; pllOutMax: 1200000; pllInMin: 6750;pllInMax: 27000
1829KERN: radeon_hd: pll_limit_probe: table 2.2
1830KERN: radeon_hd: pll_limit_probe: referenceFreq: 27000; pllOutMin: 600000; pllOutMax: 1200000; pllInMin: 6750;pllInMax: 27000
1831KERN: radeon_hd: Currently detected connectors=============
1832KERN: radeon_hd: Connector #0)
1833KERN: radeon_hd: + connector: DisplayPort
1834KERN: radeon_hd: + i2c gpio table id: 8
1835KERN: loaded driver /boot/system/add-ons/kernel/drivers/dev/net/ipro1000
1836KERN: radeon_hd: - gpio hw pin: 0x92
1837KERN: radeon_hd: - gpio valid: true
1838KERN: radeon_hd: - i2c valid: true
1839KERN: radeon_hd: + hpd gpio table id: 3
1840KERN: radeon_hd: - gpio hw pin: 0x4
1841KERN: radeon_hd: - gpio valid: true
1842KERN: radeon_hd: + encoder: TMDS
1843KERN: radeon_hd: - id: 33
1844KERN: radeon_hd: - type: Internal Kaleidoscope UNIPHY2
1845KERN: radeon_hd: - capabilities: 0x0
1846KERN: radeon_hd: - enumeration: 1
1847KERN: radeon_hd: - is bridge: false
1848KERN: radeon_hd: + external encoder: none
1849KERN: radeon_hd: + flags:
1850KERN: radeon_hd: * device DFP1 support
1851KERN: radeon_hd: Connector #1)
1852KERN: radeon_hd: + connector: DVI-I (Digital and Analog)
1853KERN: radeon_hd: + i2c gpio table id: 9
1854KERN: radeon_hd: - gpio hw pin: 0x93
1855KERN: radeon_hd: - gpio valid: true
1856KERN: radeon_hd: - i2c valid: true
1857KERN: radeon_hd: + hpd gpio table id: 0
1858KERN: radeon_hd: - gpio hw pin: 0x1
1859KERN: radeon_hd: - gpio valid: true
1860KERN: radeon_hd: + encoder: TMDS
1861KERN: radeon_hd: - id: 30
1862KERN: radeon_hd: - type: Internal Kaleidoscope UNIPHY
1863KERN: radeon_hd: - capabilities: 0x0
1864KERN: radeon_hd: - enumeration: 1
1865KERN: radeon_hd: - is bridge: false
1866KERN: radeon_hd: + external encoder: none
1867KERN: radeon_hd: + flags:
1868KERN: radeon_hd: * device DFP2 support
1869KERN: radeon_hd: Connector #2)
1870KERN: radeon_hd: + connector: DVI-I (Digital and Analog)
1871KERN: radeon_hd: + i2c gpio table id: 9
1872KERN: radeon_hd: - gpio hw pin: 0x93
1873KERN: radeon_hd: - gpio valid: true
1874KERN: radeon_hd: - i2c valid: true
1875KERN: radeon_hd: + hpd gpio table id: 0
1876KERN: radeon_hd: - gpio hw pin: 0x1
1877KERN: radeon_hd: - gpio valid: true
1878KERN: radeon_hd: + encoder: TV DAC
1879KERN: radeon_hd: - id: 21
1880KERN: radeon_hd: - type: Internal Kaleidoscope DAC1
1881KERN: radeon_hd: - capabilities: 0x0
1882KERN: radeon_hd: - enumeration: 1
1883KERN: radeon_hd: - is bridge: false
1884KERN: radeon_hd: + external encoder: none
1885KERN: radeon_hd: + flags:
1886KERN: radeon_hd: * device CRT1 support
1887KERN: radeon_hd: ==========================================
1888KERN: radeon_hd: encoder_init: called
1889KERN: radeon_hd: transmitter_dig_setup: connector 0, pixelClock: 0
1890KERN: radeon_hd: transmitter_dig_setup: table 1.4
1891KERN: radeon_hd: encoder_pick_dig: connector 0
1892KERN: radeon_hd: transmitter_dig_setup: connector 1, pixelClock: 0
1893KERN: radeon_hd: transmitter_dig_setup: table 1.4
1894KERN: [33musb_davicom:[0m00.16.005:init_driver::ver.0.9.5
1895KERN: radeon_hd: encoder_pick_dig: connector 1
1896KERN: loaded driver /boot/system/add-ons/kernel/drivers/dev/net/usb_davicom
1897KERN: radeon_hd: pll_asic_ss_probe: No potential spread spectrum data found!
1898KERN: radeon_hd: pll_set_external: set external pll clock to 540000
1899KERN: radeon_hd: pll_set_external: table 1.6
1900KERN: radeon_hd: dp_setup_connectors
1901KERN: radeon_hd: detect_displays: connector(0): Checking DP.
1902KERN: radeon_hd: ddc2_dp_read_edid1
1903KERN: radeon_hd: dp_aux_speak: dp_aux channel flags not zero!
1904KERN: Last message repeated 5 times.
1905KERN: loaded driver /boot/system/add-ons/kernel/drivers/dev/net/usb_ecm
1906KERN: radeon_hd: dp_aux_speak: dp_aux channel flags not zero!
1907KERN: radeon_hd: dp_aux_transaction: IO Error. 7 attempts
1908KERN: radeon_hd: dp_aux_set_i2c_byte: aux_ch transaction failed!
1909KERN: radeon_hd: dp_aux_speak: dp_aux channel flags not zero!
1910KERN: Last message repeated 6 times.
1911KERN: radeon_hd: dp_aux_transaction: IO Error. 7 attempts
1912KERN: radeon_hd: dp_aux_set_i2c_byte: aux_ch transaction failed!
1913KERN: radeon_hd: dp_aux_speak: dp_aux channel flags not zero!
1914KERN: Last message repeated 6 times.
1915KERN: radeon_hd: dp_aux_transaction: IO Error. 7 attempts
1916KERN: raKERN: deon_hd: dp_aux_set_i2c_byte: aux_ch transaction failed!
1917KERN: radeon_hd: dp_aux_speak: dp_aux channel flags not zero!
1918KERN: Last message repeated 6 times.
1919KERN: radeon_hd: dp_aux_transaction: IO Error. 7 attempts
1920KERN: radeon_hd: dp_aux_set_i2c_byte: aux_ch transaction failed!
1921KERN: radeon_hd: dp_aux_speak: dp_aux channel flags not zero!
1922KERN: Last message repeated 6 times.
1923KERN: radeon_hd: dp_aux_transaction: IO Error. 7 attempts
1924KERN: radeon_hd: dp_aux_get_i2c_byte: aux_ch transaction failed!
1925KERN: radeon_hd: dp_aux_speak: dp_aux channel flags not zero!
1926KERN: Last message repeated 6 times.
1927KERN: radeon_hd: dp_aux_transaction: IO Error. 7 attempts
1928KERN: radeon_hd: dp_aux_get_i2c_byte: aux_ch transaction failed!
1929KERN: radeon_hd: dp_aux_speak: dp_aux channel flags not zero!
1930KERN: Last message repeated 6 times.
1931KERN: radeon_hd: dp_aux_transaction: IO Error. 7 attempts
1932KERN: radeon_hd: dp_aux_get_i2c_byte: aux_ch transaction failed!
1933KERN: radeon_hd: dp_aux_speak: dp_aux channel flags not zero!
1934KERN: Last message repeated 6 times.
1935KERN: radeon_hd: dp_aux_transaction: IO Error. 7 attempts
1936KERN: radeon_hd: dp_aux_set_i2c_byte: aux_ch transaction failed!
1937KERN: radeon_hd: dp_aux_speak: dp_aux channel flags not zero!
1938KERN: Last message repeated 6 times.
1939KERN: radeon_hd: dp_aux_transaction: IO Error. 7 attempts
1940KERN: radeon_hd: dp_aux_set_i2c_byte: aux_ch transaction failed!
1941KERN: radeon_hd: dp_aux_speak: dp_aux channel flags not zero!
1942KERN: Last message repeated 6 times.
1943KERN: radeon_hd: dp_aux_transaction: IO Error. 7 attempts
1944KERN: radeon_hd: dp_aux_get_i2c_byte: aux_ch transaction failed!
1945KERN: radeon_hd: dp_aux_speak: dp_aux channel flags not zero!
1946KERN: Last message repeated 6 times.
1947KERN: radeon_hd: dp_aux_transaction: IO Error. 7 attempts
1948KERN: radeon_hd: dp_aux_get_i2c_byte: aux_ch transaction failed!
1949KERN: radeon_hd: ddc2_dp_read_edid1: error reading EDID data at index 0, result = 0x80000001
1950KERN: radeon_hd: dp_aux_speak: dp_aux channel flags not zero!
1951KERN: Last message repeated 6 times.
1952KERN: radeon_hd: dp_aux_transaction: IO Error. 7 attempts
1953KERN: radeon_hd: dp_aux_get_i2c_byte: aux_ch transaction failed!
1954KERN: radeon_hd: detect_displays: connector(0): bit-banging ddc for EDID.
1955KERN: DDC: ddc2_read: DDC information read failure
1956KERN: Last message repeated 3 times.
1957KERN: radeon_hd: detect_displays: connector(1): bit-banging ddc for EDID.
1958KERN: radeon_hd: connector_read_edid: found edid monitor on connector #1
1959KERN: radeon_hd: detect_displays: connector(1): found EDID data.
1960KERN: radeon_hd: init_registers, registers for ATI chipset Turks crt #0 loaded
1961KERN: radeon_hd: detect_displays: connector(2): bit-banging ddc for EDID.
1962KERN: sis19x:00.16.366:init_hardware::SiS19X:init_hardware()
1963KERN: radeon_hd: connector_read_edid: found edid monitor on connector #2
1964KERN: radeon_hd: detect_displays: connector(2): found EDID data.
1965KERN: radeon_hd: encoder_analog_load_detect: connector 2
1966KERN: radeon_hd: encoder_dac_load_detect: connector 2
1967KERN: radeon_hd: Currently detected monitors===============
1968KERN: radeon_hd: Display #0 attached = true
1969KERN: radeon_hd: + connector ID: 1
1970KERN: radeon_hd: + connector type: DVI-I (Digital and Analog)
1971KERN: radeon_hd: + encoder type: TMDS
1972KERN: radeon_hd: + limits: Vert Min/Max: 56/75
1973KERN: radeon_hd: + limits: Horz Min/Max: 30/83
1974KERN: radeon_hd: Display #1 attached = false
1975KERN: radeon_hd: ==========================================
1976KERN: radeon_hd: radeon_gpu_mc_setup: vramStart: 0x0, vramEnd: 0xFFFFFFF
1977KERN: radeon_hd: radeon_gpu_ring_setup called
1978KERN: radeon_hd: RingQueue: Requested 1048576 bytes for GFX RingQueue.
1979KERN: radeon_hd: RingQueue: Allocating 1048576 bytes for GFX RingQueue.
1980KERN: radeon_hd: radeon_gpu_ring_boot called
1981KERN: radeon_hd: radeon_gpu_ring_boot: TODO
1982KERN: radeon_hd: radeon_init_accelerant done
1983KERN: [net/ipro1000/0] compat_open(0x2)
1984KERN: Test: and [file_exists [/system/bin/FirstBootPrompt], or [not [file_exists [/boot/home/config/settings/Locale settings]], readonly ]] -> 1
1985KERN: radeon_hd: radeon_get_edid_info
1986KERN: radeon_hd: radeon_get_preferred_mode
1987KERN: radeon_hd: radeon_get_edid_info
1988KERN: radeon_hd: radeon_accelerant_mode_count
1989KERN: radeon_hd: radeon_get_mode_list
1990KERN: radeon_hd: encoder_output_lock: true
1991KERN: radeon_hd: display_crtc_lock
1992KERN: radeon_hd: encoder_dpms_set: display 0, power: false
1993KERN: radeon_hd: encoder_dpms_set_dig: display 0, power: false
1994KERN: radeon_hd: transmitter_dig_setup: connector 1, pixelClock: 0
1995KERN: radeon_hd: transmitter_dig_setup: table 1.4
1996KERN: radeon_hd: encoder_pick_dig: connector 1
1997KERN: radeon_hd: display_crtc_dpms: crtc 0 dpms powerdown
1998KERN: radeon_hd: display_crtc_blank
1999KERN: radeon_hd: display_crtc_memreq
2000KERN: radeon_hd: display_crtc_power
2001KERN: radeon_hd: encoder_assign_crtc
2002KERN: radeon_hd: encoder_assign_crtc: table 1.2
2003KERN: radeon_hd: encoder_pick_dig: connector 1
2004KERN: radeon_hd: encoder_crtc_scratch: display 0
2005KERN: radeon_hd: radeon_set_display_mode: pll 1 selected for connector 1
2006KERN: radeon_hd: pll_asic_ss_probe: No potential spread spectrum data found!
2007KERN: radeon_hd: pll_setup_flags: CRTC: 0, PLL: 1
2008KERN: radeon_hd: pll_adjust: table 1.3
2009KERN: radeon_hd: pll_adjust: was: 119000, now: 119000
2010KERN: radeon_hd: pll_compute_post_divider: vco = 600000
2011KERN: radeon_hd: pll_compute_post_divider: postDiv = 5
2012KERN: ifmedia_ioctl: switching em to radeon_hd: pll_compute: using minimum reference divider
2013KERN: Type: Ethernet
2014KERN: radeon_hd: pll_compute: performing fractional feedback calculations
2015KERN: SubType: autoselect
2016KERN: radeon_hd: pll_compute: Calculated pixel clock of 119185 based on:
2017KERN: radeon_hd: pll_compute: referenceFrequency: 27000; referenceDivider: 14
2018KERN: radeon_hd: pll_compute: feedbackDivider: 309; feedbackDividerFrac: 0
2019KERN: radeon_hd: pll_compute: postDivider: 5
2020KERN: radeon_hd: pll_compute: pixel clock 119000 was changed to 119185
2021KERN: radeon_hd: pll_set: table 1.6
2022KERN: radeon_hd: pll_set: set adjusted pixel clock 119185 (was 119000)
2023KERN: radeon_hd: display_crtc_ss
2024KERN: radeon_hd: display_crtc_set_dtd called to do 1680x1050
2025KERN: radeon_hd: display_crtc_fb_set: Framebuffer at: 0x0
2026KERN: radeon_hd: display_crtc_fb_set: Set SurfaceAddress High: 0x0
2027KERN: radeon_hd: display_crtc_fb_set: Set SurfaceAddress: 0x0
2028KERN: radeon_hd: display_crtc_fb_set: fb: 1680x1050 (32 bpp)
2029KERN: radeon_hd: display_crtc_fb_set: fb pitch: 1728
2030KERN: radeon_hd: display_dce45_crtc_load_lut: crtcID 0
2031KERN: radeon_hd: display_crtc_scale
2032KERN: radeon_hd: encoder_mode_set: display 0
2033KERN: radeon_hd: encoder_dig_setup
2034KERN: radeon_hd: encoder_pick_dig: connector 1
2035KERN: radeon_hd: encoder_dig_setup: table 1.4
2036KERN: radeon_hd: encoder_dig_setup
2037KERN: radeon_hd: encoder_pick_dig: connector 1
2038KERN: radeon_hd: encoder_dig_setup: table 1.4
2039KERN: radeon_hd: encoder_apply_quirks: display 0
2040KERN: radeon_hd: display_crtc_dpms: crtc 0 dpms powerup
2041KERN: radeon_hd: display_crtc_power
2042KERN: radeon_hd: display_crtc_memreq
2043KERN: radeon_hd: display_crtc_blank
2044KERN: radeon_hd: encoder_dpms_set: display 0, power: true
2045KERN: radeon_hd: encoder_dpms_set_dig: display 0, power: true
2046KERN: radeon_hd: encoder_dig_setup
2047KERN: /dev/net/ipro1000/0: media change, media 0x20 quality 1000 speed 1000000000
2048KERN: radeon_hd: encoder_pick_dig: connector 1
2049KERN: radeon_hd: encoder_dig_setup: table 1.4
2050KERN: radeon_hd: encoder_dig_setup
2051KERN: radeon_hd: encoder_pick_dig: connector 1
2052KERN: radeon_hd: encoder_dig_setup: table 1.4
2053KERN: radeon_hd: transmitter_dig_setup: connector 1, pixelClock: 119185
2054KERN: radeon_hd: transmitter_dig_setup: table 1.4
2055KERN: radeon_hd: encoder_pick_dig: connector 1
2056KERN: radeon_hd: display_crtc_lock
2057KERN: radeon_hd: encoder_output_lock: false
2058KERN: radeon_hd: Current DisplayPort Info =================
2059KERN: radeon_hd: Connector #0) DP: true
2060KERN: radeon_hd: + DP Config Data
2061KERN: radeon_hd: dp_aux_speak: dp_aux channel flags not zero!
2062KERN: Last message repeated 6 times.
2063KERN: radeon_hd: dp_aux_transaction: IO Error. 7 attempts
2064KERN: radeon_hd: dpcd_reg_read: error on DisplayPort aux read (0x80000001)
2065KERN: radeon_hd: - max lane count: 14
2066KERN: radeon_hd: dp_aux_speak: dp_aux channel flags not zero!
2067KERN: Last message repeated 6 times.
2068KERN: radeon_hd: dp_aux_transaction: IO Error. 7 attempts
2069KERN: radeon_hd: dpcd_reg_read: error on DisplayPort aux read (0x80000001)
2070KERN: radeon_hd: - max link rate: 2
2071KERN: radeon_hd: dp_aux_speak: dp_aux channel flags not zero!
2072KERN: Last message repeated 6 times.
2073KERN: radeon_hd: dp_aux_transaction: IO Error. 7 attempts
2074KERN: radeon_hd: dpcd_reg_read: error on DisplayPort aux read (0x80000001)
2075KERN: radeon_hd: - receiver port count: 0
2076KERN: radeon_hd: dp_aux_speak: dp_aux channel flags not zero!
2077KERN: Last message repeated 6 times.
2078KERN: radeon_hd: dp_aux_transaction: IO Error. 7 attempts
2079KERN: radeon_hd: dpcd_reg_read: error on DisplayPort aux read (0x80000001)
2080KERN: radeon_hd: - downstream port present: yes
2081KERN: radeon_hd: dp_aux_speak: dp_aux channel flags not zero!
2082KERN: Last message repeated 6 times.
2083KERN: radeon_hd: dp_aux_transaction: IO Error. 7 attempts
2084KERN: radeon_hd: dpcKERN: d_reg_read: error on DisplayPort aux read (0x80000001)
2085KERN: radeon_hd: - downstream port count: 9
2086KERN: radeon_hd: + Training
2087KERN: radeon_hd: - attempts: 0
2088KERN: radeon_hd: - delay: 0
2089KERN: radeon_hd: + Data
2090KERN: radeon_hd: - auxPin: 0x92
2091KERN: radeon_hd: + Video
2092KERN: radeon_hd: - laneCount: 0
2093KERN: radeon_hd: - linkRate: 0
2094KERN: radeon_hd: Connector #1) DP: false
2095KERN: radeon_hd: Connector #2) DP: false
2096KERN: radeon_hd: ==========================================
2097KERN: radeon_hd: D1CRTC_STATUS Value: 0x2
2098KERN: radeon_hd: D2CRTC_STATUS Value: 0x0
2099KERN: radeon_hd: D1CRTC_CONTROL Value: 0x0
2100KERN: radeon_hd: D2CRTC_CONTROL Value: 0x0
2101KERN: radeon_hd: D1GRPH_ENABLE Value: 0x0
2102KERN: radeon_hd: D2GRPH_ENABLE Value: 0x0
2103KERN: radeon_hd: D1SCL_ENABLE Value: 0x10F9F
2104KERN: radeon_hd: D2SCL_ENABLE Value: 0x0
2105KERN: radeon_hd: D1CRTC_BLANK_CONTROL Value: 0x0
2106KERN: radeon_hd: D2CRTC_BLANK_CONTROL Value: 0x0
2107KERN: radeon_hd: radeon_get_frame_buffer_config
2108KERN: loaded driver /boot/system/add-ons/kernel/drivers/dev/input/wacom
2109KERN: ps2_hid: init_hardware
2110KERN: ps2_hid: init_driver
2111KERN: ps2_hid: publish_devices
2112KERN: ps2_hid: uninit_driver
2113KERN: loaded driver /boot/system/add-ons/kernel/drivers/dev/input/ps2_hid
2114KERN: ps2: reset failed
2115KERN: ps2: devfs_publish_device input/mouse/ps2/0, status = 0xffffffff
2116KERN: ps2: devfs_publish_device input/keyboard/at/0, status = 0x00000000
2117KERN: usb_hid: none of the possible usages for the collection are set
2118KERN: loaded driver /boot/system/add-ons/kernel/drivers/dev/input/usb_hid
2119KERN: ps2: keyboard reset failed, status 0x80000001, data 0x00
2120KERN: ps2: keyboard probing failed
2121KERN: KeyboardDevice: error when opening /dev/input/keyboard/at/0: No error
2122KERN: ps2: devfs_unpublish_device input/keyboard/at/0, status = 0x00000000
2123KERN: usb_hid: keyboard device unhandled control 0x00002710
2124KERN: Last message repeated 3 times.
2125KERN: pci_reserve_device(1, 0, 1, hda)
2126KERN: HDA: Detected controller @ PCI:1:0:1, IRQ:17, type 1002/aa90 (1028/aa90)
2127KERN: pci_reserve_device(0, 27, 0, hda)
2128KERN: HDA: Detected controller @ PCI:0:27:0, IRQ:22, type 8086/1e20 (103c/3397)
2129KERN: loaded driver /boot/system/add-ons/kernel/drivers/dev/audio/hmulti/hda
2130KERN: emuxki: init_hardware()
2131KERN: auich: init_hardware()
2132KERN: auvia: init_hardware()
2133KERN: echo3g: init_hardware()
2134KERN: echo3g: no card found
2135KERN: sis7018:init_hardware:ver:2.0.2
2136KERN: firewire: fw_module_init
2137KERN: firewire: found 0 cards
2138KERN: firewire: fw_module_uninit
2139KERN: loaded driver /boot/system/add-ons/kernel/drivers/dev/bus/usb_raw
2140KERN: add_memory_type_range(9831, 0xf7e40000, 0x4000, 0)
2141KERN: set MTRRs to:
2142KERN: mtrr: 0: base: 0xdd1e4000, size: 0x4000, type: 0
2143KERN: mtrr: 1: base: 0xdd1f6000, size: 0x1000, type: 0
2144KERN: mtrr: 2: base: 0xdd1f4000, size: 0x2000, type: 0
2145KERN: mtrr: 3: base: 0xdd1f0000, size: 0x4000, type: 0
2146KERN: mtrr: 4: base: 0xdd1e8000, size: 0x8000, type: 0
2147KERN: mtrr: 5: base: 0xddb80000, size: 0x80000, type: 0
2148KERN: mtrr: 6: base: 0xf0000000, size: 0x10000000, type: 0
2149KERN: mtrr: 7: base: 0xe0000000, size: 0x20000000, type: 1
2150KERN: allocate_io_interrupt_vectors: allocated 1 vectors starting from 27
2151KERN: msi_allocate_vectors: allocated 1 vectors starting from 27
2152KERN: msi enabled: 0x0081
2153KERN: hda: using MSI vector 27
2154KERN: hda: DMA snooping: no
2155KERN: hda: HDA v1.0, O:1/I:0/B:0, #SDO:1, 64bit:yes
2156KERN: add_memory_type_range(9832, 0x20b27000, 0x1000, 0)
2157KERN: set MTRRs to:
2158KERN: mtrr: 0: base: 0x20b27000, size: 0x1000, type: 0
2159KERN: mtrr: 1: base: 0xdd1e4000, size: 0x4000, type: 0
2160KERN: mtrr: 2: base: 0xdd1f6000, size: 0x1000, type: 0
2161KERN: mtrr: 3: base: 0xdd1f4000, size: 0x2000, type: 0
2162KERN: mtrr: 4: base: 0xdd1f0000, size: 0x4000, type: 0
2163KERN: mtrr: 5: base: 0xdd1e8000, size: 0x8000, type: 0
2164KERN: mtrr: 6: base: 0xddb80000, size: 0x80000, type: 0
2165KERN: mtrr: 7: base: 0xf0000000, size: 0x10000000, type: 0
2166KERN: mtrr: 8: base: 0xe0000000, size: 0x20000000, type: 1
2167KERN: hda: Codec 0 Vendor: 1002 Product: aa01, Revision: 1.0.2.0 Quirks: 0700
2168KERN: hda: Audio Group: Output delay: 0 samples, Input delay: 0 samples, Beep Generator: no
2169KERN: hda: #GPIO: 0, #GPO: 0, #GPI: 0, unsol: no, wake: no
2170KERN: hda: Supported formats: 16bits
2171KERN: hda: Supported rates: 32khz 44khz 48khz
2172KERN: hda: widget start 2, count 2
2173KERN: hda: 2: Audio output
2174KERN: hda: Supported formats: 16bits
2175KERN: hda: Supported rates: 32khz 44khz 48khz
2176KERN: hda: Supported power states:
2177KERN: hda: [Digital] [Stereo]
2178KERN: hda: 3: Pin complex
2179KERN: hda: [Output]
2180KERN: hda: Jack, HDMI Digital other out, Other digital, N/A, Association:1
2181KERN: hda: Supported power states:
2182KERN: hda: [Digital] [Conn. list] [Unsol. responses] [Stereo]
2183KERN: hda: Inputs: <2>
2184KERN: hda: build output tree: use mixer
2185KERN: hda: look at pin widget 3 (1 inputs)
2186KERN: hda: try widget 2: 0xd28b20e8
2187KERN: hda: try without mixer!
2188KERN: hda: build output tree: don't use mixer
2189KERN: hda: look at pin widget 3 (1 inputs)
2190KERN: hda: try widget 2: 0xd28b20e8
2191KERN: hda: widget 2 is candidate
2192KERN: hda: output: added output widget 2
2193KERN: hda: add pin widget 3
2194KERN: hda: build input tree
2195KERN: hda: build input tree failed
2196KERN: hda: build tree!
2197KERN: hda: Audiogroup:
2198KERN: hda: 2: Audio output
2199KERN: hda: Supported power states:
2200KERN: hda: [Digital] [Stereo]
2201KERN: hda: 3: Pin complex
2202KERN: hda: [Pres Detect][Output]
2203KERN: hda: Supported power states:
2204KERN: hda: [Digital] [Conn. list] [Unsol. responses] [Stereo]
2205KERN: hda: Inputs: <2>
2206KERN: hda: Enabled unsolicited responses on widget 3
2207KERN: hda: ENABLE pin widget 3
2208KERN: hda: hda_audio_group_get_widgets failed for playback stream
2209KERN: hda: hda_audio_group_get_widgets failed for record stream
2210KERN: hda: streams playback 0x00000000, record 0x00000000
2211KERN: hda: Failed to setup new audio function group (No such device)!
2212KERN: hda: no active codec
2213KERN: remove_memory_type_range(9831, 0xf7e40000, 0x4000, 0)
2214KERN: set MTRRs to:
2215KERN: mtrr: 0: base: 0x20b27000, size: 0x1000, type: 0
2216KERN: mtrr: 1: base: 0xdd1e4000, size: 0x4000, type: 0
2217KERN: mtrr: 2: base: 0xdd1f6000, size: 0x1000, type: 0
2218KERN: mtrr: 3: base: 0xdd1f4000, size: 0x2000, type: 0
2219KERN: mtrr: 4: base: 0xdd1f0000, size: 0x4000, type: 0
2220KERN: mtrr: 5: base: 0xdd1e8000, size: 0x8000, type: 0
2221KERN: mtrr: 6: base: 0xddb80000, size: 0x80000, type: 0
2222KERN: mtrr: 7: base: 0xf0000000, size: 0x10000000, type: 0
2223KERN: mtrr: 8: base: 0xe0000000, size: 0x20000000, type: 1
2224KERN: hda: ERROR: No such device(-2147454969)
2225KERN: add_memory_type_range(9953, 0xf7f30000, 0x4000, 0)
2226KERN: set MTRRs to:
2227KERN: mtrr: 0: base: 0x20b27000, size: 0x1000, type: 0
2228KERN: mtrr: 1: base: 0xdd1e4000, size: 0x4000, type: 0
2229KERN: mtrr: 2: base: 0xdd1f6000, size: 0x1000, type: 0
2230KERN: mtrr: 3: base: 0xdd1f4000, size: 0x2000, type: 0
2231KERN: mtrr: 4: base: 0xdd1f0000, size: 0x4000, type: 0
2232KERN: mtrr: 5: base: 0xdd1e8000, size: 0x8000, type: 0
2233KERN: mtrr: 6: base: 0xddb80000, size: 0x80000, type: 0
2234KERN: mtrr: 7: base: 0xf0000000, size: 0x10000000, type: 0
2235KERN: mtrr: 8: base: 0xe0000000, size: 0x20000000, type: 1
2236KERN: allocate_io_interrupt_vectors: allocated 1 vectors starting from 28
2237KERN: msi_allocate_vectors: allocated 1 vectors starting from 28
2238KERN: msi enabled: 0x0081
2239KERN: hda: using MSI vector 28
2240KERN: hda: DMA snooping: yes
2241KERN: hda: HDA v1.0, O:4/I:4/B:0, #SDO:1, 64bit:yes
2242KERN: hda: Codec 0 Vendor: 10ec Product: 0221, Revision: 1.0.0.3 Quirks: 0700
2243KERN: hda: Audio Group: Output delay: 15 samples, Input delay: 15 samples, Beep Generator: yes
2244KERN: hda: #GPIO: 2, #GPO: 0, #GPI: 0, unsol: yes, wake: no
2245KERN: hda: Supported formats: 16bits 20bits 24bits
2246KERN: hda: Supported rates: 44khz 48khz 96khz 192khz
2247KERN: hda: widget start 2, count 34
2248KERN: hda: 2: Audio output
2249KERN: hda: Supported formats: 16bits 20bits 24bits
2250KERN: hda: Supported rates: 44khz 48khz 96khz 192khz
2251KERN: hda: Supported power states: D0
2252KERN: hda: [Format override] [Amplifier override] [Out amplifier] [Stereo]
2253KERN: hda: Out Amp: step size: 0.75 dB, # steps: 87, offset to 0 dB: 87
2254KERN: hda: 3: Audio output
2255KERN: hda: Supported formats: 16bits 20bits 24bits
2256KERN: hda: Supported rates: 44khz 48khz 96khz 192khz
2257KERN: hda: Supported power states: D0
2258KERN: hda: [Format override] [Amplifier override] [Out amplifier] [Stereo]
2259KERN: hda: Out Amp: step size: 0.75 dB, # steps: 87, offset to 0 dB: 87
2260KERN: hda: 4: Vendor defined
2261KERN: hda: Supported power states:
2262KERN: hda: 5: Vendor defined
2263KERN: hda: Supported power states:
2264KERN: hda: 6: Audio output
2265KERN: hda: Supported formats: 16bits 20bits 24bits
2266KERN: hda: Supported rates: 44khz 48khz 88khz 96khz 192khz
2267KERN: hda: Supported power states: D0
2268KERN: hda: [Digital] [Format override] [Stereo]
2269KERN: hda: 7: Vendor defined
2270KERN: hda: Supported power states:
2271KERN: hda: 8: Audio input
2272KERN: hda: Supported formats: 16bits 20bits 24bits
2273KERN: hda: Supported rates: 44khz 48khz 96khz 192khz
2274KERN: hda: Supported power states: D0
2275KERN: hda: [Conn. list] [Format override] [Amplifier override] [In amplifier] [Stereo]
2276KERN: hda: In Amp: supports mute, step size: 1.5 dB, # steps: 31, offset to 0 dB: 11
2277KERN: hda: Inputs: <35>
2278KERN: hda: 9: Audio input
2279KERN: hda: Supported formats: 16bits 20bits 24bits
2280KERN: hda: Supported rates: 44khz 48khz 96khz 192khz
2281KERN: hda: Supported power states: D0
2282KERN: hda: [Conn. list] [Format override] [Amplifier override] [In amplifier] [Stereo]
2283KERN: hda: In Amp: supports mute, step size: 1.5 dB, # steps: 31, offset to 0 dB: 11
2284KERN: hda: Inputs: <34>
2285KERN: hda: 10: Vendor defined
2286KERN: hda: Supported power states:
2287KERN: hda: 11: Audio mixer
2288KERN: hda: Supported power states: D0
2289KERN: hda: [Conn. list] [Amplifier override] [In amplifier] [Stereo]
2290KERN: hda: In Amp: supports mute, step size: 1.5 dB, # steps: 31, offset to 0 dB: 23
2291KERN: hda: Inputs: 24 25 26 27 29
2292KERN: hda: 12: Audio mixer
2293KERN: hda: Supported power states: D0
2294KERN: hda: [Conn. list] [Amplifier override] [In amplifier] [Stereo]
2295KERN: hda: In Amp: supports mute, step size: 0.25 dB, # steps: 0, offset to 0 dB: 0
2296KERN: hda: Inputs: 2 11
2297KERN: hda: 13: Audio mixer
2298KERN: hda: Supported power states: D0
2299KERN: hda: [Conn. list] [Amplifier override] [In amplifier] [Stereo]
2300KERN: hda: In Amp: supports mute, step size: 0.25 dB, # steps: 0, offset to 0 dB: 0
2301KERN: hda: Inputs: 3 11
2302KERN: hda: 14: Vendor defined
2303KERN: hda: Supported power states:
2304KERN: hda: 15: Audio mixer
2305KERN: hda: Supported power states: D0
2306KERN: hda: [Conn. list] [Amplifier override] [In amplifier]
2307KERN: hda: In Amp: supports mute, step size: 0.25 dB, # steps: 0, offset to 0 dB: 0
2308KERN: hda: Inputs: 2 11
2309KERN: hda: 16: Vendor defined
2310KERN: hda: Supported power states:
2311KERN: hda: 17: Vendor defined
2312KERN: hda: Supported power states:
2313KERN: hda: 18: Pin complex
2314KERN: hda: [Input]
2315KERN: hda: None, Speaker, 1/8", Black, Association:15
2316KERN: hda: Supported power states: D0
2317KERN: hda: [Amplifier override] [In amplifier] [Stereo]
2318KERN: hda: In Amp: step size: 12 dB, # steps: 3, offset to 0 dB: 0
2319KERN: hda: 19: Vendor defined
2320KERN: hda: Supported power states:
2321KERN: hda: 20: Pin complex
2322KERN: hda: [Output]
2323KERN: hda: Jack, Line out, 1/8", Green, Association:2
2324KERN: hda: Supported power states: D0
2325KERN: hda: [Conn. list] [Unsol. responses] [Amplifier override] [Out amplifier] [Stereo]
2326KERN: hda: Out Amp: supports mute, step size: 0.25 dB, # steps: 0, offset to 0 dB: 0
2327KERN: hda: Inputs: 12 13
2328KERN: hda: 21: Vendor defined
2329KERN: hda: Supported power states:
2330KERN: hda: 22: Vendor defined
2331KERN: hda: Supported power states:
2332KERN: hda: 23: Pin complex
2333KERN: hda: [Output]
2334KERN: hda: Fixed, Speaker, Other analog, N/A, Association:1
2335KERN: hda: Supported power states: D0
2336KERN: hda: [Conn. list] [Amplifier override] [Out amplifier]
2337KERN: hda: Out Amp: supports mute, step size: 0.25 dB, # steps: 0, offset to 0 dB: 0
2338KERN: hda: Inputs: <15>
2339KERN: hda: 24: Pin complex
2340KERN: hda: [Input] [Output]
2341KERN: hda: None, Speaker, 1/8", Black, Association:15
2342KERN: hda: Supported power states: D0
2343KERN: hda: [Conn. list] [Unsol. responses] [Amplifier override] [Out amplifier] [In amplifier] [Stereo]
2344KERN: hda: In Amp: step size: 12 dB, # steps: 3, offset to 0 dB: 0
2345KERN: hda: Out Amp: supports mute, step size: 0.25 dB, # steps: 0, offset to 0 dB: 0
2346KERN: hda: Inputs: <13>
2347KERN: hda: 25: Pin complex
2348KERN: hda: [Input]
2349KERN: hda: None, Speaker, 1/8", Black, Association:15
2350KERN: hda: Supported power states: D0
2351KERN: hda: [Unsol. responses] [Amplifier override] [In amplifier] [Stereo]
2352KERN: hda: In Amp: step size: 12 dB, # steps: 3, offset to 0 dB: 0
2353KERN: hda: 26: Pin complex
2354KERN: hda: [Input] [Output]
2355KERN: hda: Jack, Front Mic in, 1/8", Black, Association:3
2356KERN: hda: Supported power states: D0
2357KERN: hda: [Conn. list] [Unsol. responses] [Amplifier override] [Out amplifier] [In amplifier] [Stereo]
2358KERN: hda: In Amp: step size: 12 dB, # steps: 3, offset to 0 dB: 0
2359KERN: hda: Out Amp: supports mute, step size: 0.25 dB, # steps: 0, offset to 0 dB: 0
2360KERN: hda: Inputs: 12 13
2361KERN: hda: 27: Pin complex
2362KERN: hda: [Input] [Output]
2363KERN: hda: Jack, Line in, 1/8", Blue, Association:3
2364KERN: hda: Supported power states: D0
2365KERN: hda: [Conn. list] [Unsol. responses] [Amplifier override] [Out amplifier] [In amplifier] [Stereo]
2366KERN: hda: In Amp: step size: 12 dB, # steps: 3, offset to 0 dB: 0
2367KERN: hda: Out Amp: supports mute, step size: 0.25 dB, # steps: 0, offset to 0 dB: 0
2368KERN: hda: Inputs: 12 13
2369KERN: hda: 28: Vendor defined
2370KERN: hda: Supported power states:
2371KERN: hda: 29: Pin complex
2372KERN: hda: [Input]
2373KERN: hda: None, Line in, ATAPI internal, N/A, Association:15
2374KERN: hda: Supported power states: D0
2375KERN: hda: 30: Pin complex
2376KERN: hda: [Output]
2377KERN: hda: None, Speaker, 1/8", Black, Association:15
2378KERN: hda: Supported power states: D0
2379KERN: hda: [Digital] [Conn. list] [Unsol. responses] [Stereo]
2380KERN: hda: Inputs: <6>
2381KERN: hda: 31: Vendor defined
2382KERN: hda: Supported power states:
2383KERN: hda: 32: Vendor defined
2384KERN: hda: Supported power states:
2385KERN: hda: [Proc widget]
2386KERN: hda: 33: Pin complex
2387KERN: hda: [Output]
2388KERN: hda: Jack, Front HP out, 1/8", Black, Association:2
2389KERN: hda: Supported power states: D0
2390KERN: hda: [Conn. list] [Unsol. responses] [Amplifier override] [Out amplifier] [Stereo]
2391KERN: hda: Out Amp: supports mute, step size: 0.25 dB, # steps: 0, offset to 0 dB: 0
2392KERN: hda: Inputs: 12 13
2393KERN: hda: 34: Audio selector
2394KERN: hda: Supported power states: D0
2395KERN: hda: [Conn. list] [Amplifier override] [In amplifier] [Stereo]
2396KERN: hda: Inputs: 24 25 26 27 29 11 18
2397KERN: hda: 35: Audio mixer
2398KERN: hda: Supported power states: D0
2399KERN: hda: [Conn. list] [Amplifier override] [In amplifier] [Stereo]
2400KERN: hda: In Amp: supports mute, step size: 0.25 dB, # steps: 0, offset to 0 dB: 0
2401KERN: hda: Inputs: 24 25 26 27 29 11
2402KERN: hda: build output tree: use mixer
2403KERN: hda: look at pin widget 20 (2 inputs)
2404KERN: hda: try widget 12: 0x82df96b8
2405KERN: hda: widget 12 is candidate
2406KERN: hda: output: added output widget 2
2407KERN: hda: output: added mixer/selector widget 12
2408KERN: hda: output: not added mixer/selector widget 11
2409KERN: hda: add pin widget 20
2410KERN: hda: look at pin widget 23 (1 inputs)
2411KERN: hda: try widget 15: 0x82df98bc
2412KERN: hda: widget 15 is candidate
2413KERN: hda: output: added output widget 2
2414KERN: hda: output: added mixer/selector widget 15
2415KERN: hda: output: not added mixer/selector widget 11
2416KERN: hda: add pin widget 23
2417KERN: hda: look at pin widget 24 (1 inputs)
2418KERN: hda: try widget 13: 0x82df9764
2419KERN: hda: widget 13 is candidate
2420KERN: hda: output: added output widget 3
2421KERN: hda: output: added mixer/selector widget 13
2422KERN: hda: output: not added mixer/selector widget 11
2423KERN: hda: add pin widget 24
2424KERN: hda: look at pin widget 30 (1 inputs)
2425KERN: hda: try widget 6: 0x82df92b0
2426KERN: hda: look at pin widget 33 (2 inputs)
2427KERN: hda: try widget 12: 0x82df96b8
2428KERN: hda: widget 12 is candidate
2429KERN: hda: add pin widget 33
2430KERN: hda: build input tree
2431KERN: hda: look at input widget 8 (1 inputs)
2432KERN: hda: try widget 35: 0x82dfa62c
2433KERN: hda: widget 35 is candidate
2434KERN: hda: input: added input widget 26
2435KERN: hda: input: added mixer/selector widget 35
2436KERN: hda: input: added input widget 27
2437KERN: hda: input: added mixer/selector widget 35
2438KERN: hda: input: added input widget 29
2439KERN: hda: input: added mixer/selector widget 35
2440KERN: hda: input: not added mixer/selector widget 11
2441KERN: hda: add pin widget 8
2442KERN: hda: look at input widget 9 (1 inputs)
2443KERN: hda: try widget 34: 0x82dfa580
2444KERN: [ipro1000] (em) Link is up 1000 Mbps Full Duplex
2445KERN: hda: widget 34 is candidate
2446KERN: hda: input: not added mixer/selector widget 11
2447KERN: hda: input: not added mixer/selector widget 34
2448KERN: /dev/net/ipro1000/0: media change, media 0x900030 quality 1000 speed 1000000000
2449KERN: hda: build tree!
2450KERN: register_domain(4, link)
2451DAEMON 'DHCP': /dev/net/ipro1000/0: Send DHCP_DISCOVER to 255.255.255.255:67
2452KERN: hda: Audiogroup:
2453KERN: hda: 2: Audio output
2454KERN: hda: Supported power states: D0
2455DAEMON 'DHCP': /dev/net/ipro1000/0: Received DHCP_OFFER from 192.168.1.254
2456DAEMON 'DHCP': your_address: 192.168.1.73
2457DAEMON 'DHCP': server: 192.168.1.254
2458DAEMON 'DHCP': lease time: 86002 seconds
2459DAEMON 'DHCP': subnet: 255.255.255.0
2460DAEMON 'DHCP': gateway: 192.168.1.254
2461DAEMON 'DHCP': nameserver[0]: 192.168.1.254
2462DAEMON 'DHCP': nameserver[1]: 75.153.171.114
2463DAEMON 'DHCP': domain name: "telus"
2464DAEMON 'DHCP': /dev/net/ipro1000/0: Send DHCP_REQUEST for 192.168.1.73 to 255.255.255.255:67
2465KERN: hda: [Format override] [Amplifier override] [Out amplifier] [Stereo]
2466DAEMON 'DHCP': /dev/net/ipro1000/0: Received DHCP_ACK from 192.168.1.254
2467DAEMON 'DHCP': server: 192.168.1.254
2468DAEMON 'DHCP': lease time: 86400 seconds
2469DAEMON 'DHCP': subnet: 255.255.255.0
2470DAEMON 'DHCP': gateway: 192.168.1.254
2471DAEMON 'DHCP': nameserver[0]: 192.168.1.254
2472DAEMON 'DHCP': nameserver[1]: 75.153.171.114
2473DAEMON 'DHCP': domain name: "telus"
2474DAEMON 'DHCP': /dev/net/ipro1000/0: DHCP status = No error
2475KERN: hda: Out Amp: step size: 0.75 dB, # steps: 87, offset to 0 dB: 87
2476KERN: hda: 3: Audio output
2477KERN: hda: Supported power states: D0
2478KERN: hda: [Format override] [Amplifier override] [Out amplifier] [Stereo]
2479KERN: hda: Out Amp: step size: 0.75 dB, # steps: 87, offset to 0 dB: 87
2480KERN: hda: 4: Vendor defined
2481KERN: hda: Supported power states:
2482KERN: hda: 5: Vendor defined
2483KERN: hda: Supported power states:
2484KERN: hda: 6: Audio output
2485KERN: hda: Supported power states: D0
2486KERN: hda: [Digital] [Format override] [Stereo]
2487KERN: hda: 7: Vendor defined
2488KERN: hda: Supported power states:
2489KERN: hda: 8: Audio input
2490KERN: hda: Supported power states: D0
2491KERN: hda: [Conn. list] [Format override] [Amplifier override] [In amplifier] [Stereo]
2492KERN: hda: In Amp: supports mute, step size: 1.5 dB, # steps: 31, offset to 0 dB: 11
2493KERN: hda: Inputs: <35>
2494KERN: hda: 9: Audio input
2495KERN: hda: Supported power states: D0
2496KERN: hda: [Conn. list] [Format override] [Amplifier override] [In amplifier] [Stereo]
2497KERN: hda: In Amp: supports mute, step size: 1.5 dB, # steps: 31, offset to 0 dB: 11
2498KERN: hda: Inputs: <34>
2499KERN: hda: 10: Vendor defined
2500KERN: hda: Supported power states:
2501KERN: hda: 11: Audio mixer
2502KERN: hda: Supported power states: D0
2503KERN: hda: [Conn. list] [Amplifier override] [In amplifier] [Stereo]
2504KERN: hda: In Amp: supports mute, step size: 1.5 dB, # steps: 31, offset to 0 dB: 23
2505KERN: hda: Inputs: <24> 25 26 27 29
2506KERN: hda: 12: Audio mixer
2507KERN: hda: Supported power states: D0
2508KERN: hda: [Conn. list] [Amplifier override] [In amplifier] [Stereo]
2509KERN: hda: In Amp: supports mute, step size: 0.25 dB, # steps: 0, offset to 0 dB: 0
2510KERN: hda: Inputs: <2> 11
2511KERN: hda: 13: Audio mixer
2512KERN: hda: Supported power states: D0
2513KERN: hda: [Conn. list] [Amplifier override] [In amplifier] [Stereo]
2514KERN: hda: In Amp: supports mute, step size: 0.25 dB, # steps: 0, offset to 0 dB: 0
2515KERN: hda: Inputs: <3> 11
2516KERN: hda: 14: Vendor defined
2517KERN: hda: Supported power states:
2518KERN: hda: 15: Audio mixer
2519KERN: hda: Supported power states: D0
2520KERN: hda: [Conn. list] [Amplifier override] [In amplifier]
2521KERN: hda: In Amp: supports mute, step size: 0.25 dB, # steps: 0, offset to 0 dB: 0
2522KERN: hda: Inputs: <2> 11
2523KERN: hda: 16: Vendor defined
2524KERN: hda: Supported power states:
2525KERN: hda: 17: Vendor defined
2526KERN: hda: Supported power states:
2527KERN: hda: 18: Pin complex
2528KERN: hda: [Input]
2529KERN: hda: Supported power states: D0
2530KERN: hda: [Amplifier override] [In amplifier] [Stereo]
2531KERN: hda: In Amp: step size: 12 dB, # steps: 3, offset to 0 dB: 0
2532KERN: hda: 19: Vendor defined
2533KERN: hda: Supported power states:
2534KERN: hda: 20: Pin complex
2535KERN: hda: [Pres Detect][Output][EAPD]
2536KERN: hda: Supported power states: D0
2537KERN: hda: [Conn. list] [Unsol. responses] [Amplifier override] [Out amplifier] [Stereo]
2538KERN: hda: Out Amp: supports mute, step size: 0.25 dB, # steps: 0, offset to 0 dB: 0
2539KERN: hda: Inputs: <12> 13
2540KERN: hda: 21: Vendor defined
2541KERN: hda: Supported power states:
2542KERN: hda: 22: Vendor defined
2543KERN: hda: Supported power states:
2544KERN: hda: 23: Pin complex
2545KERN: hda: [Output][EAPD]
2546KERN: hda: Supported power states: D0
2547KERN: hda: [Conn. list] [Amplifier override] [Out amplifier]
2548KERN: hda: Out Amp: supports mute, step size: 0.25 dB, # steps: 0, offset to 0 dB: 0
2549KERN: hda: Inputs: <15>
2550KERN: hda: 24: Pin complex
2551KERN: hda: [Pres Detect][Output][Input][VRef HIZ][VRef 50][VRef Gr][VRef 80][VRef 100]
2552KERN: hda: Supported power states: D0
2553KERN: hda: [Conn. list] [Unsol. responses] [Amplifier override] [Out amplifier] [In amplifier] [Stereo]
2554KERN: hda: In Amp: step size: 12 dB, # steps: 3, offset to 0 dB: 0
2555KERN: hda: Out Amp: supports mute, step size: 0.25 dB, # steps: 0, offset to 0 dB: 0
2556KERN: hda: Inputs: <13>
2557KERN: hda: 25: Pin complex
2558KERN: hda: [Pres Detect][Input][VRef HIZ][VRef 50][VRef Gr][VRef 80][VRef 100]
2559KERN: hda: Supported power states: D0
2560KERN: hda: [Unsol. responses] [Amplifier override] [In amplifier] [Stereo]
2561KERN: hda: In Amp: step size: 12 dB, # steps: 3, offset to 0 dB: 0
2562KERN: hda: 26: Pin complex
2563KERN: hda: [Pres Detect][HP Drive][Output][Input][VRef HIZ][VRef 50][VRef Gr][VRef 80][VRef 100]
2564KERN: hda: Supported power states: D0
2565KERN: hda: [Conn. list] [Unsol. responses] [Amplifier override] [Out amplifier] [In amplifier] [Stereo]
2566KERN: hda: In Amp: step size: 12 dB, # steps: 3, offset to 0 dB: 0
2567KERN: hda: Out Amp: supports mute, step size: 0.25 dB, # steps: 0, offset to 0 dB: 0
2568KERN: hda: Inputs: <12> 13
2569KERN: hda: 27: Pin complex
2570KERN: hda: [Pres Detect][Output][Input]
2571KERN: hda: Supported power states: D0
2572KERN: hda: [Conn. list] [Unsol. responses] [Amplifier override] [Out amplifier] [In amplifier] [Stereo]
2573KERN: hda: In Amp: step size: 12 dB, # steps: 3, offset to 0 dB: 0
2574KERN: hda: Out Amp: supports mute, step size: 0.25 dB, # steps: 0, offset to 0 dB: 0
2575KERN: hda: Inputs: <12> 13
2576KERN: hda: 28: Vendor defined
2577KERN: hda: Supported power states:
2578KERN: hda: 29: Pin complex
2579KERN: hda: [Input]
2580KERN: hda: Supported power states: D0
2581KERN: hda: 30: Pin complex
2582KERN: hda: [Output]
2583KERN: hda: Supported power states: D0
2584KERN: hda: [Digital] [Conn. list] [Unsol. responses] [Stereo]
2585KERN: hda: Inputs: <6>
2586KERN: hda: 31: Vendor defined
2587KERN: hda: Supported power states:
2588KERN: hda: 32: Vendor defined
2589KERN: hda: Supported power states:
2590KERN: hda: [Proc widget]
2591KERN: hda: 33: Pin complex
2592KERN: hda: [Pres Detect][HP Drive][Output][EAPD]
2593KERN: hda: Supported power states: D0
2594KERN: hda: [Conn. list] [Unsol. responses] [Amplifier override] [Out amplifier] [Stereo]
2595KERN: hda: Out Amp: supports mute, step size: 0.25 dB, # steps: 0, offset to 0 dB: 0
2596KERN: hda: Inputs: <12> 13
2597KERN: hda: 34: Audio selector
2598KERN: hda: Supported power states: D0
2599KERN: hda: [Conn. list] [Amplifier override] [In amplifier] [Stereo]
2600KERN: hda: Inputs: <24> 25 26 27 29 11 18
2601KERN: hda: 35: Audio mixer
2602KERN: hda: Supported power states: D0
2603KERN: hda: [Conn. list] [Amplifier override] [In amplifier] [Stereo]
2604KERN: hda: In Amp: supports mute, step size: 0.25 dB, # steps: 0, offset to 0 dB: 0
2605KERN: hda: Inputs: 24 25 <26> 27 29 11
2606KERN: hda: Enabled unsolicited responses on widget 20
2607KERN: hda: Enabled unsolicited responses on widget 26
2608KERN: hda: Enabled unsolicited responses on widget 27
2609KERN: hda: Enabled unsolicited responses on widget 33
2610KERN: hda: UNMUTE/SET OUTPUT GAIN widget 2 (offset 87)
2611KERN: hda: UNMUTE/SET OUTPUT GAIN widget 3 (offset 87)
2612KERN: hda: UNMUTE/SET INPUT GAIN widget 12 (offset 0)
2613KERN: hda: UNMUTE/SET INPUT GAIN widget 13 (offset 0)
2614KERN: hda: UNMUTE/SET INPUT GAIN widget 15 (offset 0)
2615KERN: hda: ENABLE pin widget 20
2616KERN: hda: ENABLE EAPD pin widget 20
2617KERN: hda: UNMUTE/SET OUTPUT GAIN widget 20 (offset 0)
2618KERN: hda: ENABLE pin widget 23
2619KERN: hda: ENABLE EAPD pin widget 23
2620KERN: hda: UNMUTE/SET OUTPUT GAIN widget 23 (offset 0)
2621KERN: hda: ENABLE pin widget 24
2622KERN: hda: UNMUTE/SET OUTPUT GAIN widget 24 (offset 0)
2623KERN: hda: UNMUTE/SET INPUT GAIN widget 24 (offset 0)
2624KERN: hda: ENABLE pin widget 33
2625KERN: hda: ENABLE EAPD pin widget 33
2626KERN: hda: UNMUTE/SET OUTPUT GAIN widget 33 (offset 0)
2627KERN: hda: UNMUTE/SET INPUT GAIN widget 8 (offset 11)
2628KERN: hda: input vref 50 enabled
2629KERN: hda: input vref 80 enabled
2630KERN: hda: input vref 100 enabled
2631KERN: hda: ENABLE pin widget 26
2632KERN: hda: UNMUTE/SET OUTPUT GAIN widget 26 (offset 0)
2633KERN: hda: UNMUTE/SET INPUT GAIN widget 26 (offset 0)
2634KERN: hda: ENABLE pin widget 27
2635KERN: hda: UNMUTE/SET OUTPUT GAIN widget 27 (offset 0)
2636KERN: hda: UNMUTE/SET INPUT GAIN widget 27 (offset 0)
2637KERN: hda: ENABLE pin widget 29
2638KERN: hda: UNMUTE/SET INPUT GAIN widget 35 (offset 0)
2639KERN: hda: streams playback 0xd289ccd8, record 0xd289cb98
2640KERN: hda: sensed pin widget 33, 0
2641KERN: hda: sample size 4, num channels 2, buffer length 10240
2642KERN: hda: hda_stream_setup_buffers: setup stream 1: SR=192000, SF=24 F=0x1831 (0x100)
2643KERN: hda: hda_stream_setup_buffers(Playback): Allocated 163840 bytes for 2 buffers
2644KERN: hda: hda_stream_setup_buffers(Playback): Allocated 4096 bytes for 2 BDLEs
2645KERN: hda: stream: 1 fifo size: 1536 num_io_widgets: 2
2646KERN: hda: widgets: KERN: 2 KERN: 3
2647KERN: hda: sample size 4, num channels 2, buffer length 10240
2648KERN: hda: hda_stream_setup_buffers: setup stream 2: SR=192000, SF=24 F=0x1831 (0x100)
2649KERN: hda: hda_stream_setup_buffers(Recording): Allocated 163840 bytes for 2 buffers
2650KERN: hda: hda_stream_setup_buffers(Recording): Allocated 4096 bytes for 2 BDLEs
2651KERN: hda: stream: 2 fifo size: 1536 num_io_widgets: 1
2652KERN: hda: widgets: KERN: 8
2653KERN: hda_stream_start() offset 80
2654KERN: hda_stream_start() offset 0
2655KERN: cx23882: init_hardware()
2656KERN: vm_soft_fault: va 0x0 not covered by area in address space
2657KERN: vm_page_fault: vm_soft_fault returned error 'Bad address' on fault at 0x9c, ip 0x1f89405, write 0, user 1, thread 0x3a0
2658KERN: Running first login script /boot/system/boot/first-login/default_deskbar_items.sh ...
2659KERN: vm_page_fault: thread "Deskbar" (928) in team "Deskbar" (928) tried to read address 0x9c, ip 0x1f89405 ("Deskbar_seg0ro" +0x3e405)
2660KERN: debug_server: Thread 928 entered the debugger: Segment violation
2661KERN: stack trace, current PC 0x1f89405 __static_initialization_and_destruction_0 + 0x2d:
2662KERN: (0x7277033c) 0x1f8944e _GLOBAL_.I.OpenWithTracker__FPC9entry_ref + 0x22
2663KERN: (0x7277036c) 0x1fa3458 __do_global_ctors_aux + 0x28 (closest symbol)
2664KERN: (0x7277038c) 0x1f6ea95 (/boot/system/Deskbar + 0x15)
2665KERN: (0x72770398) 0x3e61a1 init_dependencies__FP7image_tb + 0xc1
2666KERN: (0x727703d8) 0x3e6619 load_program + 0xcd
2667KERN: (0x72770438) 0x3eecda runtime_loader + 0x106
2668KERN: vm_soft_fault: va 0x0 not covered by area in address space
2669KERN: vm_page_fault: vm_soft_fault returned error 'Bad address' on fault at 0x9c, ip 0x1348405, write 0, user 1, thread 0x3b8
2670KERN: vm_page_fault: thread "Deskbar" (952) in team "Deskbar" (952) tried to read address 0x9c, ip 0x1348405 ("Deskbar_seg0ro" +0x3e405)
2671KERN: debug_server: Thread 952 entered the debugger: Segment violation
2672KERN: stack trace, current PC 0x1348405 __static_initialization_and_destruction_0 + 0x2d:
2673KERN: (0x7183e66c) 0x134844e _GLOBAL_.I.OpenWithTracker__FPC9entry_ref + 0x22
2674KERN: (0x7183e69c) 0x1362458 __do_global_ctors_aux + 0x28 (closest symbol)
2675KERN: (0x7183e6bc) 0x132da95 (/boot/system/Deskbar + 0x15)
2676KERN: (0x7183e6c8) 0x6681a1 init_dependencies__FP7image_tb + 0xc1
2677KERN: (0x7183e708) 0x668619 load_program + 0xcd
2678KERN: (0x7183e768) 0x670cda runtime_loader + 0x106
2679KERN: bfs: bfs_create_index:2135: File or Directory already exists
2680Last message repeated 1 time
2681KERN: debug_server: Killing team 952 (/boot/system/Deskbar)
2682KERN: debug_server: TeamDebugHandler::Init(): Failed to get info for team 952: Operation on invalid team
2683KERN: debug_server: KillTeam(): Error getting info for team 952: Operation on invalid team
2684KERN: debug_server: Killing team 952 ()
2685KERN: vm_soft_fault: va 0x0 not covered by area in address space
2686KERN: vm_page_fault: vm_soft_fault returned error 'Bad address' on fault at 0x9c, ip 0x10bf405, write 0, user 1, thread 0x3c9
2687KERN: vm_page_fault: thread "Deskbar" (969) in team "Deskbar" (969) tried to read address 0x9c, ip 0x10bf405 ("Deskbar_seg0ro" +0x3e405)
2688KERN: debug_server: Thread 969 entered the debugger: Segment violation
2689KERN: stack trace, current PC 0x10bf405 __static_initialization_and_destruction_0 + 0x2d:
2690KERN: (0x7241179c) 0x10bf44e _GLOBAL_.I.OpenWithTracker__FPC9entry_ref + 0x22
2691KERN: (0x724117cc) 0x10d9458 __do_global_ctors_aux + 0x28 (closest symbol)
2692KERN: (0x724117ec) 0x10a4a95 (/boot/system/Deskbar + 0x15)
2693KERN: (0x724117f8) 0x49d1a1 init_dependencies__FP7image_tb + 0xc1
2694KERN: (0x72411838) 0x49d619 load_program + 0xcd
2695KERN: (0x72411898) 0x4a5cda runtime_loader + 0x106
2696KERN: debug_server: Killing team 969 (/boot/system/Deskbar)
2697KERN: debug_server: TeamDebugHandler::Init(): Failed to get info for team 969: Operation on invalid team
2698KERN: debug_server: KillTeam(): Error getting info for team 969: Operation on invalid team
2699KERN: debug_server: Killing team 969 ()
2700KERN: vm_soft_fault: va 0x0 not covered by area in address space
2701KERN: vm_page_fault: vm_soft_fault returned error 'Bad address' on fault at 0x9c, ip 0xc59405, write 0, user 1, thread 0x3d1
2702KERN: vm_page_fault: thread "Deskbar" (977) in team "Deskbar" (977) tried to read address 0x9c, ip 0xc59405 ("Deskbar_seg0ro" +0x3e405)
2703KERN: debug_server: Thread 977 entered the debugger: Segment violation
2704KERN: stack trace, current PC 0xc59405 __static_initialization_and_destruction_0 + 0x2d:
2705KERN: (0x7169f35c) 0xc5944e _GLOBAL_.I.OpenWithTracker__FPC9entry_ref + 0x22
2706KERN: (0x7169f38c) 0xc73458 __do_global_ctors_aux + 0x28 (closest symbol)
2707KERN: (0x7169f3ac) 0xc3ea95 (/boot/system/Deskbar + 0x15)
2708KERN: (0x7169f3b8) 0x15bb1a1 init_dependencies__FP7image_tb + 0xc1
2709KERN: (0x7169f3f8) 0x15bb619 load_program + 0xcd
2710KERN: (0x7169f458) 0x15c3cda runtime_loader + 0x106
2711KERN: debug_server: Killing team 977 (/boot/system/Deskbar)
2712KERN: debug_server: TeamDebugHandler::Init(): Failed to get info for team 977: Operation on invalid team
2713KERN: debug_server: KillTeam(): Error getting info for team 977: Operation on invalid team
2714KERN: debug_server: Killing team 977 ()
2715KERN: vm_soft_fault: va 0x0 not covered by area in address space
2716KERN: vm_page_fault: vm_soft_fault returned error 'Bad address' on fault at 0x9c, ip 0x9b8405, write 0, user 1, thread 0x3d9
2717KERN: vm_page_fault: thread "Deskbar" (985) in team "Deskbar" (985) tried to read address 0x9c, ip 0x9b8405 ("Deskbar_seg0ro" +0x3e405)
2718KERN: debug_server: Thread 985 entered the debugger: Segment violation
2719KERN: stack trace, current PC 0x9b8405 __static_initialization_and_destruction_0 + 0x2d:
2720KERN: (0x7227b85c) 0x9b844e _GLOBAL_.I.OpenWithTracker__FPC9entry_ref + 0x22
2721KERN: (0x7227b88c) 0x9d2458 __do_global_ctors_aux + 0x28 (closest symbol)
2722KERN: (0x7227b8ac) 0x99da95 (/boot/system/Deskbar + 0x15)
2723KERN: (0x7227b8b8) 0xee81a1 init_dependencies__FP7image_tb + 0xc1
2724KERN: (0x7227b8f8) 0xee8619 load_program + 0xcd
2725KERN: (0x7227b958) 0xef0cda runtime_loader + 0x106
2726KERN: debug_server: Killing team 985 (/boot/system/Deskbar)
2727KERN: debug_server: TeamDebugHandler::Init(): Failed to get info for team 985: Operation on invalid team
2728KERN: debug_server: KillTeam(): Error getting info for team 985: Operation on invalid team
2729KERN: debug_server: Killing team 985 ()
2730KERN: vm_soft_fault: va 0x0 not covered by area in address space
2731KERN: vm_page_fault: vm_soft_fault returned error 'Bad address' on fault at 0x9c, ip 0xe3b405, write 0, user 1, thread 0x3df
2732KERN: vm_page_fault: thread "Deskbar" (991) in team "Deskbar" (991) tried to read address 0x9c, ip 0xe3b405 ("Deskbar_seg0ro" +0x3e405)
2733KERN: debug_server: Thread 991 entered the debugger: Segment violation
2734KERN: stack trace, current PC 0xe3b405 __static_initialization_and_destruction_0 + 0x2d:
2735KERN: (0x72244fcc) 0xe3b44e _GLOBAL_.I.OpenWithTracker__FPC9entry_ref + 0x22
2736KERN: (0x72244ffc) 0xe55458 __do_global_ctors_aux + 0x28 (closest symbol)
2737KERN: (0x7224501c) 0xe20a95 (/boot/system/Deskbar + 0x15)
2738KERN: (0x72245028) 0xe991a1 init_dependencies__FP7image_tb + 0xc1
2739KERN: (0x72245068) 0xe99619 load_program + 0xcd
2740KERN: (0x722450c8) 0xea1cda runtime_loader + 0x106
2741KERN: debug_server: Killing team 991 (/boot/system/Deskbar)
2742KERN: debug_server: TeamDebugHandler::Init(): Failed to get info for team 991: Operation on invalid team
2743KERN: debug_server: KillTeam(): Error getting info for team 991: Operation on invalid team
2744KERN: debug_server: Killing team 991 ()
2745KERN: vm_soft_fault: va 0x0 not covered by area in address space
2746KERN: vm_page_fault: vm_soft_fault returned error 'Bad address' on fault at 0x9c, ip 0x1583405, write 0, user 1, thread 0x3e5
2747KERN: vm_page_fault: thread "Deskbar" (997) in team "Deskbar" (997) tried to read address 0x9c, ip 0x1583405 ("Deskbar_seg0ro" +0x3e405)
2748KERN: debug_server: Thread 997 entered the debugger: Segment violation
2749KERN: stack trace, current PC 0x1583405 __static_initialization_and_destruction_0 + 0x2d:
2750KERN: (0x72b17c3c) 0x158344e _GLOBAL_.I.OpenWithTracker__FPC9entry_ref + 0x22
2751KERN: (0x72b17c6c) 0x159d458 __do_global_ctors_aux + 0x28 (closest symbol)
2752KERN: (0x72b17c8c) 0x1568a95 (/boot/system/Deskbar + 0x15)
2753KERN: (0x72b17c98) 0x1ef71a1 init_dependencies__FP7image_tb + 0xc1
2754KERN: (0x72b17cd8) 0x1ef7619 load_program + 0xcd
2755KERN: (0x72b17d38) 0x1effcda runtime_loader + 0x106
2756KERN: debug_server: Killing team 997 (/boot/system/Deskbar)
2757KERN: debug_server: TeamDebugHandler::Init(): Failed to get info for team 997: Operation on invalid team
2758KERN: debug_server: KillTeam(): Error getting info for team 997: Operation on invalid team
2759KERN: debug_server: Killing team 997 ()
2760KERN: vm_soft_fault: va 0x0 not covered by area in address space
2761KERN: vm_page_fault: vm_soft_fault returned error 'Bad address' on fault at 0x9c, ip 0x1020405, write 0, user 1, thread 0x3eb
2762KERN: vm_page_fault: thread "Deskbar" (1003) in team "Deskbar" (1003) tried to read address 0x9c, ip 0x1020405 ("Deskbar_seg0ro" +0x3e405)
2763KERN: debug_server: Thread 1003 entered the debugger: Segment violation
2764KERN: stack trace, current PC 0x1020405 __static_initialization_and_destruction_0 + 0x2d:
2765KERN: (0x71657d6c) 0x102044e _GLOBAL_.I.OpenWithTracker__FPC9entry_ref + 0x22
2766KERN: (0x71657d9c) 0x103a458 __do_global_ctors_aux + 0x28 (closest symbol)
2767KERN: (0x71657dbc) 0x1005a95 (/boot/system/Deskbar + 0x15)
2768KERN: (0x71657dc8) 0x10851a1 init_dependencies__FP7image_tb + 0xc1
2769KERN: (0x71657e08) 0x1085619 load_program + 0xcd
2770KERN: (0x71657e68) 0x108dcda runtime_loader + 0x106
2771KERN: debug_server: Killing team 1003 (/boot/system/Deskbar)
2772KERN: debug_server: TeamDebugHandler::Init(): Failed to get info for team 1003: Operation on invalid team
2773KERN: debug_server: KillTeam(): Error getting info for team 1003: Operation on invalid team
2774KERN: debug_server: Killing team 1003 ()
2775KERN: vm_soft_fault: va 0x0 not covered by area in address space
2776KERN: vm_page_fault: vm_soft_fault returned error 'Bad address' on fault at 0x9c, ip 0x1db6405, write 0, user 1, thread 0x3f1
2777KERN: vm_page_fault: thread "Deskbar" (1009) in team "Deskbar" (1009) tried to read address 0x9c, ip 0x1db6405 ("Deskbar_seg0ro" +0x3e405)
2778KERN: debug_server: Thread 1009 entered the debugger: Segment violation
2779KERN: stack trace, current PC 0x1db6405 __static_initialization_and_destruction_0 + 0x2d:
2780KERN: (0x71f1c86c) 0x1db644e _GLOBAL_.I.OpenWithTracker__FPC9entry_ref + 0x22
2781KERN: (0x71f1c89c) 0x1dd0458 __do_global_ctors_aux + 0x28 (closest symbol)
2782KERN: (0x71f1c8bc) 0x1d9ba95 (/boot/system/Deskbar + 0x15)
2783KERN: (0x71f1c8c8) 0x16981a1 init_dependencies__FP7image_tb + 0xc1
2784KERN: (0x71f1c908) 0x1698619 load_program + 0xcd
2785KERN: (0x71f1c968) 0x16a0cda runtime_loader + 0x106
2786KERN: debug_server: Killing team 1009 (/boot/system/Deskbar)
2787KERN: debug_server: TeamDebugHandler::Init(): Failed to get info for team 1009: Operation on invalid team
2788KERN: debug_server: KillTeam(): Error getting info for team 1009: Operation on invalid team
2789KERN: debug_server: Killing team 1009 ()
2790KERN: vm_soft_fault: va 0x0 not covered by area in address space
2791KERN: vm_page_fault: vm_soft_fault returned error 'Bad address' on fault at 0x9c, ip 0x19c7405, write 0, user 1, thread 0x3f7
2792KERN: vm_page_fault: thread "Deskbar" (1015) in team "Deskbar" (1015) tried to read address 0x9c, ip 0x19c7405 ("Deskbar_seg0ro" +0x3e405)
2793KERN: debug_server: Thread 1015 entered the debugger: Segment violation
2794KERN: stack trace, current PC 0x19c7405 __static_initialization_and_destruction_0 + 0x2d:
2795KERN: (0x7216a10c) 0x19c744e _GLOBAL_.I.OpenWithTracker__FPC9entry_ref + 0x22
2796KERN: (0x7216a13c) 0x19e1458 __do_global_ctors_aux + 0x28 (closest symbol)
2797KERN: (0x7216a15c) 0x19aca95 (/boot/system/Deskbar + 0x15)
2798KERN: (0x7216a168) 0x1f3f1a1 init_dependencies__FP7image_tb + 0xc1
2799KERN: (0x7216a1a8) 0x1f3f619 load_program + 0xcd
2800KERN: (0x7216a208) 0x1f47cda runtime_loader + 0x106
2801KERN: debug_server: Killing team 1015 (/boot/system/Deskbar)
2802KERN: debug_server: TeamDebugHandler::Init(): Failed to get info for team 1015: Operation on invalid team
2803KERN: debug_server: KillTeam(): Error getting info for team 1015: Operation on invalid team
2804KERN: debug_server: Killing team 1015 ()
2805KERN: vm_soft_fault: va 0x0 not covered by area in address space
2806KERN: vm_page_fault: vm_soft_fault returned error 'Bad address' on fault at 0x9c, ip 0x212a405, write 0, user 1, thread 0x3fd
2807KERN: vm_page_fault: thread "Deskbar" (1021) in team "Deskbar" (1021) tried to read address 0x9c, ip 0x212a405 ("Deskbar_seg0ro" +0x3e405)
2808KERN: debug_server: Thread 1021 entered the debugger: Segment violation
2809KERN: stack trace, current PC 0x212a405 __static_initialization_and_destruction_0 + 0x2d:
2810KERN: (0x7153092c) 0x212a44e _GLOBAL_.I.OpenWithTracker__FPC9entry_ref + 0x22
2811KERN: (0x7153095c) 0x2144458 __do_global_ctors_aux + 0x28 (closest symbol)
2812KERN: (0x7153097c) 0x210fa95 (/boot/system/Deskbar + 0x15)
2813KERN: (0x71530988) 0x18191a1 init_dependencies__FP7image_tb + 0xc1
2814KERN: (0x715309c8) 0x1819619 load_program + 0xcd
2815KERN: (0x71530a28) 0x1821cda runtime_loader + 0x106
2816KERN: debug_server: Killing team 1021 (/boot/system/Deskbar)
2817KERN: debug_server: TeamDebugHandler::Init(): Failed to get info for team 1021: Operation on invalid team
2818KERN: debug_server: KillTeam(): Error getting info for team 1021: Operation on invalid team
2819KERN: debug_server: Killing team 1021 ()
2820KERN: vm_soft_fault: va 0x0 not covered by area in address space
2821KERN: vm_page_fault: vm_soft_fault returned error 'Bad address' on fault at 0x9c, ip 0x6b5405, write 0, user 1, thread 0x403
2822KERN: vm_page_fault: thread "Deskbar" (1027) in team "Deskbar" (1027) tried to read address 0x9c, ip 0x6b5405 ("Deskbar_seg0ro" +0x3e405)
2823KERN: debug_server: Thread 1027 entered the debugger: Segment violation
2824KERN: stack trace, current PC 0x6b5405 __static_initialization_and_destruction_0 + 0x2d:
2825KERN: (0x717c632c) 0x6b544e _GLOBAL_.I.OpenWithTracker__FPC9entry_ref + 0x22
2826KERN: (0x717c635c) 0x6cf458 __do_global_ctors_aux + 0x28 (closest symbol)
2827KERN: (0x717c637c) 0x69aa95 (/boot/system/Deskbar + 0x15)
2828KERN: (0x717c6388) 0x1de01a1 init_dependencies__FP7image_tb + 0xc1
2829KERN: (0x717c63c8) 0x1de0619 load_program + 0xcd
2830KERN: (0x717c6428) 0x1de8cda runtime_loader + 0x106
2831KERN: debug_server: Killing team 1027 (/boot/system/Deskbar)
2832KERN: debug_server: TeamDebugHandler::Init(): Failed to get info for team 1027: Operation on invalid team
2833KERN: debug_server: KillTeam(): Error getting info for team 1027: Operation on invalid team
2834KERN: debug_server: Killing team 1027 ()
2835KERN: vm_soft_fault: va 0x0 not covered by area in address space
2836KERN: vm_page_fault: vm_soft_fault returned error 'Bad address' on fault at 0x9c, ip 0x1dab405, write 0, user 1, thread 0x409
2837KERN: vm_page_fault: thread "Deskbar" (1033) in team "Deskbar" (1033) tried to read address 0x9c, ip 0x1dab405 ("Deskbar_seg0ro" +0x3e405)
2838KERN: debug_server: Thread 1033 entered the debugger: Segment violation
2839KERN: stack trace, current PC 0x1dab405 __static_initialization_and_destruction_0 + 0x2d:
2840KERN: (0x72bc128c) 0x1dab44e _GLOBAL_.I.OpenWithTracker__FPC9entry_ref + 0x22
2841KERN: (0x72bc12bc) 0x1dc5458 __do_global_ctors_aux + 0x28 (closest symbol)
2842KERN: (0x72bc12dc) 0x1d90a95 (/boot/system/Deskbar + 0x15)
2843KERN: (0x72bc12e8) 0xfa51a1 init_dependencies__FP7image_tb + 0xc1
2844KERN: (0x72bc1328) 0xfa5619 load_program + 0xcd
2845KERN: (0x72bc1388) 0xfadcda runtime_loader + 0x106
2846KERN: debug_server: Killing team 1033 (/boot/system/Deskbar)
2847KERN: debug_server: TeamDebugHandler::Init(): Failed to get info for team 1033: Operation on invalid team
2848KERN: debug_server: KillTeam(): Error getting info for team 1033: Operation on invalid team
2849KERN: debug_server: Killing team 1033 ()
2850KERN: vm_soft_fault: va 0x0 not covered by area in address space
2851KERN: vm_page_fault: vm_soft_fault returned error 'Bad address' on fault at 0x9c, ip 0xe94405, write 0, user 1, thread 0x40f
2852KERN: vm_page_fault: thread "Deskbar" (1039) in team "Deskbar" (1039) tried to read address 0x9c, ip 0xe94405 ("Deskbar_seg0ro" +0x3e405)
2853KERN: debug_server: Thread 1039 entered the debugger: Segment violation
2854KERN: stack trace, current PC 0xe94405 __static_initialization_and_destruction_0 + 0x2d:
2855KERN: (0x723c4b6c) 0xe9444e _GLOBAL_.I.OpenWithTracker__FPC9entry_ref + 0x22
2856KERN: (0x723c4b9c) 0xeae458 __do_global_ctors_aux + 0x28 (closest symbol)
2857KERN: (0x723c4bbc) 0xe79a95 (/boot/system/Deskbar + 0x15)
2858KERN: (0x723c4bc8) 0x12151a1 init_dependencies__FP7image_tb + 0xc1
2859KERN: (0x723c4c08) 0x1215619 load_program + 0xcd
2860KERN: (0x723c4c68) 0x121dcda runtime_loader + 0x106
2861KERN: debug_server: Killing team 1039 (/boot/system/Deskbar)
2862KERN: debug_server: TeamDebugHandler::Init(): Failed to get info for team 1039: Operation on invalid team
2863KERN: debug_server: KillTeam(): Error getting info for team 1039: Operation on invalid team
2864KERN: debug_server: Killing team 1039 ()
2865KERN: vm_soft_fault: va 0x0 not covered by area in address space
2866KERN: vm_page_fault: vm_soft_fault returned error 'Bad address' on fault at 0x9c, ip 0x17a8405, write 0, user 1, thread 0x415
2867KERN: vm_page_fault: thread "Deskbar" (1045) in team "Deskbar" (1045) tried to read address 0x9c, ip 0x17a8405 ("Deskbar_seg0ro" +0x3e405)
2868KERN: debug_server: Thread 1045 entered the debugger: Segment violation
2869KERN: stack trace, current PC 0x17a8405 __static_initialization_and_destruction_0 + 0x2d:
2870KERN: (0x72a3fdbc) 0x17a844e _GLOBAL_.I.OpenWithTracker__FPC9entry_ref + 0x22
2871KERN: (0x72a3fdec) 0x17c2458 __do_global_ctors_aux + 0x28 (closest symbol)
2872KERN: (0x72a3fe0c) 0x178da95 (/boot/system/Deskbar + 0x15)
2873KERN: (0x72a3fe18) 0x13b01a1 init_dependencies__FP7image_tb + 0xc1
2874KERN: (0x72a3fe58) 0x13b0619 load_program + 0xcd
2875KERN: (0x72a3feb8) 0x13b8cda runtime_loader + 0x106
2876KERN: debug_server: Killing team 1045 (/boot/system/Deskbar)
2877KERN: debug_server: TeamDebugHandler::Init(): Failed to get info for team 1045: Operation on invalid team
2878KERN: debug_server: KillTeam(): Error getting info for team 1045: Operation on invalid team
2879KERN: debug_server: Killing team 1045 ()
2880KERN: vm_soft_fault: va 0x0 not covered by area in address space
2881KERN: vm_page_fault: vm_soft_fault returned error 'Bad address' on fault at 0x9c, ip 0x2ee405, write 0, user 1, thread 0x41b
2882KERN: vm_page_fault: thread "Deskbar" (1051) in team "Deskbar" (1051) tried to read address 0x9c, ip 0x2ee405 ("Deskbar_seg0ro" +0x3e405)
2883KERN: debug_server: Thread 1051 entered the debugger: Segment violation
2884KERN: stack trace, current PC 0x2ee405 __static_initialization_and_destruction_0 + 0x2d:
2885KERN: (0x7187a65c) 0x2ee44e _GLOBAL_.I.OpenWithTracker__FPC9entry_ref + 0x22
2886KERN: (0x7187a68c) 0x308458 __do_global_ctors_aux + 0x28 (closest symbol)
2887KERN: (0x7187a6ac) 0x2d3a95 (/boot/system/Deskbar + 0x15)
2888KERN: (0x7187a6b8) 0x21a11a1 init_dependencies__FP7image_tb + 0xc1
2889KERN: (0x7187a6f8) 0x21a1619 load_program + 0xcd
2890KERN: (0x7187a758) 0x21a9cda runtime_loader + 0x106
2891KERN: debug_server: Killing team 1051 (/boot/system/Deskbar)
2892KERN: debug_server: TeamDebugHandler::Init(): Failed to get info for team 1051: Operation on invalid team
2893KERN: debug_server: KillTeam(): Error getting info for team 1051: Operation on invalid team
2894KERN: debug_server: Killing team 1051 ()
2895KERN: vm_soft_fault: va 0x0 not covered by area in address space
2896KERN: vm_page_fault: vm_soft_fault returned error 'Bad address' on fault at 0x9c, ip 0x22fe405, write 0, user 1, thread 0x421
2897KERN: vm_page_fault: thread "Deskbar" (1057) in team "Deskbar" (1057) tried to read address 0x9c, ip 0x22fe405 ("Deskbar_seg0ro" +0x3e405)
2898KERN: debug_server: Thread 1057 entered the debugger: Segment violation
2899KERN: stack trace, current PC 0x22fe405 __static_initialization_and_destruction_0 + 0x2d:
2900KERN: (0x72063ddc) 0x22fe44e _GLOBAL_.I.OpenWithTracker__FPC9entry_ref + 0x22
2901KERN: (0x72063e0c) 0x2318458 __do_global_ctors_aux + 0x28 (closest symbol)
2902KERN: (0x72063e2c) 0x22e3a95 (/boot/system/Deskbar + 0x15)
2903KERN: (0x72063e38) 0x10601a1 init_dependencies__FP7image_tb + 0xc1
2904KERN: (0x72063e78) 0x1060619 load_program + 0xcd
2905KERN: (0x72063ed8) 0x1068cda runtime_loader + 0x106
2906KERN: debug_server: Killing team 1057 (/boot/system/Deskbar)
2907KERN: debug_server: TeamDebugHandler::Init(): Failed to get info for team 1057: Operation on invalid team
2908KERN: debug_server: KillTeam(): Error getting info for team 1057: Operation on invalid team
2909KERN: debug_server: Killing team 1057 ()
2910KERN: vm_soft_fault: va 0x0 not covered by area in address space
2911KERN: vm_page_fault: vm_soft_fault returned error 'Bad address' on fault at 0x9c, ip 0x25f9405, write 0, user 1, thread 0x427
2912KERN: vm_page_fault: thread "Deskbar" (1063) in team "Deskbar" (1063) tried to read address 0x9c, ip 0x25f9405 ("Deskbar_seg0ro" +0x3e405)
2913KERN: debug_server: Thread 1063 entered the debugger: Segment violation
2914KERN: stack trace, current PC 0x25f9405 __static_initialization_and_destruction_0 + 0x2d:
2915KERN: (0x71bdc53c) 0x25f944e _GLOBAL_.I.OpenWithTracker__FPC9entry_ref + 0x22
2916KERN: (0x71bdc56c) 0x2613458 __do_global_ctors_aux + 0x28 (closest symbol)
2917KERN: (0x71bdc58c) 0x25dea95 (/boot/system/Deskbar + 0x15)
2918KERN: (0x71bdc598) 0xef01a1 init_dependencies__FP7image_tb + 0xc1
2919KERN: (0x71bdc5d8) 0xef0619 load_program + 0xcd
2920KERN: (0x71bdc638) 0xef8cda runtime_loader + 0x106
2921KERN: debug_server: Killing team 1063 (/boot/system/Deskbar)
2922KERN: debug_server: TeamDebugHandler::Init(): Failed to get info for team 1063: Operation on invalid team
2923KERN: debug_server: KillTeam(): Error getting info for team 1063: Operation on invalid team
2924KERN: debug_server: Killing team 1063 ()
2925KERN: vm_soft_fault: va 0x0 not covered by area in address space
2926KERN: vm_page_fault: vm_soft_fault returned error 'Bad address' on fault at 0x9c, ip 0x1ff8405, write 0, user 1, thread 0x42d
2927KERN: vm_page_fault: thread "Deskbar" (1069) in team "Deskbar" (1069) tried to read address 0x9c, ip 0x1ff8405 ("Deskbar_seg0ro" +0x3e405)
2928KERN: debug_server: Thread 1069 entered the debugger: Segment violation
2929KERN: stack trace, current PC 0x1ff8405 __static_initialization_and_destruction_0 + 0x2d:
2930KERN: (0x7246e5bc) 0x1ff844e _GLOBAL_.I.OpenWithTracker__FPC9entry_ref + 0x22
2931KERN: (0x7246e5ec) 0x2012458 __do_global_ctors_aux + 0x28 (closest symbol)
2932KERN: (0x7246e60c) 0x1fdda95 (/boot/system/Deskbar + 0x15)
2933KERN: (0x7246e618) 0x1db91a1 init_dependencies__FP7image_tb + 0xc1
2934KERN: (0x7246e658) 0x1db9619 load_program + 0xcd
2935KERN: (0x7246e6b8) 0x1dc1cda runtime_loader + 0x106
2936KERN: debug_server: Killing team 1069 (/boot/system/Deskbar)
2937KERN: debug_server: TeamDebugHandler::Init(): Failed to get info for team 1069: Operation on invalid team
2938KERN: debug_server: KillTeam(): Error getting info for team 1069: Operation on invalid team
2939KERN: debug_server: Killing team 1069 ()
2940KERN: vm_soft_fault: va 0x0 not covered by area in address space
2941KERN: vm_page_fault: vm_soft_fault returned error 'Bad address' on fault at 0x9c, ip 0x1e43405, write 0, user 1, thread 0x433
2942KERN: vm_page_fault: thread "Deskbar" (1075) in team "Deskbar" (1075) tried to read address 0x9c, ip 0x1e43405 ("Deskbar_seg0ro" +0x3e405)
2943KERN: debug_server: Thread 1075 entered the debugger: Segment violation
2944KERN: stack trace, current PC 0x1e43405 __static_initialization_and_destruction_0 + 0x2d:
2945KERN: (0x71ad6b7c) 0x1e4344e _GLOBAL_.I.OpenWithTracker__FPC9entry_ref + 0x22
2946KERN: (0x71ad6bac) 0x1e5d458 __do_global_ctors_aux + 0x28 (closest symbol)
2947KERN: (0x71ad6bcc) 0x1e28a95 (/boot/system/Deskbar + 0x15)
2948KERN: (0x71ad6bd8) 0xff31a1 init_dependencies__FP7image_tb + 0xc1
2949KERN: (0x71ad6c18) 0xff3619 load_program + 0xcd
2950KERN: (0x71ad6c78) 0xffbcda runtime_loader + 0x106
2951KERN: debug_server: Killing team 1075 (/boot/system/Deskbar)
2952KERN: debug_server: TeamDebugHandler::Init(): Failed to get info for team 1075: Operation on invalid team
2953KERN: debug_server: KillTeam(): Error getting info for team 1075: Operation on invalid team
2954KERN: debug_server: Killing team 1075 ()
2955KERN: vm_soft_fault: va 0x0 not covered by area in address space
2956KERN: vm_page_fault: vm_soft_fault returned error 'Bad address' on fault at 0x9c, ip 0x792405, write 0, user 1, thread 0x439
2957KERN: vm_page_fault: thread "Deskbar" (1081) in team "Deskbar" (1081) tried to read address 0x9c, ip 0x792405 ("Deskbar_seg0ro" +0x3e405)
2958KERN: debug_server: Thread 1081 entered the debugger: Segment violation
2959KERN: stack trace, current PC 0x792405 __static_initialization_and_destruction_0 + 0x2d:
2960KERN: (0x724130ac) 0x79244e _GLOBAL_.I.OpenWithTracker__FPC9entry_ref + 0x22
2961KERN: (0x724130dc) 0x7ac458 __do_global_ctors_aux + 0x28 (closest symbol)
2962KERN: (0x724130fc) 0x777a95 (/boot/system/Deskbar + 0x15)
2963KERN: (0x72413108) 0x94f1a1 init_dependencies__FP7image_tb + 0xc1
2964KERN: (0x72413148) 0x94f619 load_program + 0xcd
2965KERN: (0x724131a8) 0x957cda runtime_loader + 0x106
2966KERN: debug_server: Killing team 1081 (/boot/system/Deskbar)
2967KERN: debug_server: TeamDebugHandler::Init(): Failed to get info for team 1081: Operation on invalid team
2968KERN: debug_server: KillTeam(): Error getting info for team 1081: Operation on invalid team
2969KERN: debug_server: Killing team 1081 ()
2970KERN: vm_soft_fault: va 0x0 not covered by area in address space
2971KERN: vm_page_fault: vm_soft_fault returned error 'Bad address' on fault at 0x9c, ip 0x1188405, write 0, user 1, thread 0x43f
2972KERN: vm_page_fault: thread "Deskbar" (1087) in team "Deskbar" (1087) tried to read address 0x9c, ip 0x1188405 ("Deskbar_seg0ro" +0x3e405)
2973KERN: debug_server: Thread 1087 entered the debugger: Segment violation
2974KERN: stack trace, current PC 0x1188405 __static_initialization_and_destruction_0 + 0x2d:
2975KERN: (0x72be2e4c) 0x118844e _GLOBAL_.I.OpenWithTracker__FPC9entry_ref + 0x22
2976KERN: (0x72be2e7c) 0x11a2458 __do_global_ctors_aux + 0x28 (closest symbol)
2977KERN: (0x72be2e9c) 0x116da95 (/boot/system/Deskbar + 0x15)
2978KERN: (0x72be2ea8) 0x1fcd1a1 init_dependencies__FP7image_tb + 0xc1
2979KERN: (0x72be2ee8) 0x1fcd619 load_program + 0xcd
2980KERN: (0x72be2f48) 0x1fd5cda runtime_loader + 0x106
2981KERN: debug_server: Killing team 1087 (/boot/system/Deskbar)
2982KERN: debug_server: TeamDebugHandler::Init(): Failed to get info for team 1087: Operation on invalid team
2983KERN: debug_server: KillTeam(): Error getting info for team 1087: Operation on invalid team
2984KERN: debug_server: Killing team 1087 ()
2985KERN: vm_soft_fault: va 0x0 not covered by area in address space
2986KERN: vm_page_fault: vm_soft_fault returned error 'Bad address' on fault at 0x9c, ip 0xd59405, write 0, user 1, thread 0x445
2987KERN: vm_page_fault: thread "Deskbar" (1093) in team "Deskbar" (1093) tried to read address 0x9c, ip 0xd59405 ("Deskbar_seg0ro" +0x3e405)
2988KERN: debug_server: Thread 1093 entered the debugger: Segment violation
2989KERN: stack trace, current PC 0xd59405 __static_initialization_and_destruction_0 + 0x2d:
2990KERN: (0x7249defc) 0xd5944e _GLOBAL_.I.OpenWithTracker__FPC9entry_ref + 0x22
2991KERN: (0x7249df2c) 0xd73458 __do_global_ctors_aux + 0x28 (closest symbol)
2992KERN: (0x7249df4c) 0xd3ea95 (/boot/system/Deskbar + 0x15)
2993KERN: (0x7249df58) 0x121b1a1 init_dependencies__FP7image_tb + 0xc1
2994KERN: (0x7249df98) 0x121b619 load_program + 0xcd
2995KERN: (0x7249dff8) 0x1223cda runtime_loader + 0x106
2996KERN: debug_server: Killing team 1093 (/boot/system/Deskbar)
2997KERN: debug_server: TeamDebugHandler::Init(): Failed to get info for team 1093: Operation on invalid team
2998KERN: debug_server: KillTeam(): Error getting info for team 1093: Operation on invalid team
2999KERN: debug_server: Killing team 1093 ()
3000KERN: vm_soft_fault: va 0x0 not covered by area in address space
3001KERN: vm_page_fault: vm_soft_fault returned error 'Bad address' on fault at 0x9c, ip 0x188e405, write 0, user 1, thread 0x44b
3002KERN: vm_page_fault: thread "Deskbar" (1099) in team "Deskbar" (1099) tried to read address 0x9c, ip 0x188e405 ("Deskbar_seg0ro" +0x3e405)
3003KERN: debug_server: Thread 1099 entered the debugger: Segment violation
3004KERN: stack trace, current PC 0x188e405 __static_initialization_and_destruction_0 + 0x2d:
3005KERN: (0x71a0aa6c) 0x188e44e _GLOBAL_.I.OpenWithTracker__FPC9entry_ref + 0x22
3006KERN: (0x71a0aa9c) 0x18a8458 __do_global_ctors_aux + 0x28 (closest symbol)
3007KERN: (0x71a0aabc) 0x1873a95 (/boot/system/Deskbar + 0x15)
3008KERN: (0x71a0aac8) 0x9af1a1 init_dependencies__FP7image_tb + 0xc1
3009KERN: (0x71a0ab08) 0x9af619 load_program + 0xcd
3010KERN: (0x71a0ab68) 0x9b7cda runtime_loader + 0x106
3011KERN: debug_server: Killing team 1099 (/boot/system/Deskbar)
3012KERN: debug_server: TeamDebugHandler::Init(): Failed to get info for team 1099: Operation on invalid team
3013KERN: debug_server: KillTeam(): Error getting info for team 1099: Operation on invalid team
3014KERN: debug_server: Killing team 1099 ()
3015KERN: vm_soft_fault: va 0x0 not covered by area in address space
3016KERN: vm_page_fault: vm_soft_fault returned error 'Bad address' on fault at 0x9c, ip 0x2116405, write 0, user 1, thread 0x451
3017KERN: vm_page_fault: thread "Deskbar" (1105) in team "Deskbar" (1105) tried to read address 0x9c, ip 0x2116405 ("Deskbar_seg0ro" +0x3e405)
3018KERN: debug_server: Thread 1105 entered the debugger: Segment violation
3019KERN: stack trace, current PC 0x2116405 __static_initialization_and_destruction_0 + 0x2d:
3020KERN: (0x72c9e5fc) 0x211644e _GLOBAL_.I.OpenWithTracker__FPC9entry_ref + 0x22
3021KERN: (0x72c9e62c) 0x2130458 __do_global_ctors_aux + 0x28 (closest symbol)
3022KERN: (0x72c9e64c) 0x20fba95 (/boot/system/Deskbar + 0x15)
3023KERN: (0x72c9e658) 0x1c481a1 init_dependencies__FP7image_tb + 0xc1
3024KERN: (0x72c9e698) 0x1c48619 load_program + 0xcd
3025KERN: (0x72c9e6f8) 0x1c50cda runtime_loader + 0x106
3026KERN: debug_server: Killing team 1105 (/boot/system/Deskbar)
3027KERN: debug_server: TeamDebugHandler::Init(): Failed to get info for team 1105: Operation on invalid team
3028KERN: debug_server: KillTeam(): Error getting info for team 1105: Operation on invalid team
3029KERN: debug_server: Killing team 1105 ()
3030KERN: vm_soft_fault: va 0x0 not covered by area in address space
3031KERN: vm_page_fault: vm_soft_fault returned error 'Bad address' on fault at 0x9c, ip 0x2279405, write 0, user 1, thread 0x457
3032KERN: vm_page_fault: thread "Deskbar" (1111) in team "Deskbar" (1111) tried to read address 0x9c, ip 0x2279405 ("Deskbar_seg0ro" +0x3e405)
3033KERN: debug_server: Thread 1111 entered the debugger: Segment violation
3034KERN: stack trace, current PC 0x2279405 __static_initialization_and_destruction_0 + 0x2d:
3035KERN: (0x7249451c) 0x227944e _GLOBAL_.I.OpenWithTracker__FPC9entry_ref + 0x22
3036KERN: (0x7249454c) 0x2293458 __do_global_ctors_aux + 0x28 (closest symbol)
3037KERN: (0x7249456c) 0x225ea95 (/boot/system/Deskbar + 0x15)
3038KERN: (0x72494578) 0x18cb1a1 init_dependencies__FP7image_tb + 0xc1
3039KERN: (0x724945b8) 0x18cb619 load_program + 0xcd
3040KERN: (0x72494618) 0x18d3cda runtime_loader + 0x106
3041KERN: debug_server: Killing team 1111 (/boot/system/Deskbar)
3042KERN: debug_server: TeamDebugHandler::Init(): Failed to get info for team 1111: Operation on invalid team
3043KERN: debug_server: KillTeam(): Error getting info for team 1111: Operation on invalid team
3044KERN: debug_server: Killing team 1111 ()
3045KERN: vm_soft_fault: va 0x0 not covered by area in address space
3046KERN: vm_page_fault: vm_soft_fault returned error 'Bad address' on fault at 0x9c, ip 0x21c5405, write 0, user 1, thread 0x45d
3047KERN: vm_page_fault: thread "Deskbar" (1117) in team "Deskbar" (1117) tried to read address 0x9c, ip 0x21c5405 ("Deskbar_seg0ro" +0x3e405)
3048KERN: debug_server: Thread 1117 entered the debugger: Segment violation
3049KERN: stack trace, current PC 0x21c5405 __static_initialization_and_destruction_0 + 0x2d:
3050KERN: (0x7196675c) 0x21c544e _GLOBAL_.I.OpenWithTracker__FPC9entry_ref + 0x22
3051KERN: (0x7196678c) 0x21df458 __do_global_ctors_aux + 0x28 (closest symbol)
3052KERN: (0x719667ac) 0x21aaa95 (/boot/system/Deskbar + 0x15)
3053KERN: (0x719667b8) 0x22481a1 init_dependencies__FP7image_tb + 0xc1
3054KERN: (0x719667f8) 0x2248619 load_program + 0xcd
3055KERN: (0x71966858) 0x2250cda runtime_loader + 0x106
3056KERN: debug_server: Killing team 1117 (/boot/system/Deskbar)
3057KERN: debug_server: TeamDebugHandler::Init(): Failed to get info for team 1117: Operation on invalid team
3058KERN: debug_server: KillTeam(): Error getting info for team 1117: Operation on invalid team
3059KERN: debug_server: Killing team 1117 ()
3060KERN: vm_soft_fault: va 0x0 not covered by area in address space
3061KERN: vm_page_fault: vm_soft_fault returned error 'Bad address' on fault at 0x9c, ip 0xd08405, write 0, user 1, thread 0x463
3062KERN: vm_page_fault: thread "Deskbar" (1123) in team "Deskbar" (1123) tried to read address 0x9c, ip 0xd08405 ("Deskbar_seg0ro" +0x3e405)
3063KERN: debug_server: Thread 1123 entered the debugger: Segment violation
3064KERN: stack trace, current PC 0xd08405 __static_initialization_and_destruction_0 + 0x2d:
3065KERN: (0x730d0c9c) 0xd0844e _GLOBAL_.I.OpenWithTracker__FPC9entry_ref + 0x22
3066KERN: (0x730d0ccc) 0xd22458 __do_global_ctors_aux + 0x28 (closest symbol)
3067KERN: (0x730d0cec) 0xceda95 (/boot/system/Deskbar + 0x15)
3068KERN: (0x730d0cf8) 0x1a891a1 init_dependencies__FP7image_tb + 0xc1
3069KERN: (0x730d0d38) 0x1a89619 load_program + 0xcd
3070KERN: (0x730d0d98) 0x1a91cda runtime_loader + 0x106
3071KERN: debug_server: Killing team 1123 (/boot/system/Deskbar)
3072KERN: debug_server: TeamDebugHandler::Init(): Failed to get info for team 1123: Operation on invalid team
3073KERN: debug_server: KillTeam(): Error getting info for team 1123: Operation on invalid team
3074KERN: debug_server: Killing team 1123 ()
3075KERN: vm_soft_fault: va 0x0 not covered by area in address space
3076KERN: vm_page_fault: vm_soft_fault returned error 'Bad address' on fault at 0x9c, ip 0x2864405, write 0, user 1, thread 0x469
3077KERN: vm_page_fault: thread "Deskbar" (1129) in team "Deskbar" (1129) tried to read address 0x9c, ip 0x2864405 ("Deskbar_seg0ro" +0x3e405)
3078KERN: debug_server: Thread 1129 entered the debugger: Segment violation
3079KERN: stack trace, current PC 0x2864405 __static_initialization_and_destruction_0 + 0x2d:
3080KERN: (0x7227db3c) 0x286444e _GLOBAL_.I.OpenWithTracker__FPC9entry_ref + 0x22
3081KERN: (0x7227db6c) 0x287e458 __do_global_ctors_aux + 0x28 (closest symbol)
3082KERN: (0x7227db8c) 0x2849a95 (/boot/system/Deskbar + 0x15)
3083KERN: (0x7227db98) 0x17751a1 init_dependencies__FP7image_tb + 0xc1
3084KERN: (0x7227dbd8) 0x1775619 load_program + 0xcd
3085KERN: (0x7227dc38) 0x177dcda runtime_loader + 0x106