Ticket #14344: 20180810-2003-syslog

File 20180810-2003-syslog, 177.9 KB (added by roiredxsoto, 11 months ago)

Syslog of fresh start

Line 
1KERN: PCI:   class_base 06, class_function 01, class_api 00
2KERN: PCI:   vendor 1022: Advanced Micro Devices, Inc. [AMD]
3KERN: PCI:   device 780e: FCH LPC Bridge
4KERN: PCI:   info: Bridge (ISA bridge)
5KERN: PCI:   line_size 00, latency 00, header_type 80, BIST 00
6KERN: PCI:   ROM base host 00000000, pci 00000000, size 00000000
7KERN: PCI:   cardbus_CIS 00000000, subsystem_id 780e, subsystem_vendor_id 1849
8KERN: PCI:   interrupt_line 00, interrupt_pin 00, min_grant 00, max_latency 00
9KERN: PCI:   base reg 0: host 00000000, pci 00000000, size 00000000, flags 00
10KERN: PCI:   base reg 1: host 00000000, pci 00000000, size 00000000, flags 00
11KERN: PCI:   base reg 2: host 00000000, pci 00000000, size 00000000, flags 00
12KERN: PCI:   base reg 3: host 00000000, pci 00000000, size 00000000, flags 00
13KERN: PCI:   base reg 4: host 00000000, pci 00000000, size 00000000, flags 00
14KERN: PCI:   base reg 5: host 00000000, pci 00000000, size 00000000, flags 00
15KERN: PCI:   Capabilities: (not supported)
16KERN: PCI: [dom 0, bus  0] bus   0, device 20, function  4: vendor 1022, device 780f, revision 40
17KERN: PCI:   class_base 06, class_function 04, class_api 01
18KERN: PCI:   vendor 1022: Advanced Micro Devices, Inc. [AMD]
19KERN: PCI:   device 780f: FCH PCI Bridge
20KERN: PCI:   info: Bridge (PCI bridge, Subtractive decode)
21KERN: PCI:   line_size 00, latency 40, header_type 81, BIST 00
22KERN: PCI:   subsystem_id 0000, subsystem_vendor_id 0000
23KERN: PCI:   primary_bus 00, secondary_bus 02, subordinate_bus 02, secondary_latency 40
24KERN: PCI:   I/O window f000-0fff
25KERN: PCI:   memory window fff00000-000fffff
26KERN: PCI:   prefetchable memory window 00000000fff00000-00000000000fffff
27KERN: PCI:   bridge_control 0833, secondary_status 0280
28KERN: PCI:   interrupt_line 00, interrupt_pin 00
29KERN: PCI:   ROM base host 00000000, pci 00000000, size ??
30KERN: PCI:   base reg 0: host 00000000, pci 00000000, size 00000000, flags 00
31KERN: PCI:   base reg 1: host 00000000, pci 00000000, size 00000000, flags 00
32KERN: PCI:   Capabilities: (not supported)
33KERN: PCI: [dom 0, bus  0] bus   0, device 20, function  5: vendor 1022, device 7809, revision 11
34KERN: PCI:   class_base 0c, class_function 03, class_api 10
35KERN: PCI:   vendor 1022: Advanced Micro Devices, Inc. [AMD]
36KERN: PCI:   device 7809: FCH USB OHCI Controller
37KERN: PCI:   info: Serial bus controller (USB controller, OHCI)
38KERN: PCI:   line_size 10, latency 20, header_type 00, BIST 00
39KERN: PCI:   ROM base host 00000000, pci 00000000, size 00000000
40KERN: PCI:   cardbus_CIS 00000000, subsystem_id 7809, subsystem_vendor_id 1849
41KERN: PCI:   interrupt_line 0b, interrupt_pin 03, min_grant 00, max_latency 00
42KERN: PCI:   base reg 0: host ff708000, pci ff708000, size 00001000, flags 00
43KERN: PCI:   base reg 1: host 00000000, pci 00000000, size 00000000, flags 00
44KERN: PCI:   base reg 2: host 00000000, pci 00000000, size 00000000, flags 00
45KERN: PCI:   base reg 3: host 00000000, pci 00000000, size 00000000, flags 00
46KERN: PCI:   base reg 4: host 00000000, pci 00000000, size 00000000, flags 00
47KERN: PCI:   base reg 5: host 00000000, pci 00000000, size 00000000, flags 00
48KERN: PCI:   Capabilities: (not supported)
49KERN: PCI: [dom 0, bus  0] bus   0, device 21, function  0: vendor 1022, device 43a0, revision 00
50KERN: PCI:   class_base 06, class_function 04, class_api 00
51KERN: PCI:   vendor 1022: Advanced Micro Devices, Inc. [AMD]
52KERN: PCI:   device 43a0: Hudson PCI to PCI bridge (PCIE port 0)
53KERN: PCI:   info: Bridge (PCI bridge, Normal decode)
54KERN: PCI:   line_size 10, latency 00, header_type 81, BIST 00
55KERN: PCI:   subsystem_id 0000, subsystem_vendor_id 0050
56KERN: PCI:   primary_bus 00, secondary_bus 03, subordinate_bus 03, secondary_latency 00
57KERN: PCI:   I/O window d000-dfff
58KERN: PCI:   memory window fff00000-000fffff
59KERN: PCI:   prefetchable memory window 00000000d0300000-00000000d03fffff
60KERN: PCI:   bridge_control 0013, secondary_status 0000
61KERN: PCI:   interrupt_line ff, interrupt_pin 01
62KERN: PCI:   ROM base host 00000000, pci 00000000, size ??
63KERN: PCI:   base reg 0: host 00000000, pci 00000000, size 00000000, flags 00
64KERN: PCI:   base reg 1: host 00000000, pci 00000000, size 00000000, flags 00
65KERN: PCI:   Capabilities: PM, PCIe, MSI, subvendor, HyperTransport
66KERN: PCI:   Extended capabilities: Vendor Unique
67KERN: PCI: [dom 0, bus  3] bus   3, device  0, function  0: vendor 10ec, device 8168, revision 06
68KERN: PCI:   class_base 02, class_function 00, class_api 00
69KERN: PCI:   vendor 10ec: Realtek Semiconductor Co., Ltd.
70KERN: PCI:   device 8168: RTL8111/8168/8411 PCI Express Gigabit Ethernet Controller (Motherboard (one oKERN: f many))
71KERN: PCI:   info: Network controller (Ethernet controller)
72KERN: PCI:   line_size 10, latency 00, header_type 00, BIST 00
73KERN: PCI:   ROM base host 00000000, pci 00000000, size 00000000
74KERN: PCI:   cardbus_CIS 00000000, subsystem_id 8168, subsystem_vendor_id 1849
75KERN: PCI:   interrupt_line 04, interrupt_pin 01, min_grant 00, max_latency 00
76KERN: PCI:   base reg 0: host 0000d000, pci 0000d000, size 00000100, flags 01
77KERN: PCI:   base reg 1: host 00000000, pci 00000000, size 00000000, flags 00
78KERN: PCI:   base reg 2: host d0304000, pci d0304000, size 00001000, flags 0c
79KERN: PCI:   base reg 3: host 00000000, pci 00000000, size 00000000, flags 00
80KERN: PCI:   base reg 4: host d0300000, pci d0300000, size 00004000, flags 0c
81KERN: PCI:   base reg 5: host 00000000, pci 00000000, size 00000000, flags 00
82KERN: PCI:   Capabilities: PM, MSI, PCIe, MSI-X, VPD
83KERN: PCI:   Extended capabilities: Advanced Error Reporting, Virtual Channel, Serial Number
84KERN: PCI: [dom 0, bus  0] bus   0, device 24, function  0: vendor 1022, device 1400, revision 00
85KERN: PCI:   class_base 06, class_function 00, class_api 00
86KERN: PCI:   vendor 1022: Advanced Micro Devices, Inc. [AMD]
87KERN: PCI:   device 1400: Family 15h (Models 10h-1fh) Processor Function 0
88KERN: PCI:   info: Bridge (Host bridge)
89KERN: PCI:   line_size 00, latency 00, header_type 80, BIST 00
90KERN: PCI:   ROM base host 00000000, pci 00000000, size 00000000
91KERN: PCI:   cardbus_CIS 00000000, subsystem_id 0000, subsystem_vendor_id 0000
92KERN: PCI:   interrupt_line 00, interrupt_pin 00, min_grant 00, max_latency 00
93KERN: PCI:   base reg 0: host 00000000, pci 00000000, size 00000000, flags 00
94KERN: PCI:   base reg 1: host 00000000, pci 00000000, size 00000000, flags 00
95KERN: PCI:   base reg 2: host 00000000, pci 00000000, size 00000000, flags 00
96KERN: PCI:   base reg 3: host 00000000, pci 00000000, size 00000000, flags 00
97KERN: PCI:   base reg 4: host 00000000, pci 00000000, size 00000000, flags 00
98KERN: PCI:   base reg 5: host 00000000, pci 00000000, size 00000000, flags 00
99KERN: PCI:   Capabilities: (empty list)
100KERN: PCI: find_pci_capability ERROR 0:24:0 capability 0x10 empty list
101KERN: PCI: [dom 0, bus  0] bus   0, device 24, function  1: vendor 1022, device 1401, revision 00
102KERN: PCI:   class_base 06, class_function 00, class_api 00
103KERN: PCI:   vendor 1022: Advanced Micro Devices, Inc. [AMD]
104KERN: PCI:   device 1401: Family 15h (Models 10h-1fh) Processor Function 1
105KERN: PCI:   info: Bridge (Host bridge)
106KERN: PCI:   line_size 00, latency 00, header_type 80, BIST 00
107KERN: PCI:   ROM base host 00000000, pci 00000000, size 00000000
108KERN: PCI:   cardbus_CIS 00000000, subsystem_id 0000, subsystem_vendor_id 0000
109KERN: PCI:   interrupt_line 00, interrupt_pin 00, min_grant 00, max_latency 00
110KERN: PCI:   base reg 0: host 00000000, pci 00000000, size 00000000, flags 00
111KERN: PCI:   base reg 1: host 00000000, pci 00000000, size 00000000, flags 00
112KERN: PCI:   base reg 2: host 00000000, pci 00000000, size 00000000, flags 00
113KERN: PCI:   base reg 3: host 00000000, pci 00000000, size 00000000, flags 00
114KERN: PCI:   base reg 4: host 00000000, pci 00000000, size 00000000, flags 00
115KERN: PCI:   base reg 5: host 00000000, pci 00000000, size 00000000, flags 00
116KERN: PCI:   Capabilities: (not supported)
117KERN: PCI: [dom 0, bus  0] bus   0, device 24, function  2: vendor 1022, device 1402, revision 00
118KERN: PCI:   class_base 06, class_function 00, class_api 00
119KERN: PCI:   vendor 1022: Advanced Micro Devices, Inc. [AMD]
120KERN: PCI:   device 1402: Family 15h (Models 10h-1fh) Processor Function 2
121KERN: PCI:   info: Bridge (Host bridge)
122KERN: PCI:   line_size 00, latency 00, header_type 80, BIST 00
123KERN: PCI:   ROM base host 00000000, pci 00000000, size 00000000
124KERN: PCI:   cardbus_CIS 00000000, subsystem_id 0000, subsystem_vendor_id 0000
125KERN: PCI:   interrupt_line 00, interrupt_pin 00, min_grant 00, max_latency 00
126KERN: PCI:   base reg 0: host 00000000, pci 00000000, size 00000000, flags 00
127KERN: PCI:   base reg 1: host 00000000, pci 00000000, size 00000000, flags 00
128KERN: PCI:   base reg 2: host 00000000, pci 00000000, size 00000000, flags 00
129KERN: PCI:   base reg 3: host 00000000, pci 00000000, size 00000000, flags 00
130KERN: PCI:   base reg 4: host 00000000, pci 00000000, size 00000000, flags 00
131KERN: PCI:   base reg 5: host 00000000, pci 00000000, size 00000000, flags 00
132KERN: PCI:   Capabilities: (not supported)
133KERN: PCI: [dom 0, bus  0] bus   0, device 24, function  3: vendor 1022, device 1403, revision 00
134KERN: PCI:   class_base 06, class_function 00, class_api 00
135KERN: PCI:   vendor 1022: Advanced Micro Devices, Inc. [AMD]
136KERN: PCI:   device 1403: Family 15h (Models 10h-1fh) Processor Function 3
137KERN: PCI:   info: Bridge (Host bridge)
138KERN: PCI:   line_size 00, latency 00, header_type 80, BIST 00
139KERN: PCI:   ROM base host 00000000, pci 00000000, size 00000000
140KERN: PCI:   cardbus_CIS 00000000, subsystem_id 0000, subsystem_vendor_id 0000
141KERN: PCI:   interrupt_line 00, interrupt_pin 00, min_grant 00, max_latency 00
142KERN: PCI:   base reg 0: host 00000000, pci 00000000, size 00000000, flags 00
143KERN: PCI:   base reg 1: host 00000000, pci 00000000, size 00000000, flags 00
144KERN: PCI:   base reg 2: host 00000000, pci 00000000, size 00000000, flags 00
145KERN: PCI:   base reg 3: host 00000000, pci 00000000, size 00000000, flags 00
146KERN: PCI:   base reg 4: host 00000000, pci 00000000, size 00000000, flags 00
147KERN: PCI:   base reg 5: host 00000000, pci 00000000, size 00000000, flags 00
148KERN: PCI:   Capabilities: Secure Device
149KERN: PCI: [dom 0, bus  0] bus   0, device 24, function  4: vendor 1022, device 1404, revision 00
150KERN: PCI:   class_base 06, class_function 00, class_api 00
151KERN: PCI:   vendor 1022: Advanced Micro Devices, Inc. [AMD]
152KERN: PCI:   device 1404: Family 15h (Models 10h-1fh) Processor Function 4
153KERN: PCI:   info: Bridge (Host bridge)
154KERN: PCI:   line_size 00, latency 00, header_type 80, BIST 00
155KERN: PCI:   ROM base host 00000000, pci 00000000, size 00000000
156KERN: PCI:   cardbus_CIS 00000000, subsystem_id 0000, subsystem_vendor_id 0000
157KERN: PCI:   interrupt_line 00, interrupt_pin 00, min_grant 00, max_latency 00
158KERN: PCI:   base reg 0: host 00000000, pci 00000000, size 00000000, flags 00
159KERN: PCI:   base reg 1: host 00000000, pci 00000000, size 00000000, flags 00
160KERN: PCI:   base reg 2: host 00000000, pci 00000000, size 00000000, flags 00
161KERN: PCI:   base reg 3: host 00000000, pci 00000000, size 00000000, flags 00
162KERN: PCI:   base reg 4: host 00000000, pci 00000000, size 00000000, flags 00
163KERN: PCI:   base reg 5: host 00000000, pci 00000000, size 00000000, flags 00
164KERN: PCI:   Capabilities: (not supported)
165KERN: PCI: [dom 0, bus  0] bus   0, device 24, function  5: vendor 1022, device 1405, revision 00
166KERN: PCI:   class_base 06, class_function 00, class_api 00
167KERN: PCI:   vendor 1022: Advanced Micro Devices, Inc. [AMD]
168KERN: PCI:   device 1405: Family 15h (Models 10h-1fh) Processor Function 5
169KERN: PCI:   info: Bridge (Host bridge)
170KERN: PCI:   line_size 00, latency 00, header_type 80, BIST 00
171KERN: PCI:   ROM base host 00000000, pci 00000000, size 00000000
172KERN: PCI:   cardbus_CIS 00000000, subsystem_id 0000, subsystem_vendor_id 0000
173KERN: PCI:   interrupt_line 00, interrupt_pin 00, min_grant 00, max_latency 00
174KERN: PCI:   base reg 0: host 00000000, pci 00000000, size 00000000, flags 00
175KERN: PCI:   base reg 1: host 00000000, pci 00000000, size 00000000, flags 00
176KERN: PCI:   base reg 2: host 00000000, pci 00000000, size 00000000, flags 00
177KERN: PCI:   base reg 3: host 00000000, pci 00000000, size 00000000, flags 00
178KERN: PCI:   base reg 4: host 00000000, pci 00000000, size 00000000, flags 00
179KERN: PCI:   base reg 5: host 00000000, pci 00000000, size 00000000, flags 00
180KERN: PCI:   Capabilities: (not supported)
181KERN: add_memory_type_range(112, 0x0, 0x1000, 0)
182KERN: remove_memory_type_range(112, 0x0, 0x1000, 0)
183KERN: add_memory_type_range(113, 0x9e000, 0x1000, 0)
184KERN: remove_memory_type_range(113, 0x9e000, 0x1000, 0)
185KERN: add_memory_type_range(114, 0xe0000, 0x20000, 0)
186KERN: remove_memory_type_range(114, 0xe0000, 0x20000, 0)
187KERN: add_memory_type_range(115, 0xf0000, 0x1000, 0)
188KERN: ACPI: RSDP 0x00000000000F0490 000024 (v02 ALASKA)
189KERN: remove_memory_type_range(115, 0xf0000, 0x1000, 0)
190KERN: add_memory_type_range(116, 0xbdf15000, 0x1000, 0)
191KERN: ACPI: XSDT 0x00000000BDF15078 000074 (v01 ALASKA A M I    01072009 AMI  00010013)
192KERN: remove_memory_type_range(116, 0xbdf15000, 0x1000, 0)
193KERN: add_memory_type_range(117, 0xbdf15000, 0x1000, 0)
194KERN: add_memory_type_range(118, 0xbdf1a000, 0x1000, 0)
195KERN: remove_memory_type_range(118, 0xbdf1a000, 0x1000, 0)
196KERN: add_memory_type_range(119, 0xbdf1a000, 0x1000, 0)
197KERN: ACPI: FACP 0x00000000BDF1ADF8 0000F4 (v04 ALASKA A M I    01072009 AMI  00010013)
198KERN: remove_memory_type_range(119, 0xbdf1a000, 0x1000, 0)
199KERN: add_memory_type_rangKERN: e(120, 0xbdf1a000, 0x1000, 0)
200KERN: Firmware Warning (ACPI): Optional FADT field Pm2ControlBlock has valid Length but zero Address: 0x0000000000000000/0x1 (20180105/tbfadt-801)
201KERN: remove_memory_type_range(120, 0xbdf1a000, 0x1000, 0)
202KERN: add_memory_type_range(121, 0xbdf15000, 0x1000, 0)
203KERN: remove_memory_type_range(121, 0xbdf15000, 0x1000, 0)
204KERN: add_memory_type_range(122, 0xbdf15000, 0x6000, 0)
205KERN: add_memory_type_range(123, 0xbdf1a000, 0x1000, 0)
206KERN: remove_memory_type_range(123, 0xbdf1a000, 0x1000, 0)
207KERN: ACPI: DSDT 0x00000000BDF15188 005C69 (v02 ALASKA A M I    00000000 INTL 20051117)
208KERN: remove_memory_type_range(122, 0xbdf15000, 0x6000, 0)
209KERN: add_memory_type_range(124, 0xbdf1d000, 0x1000, 0)
210KERN: remove_memory_type_range(124, 0xbdf1d000, 0x1000, 0)
211KERN: add_memory_type_range(125, 0xbdf1d000, 0x1000, 0)
212KERN: add_memory_type_range(126, 0xbdf1a000, 0x1000, 0)
213KERN: remove_memory_type_range(126, 0xbdf1a000, 0x1000, 0)
214KERN: add_memory_type_range(127, 0xbdf15000, 0x6000, 0)
215KERN: remove_memory_type_range(127, 0xbdf15000, 0x6000, 0)
216KERN: ACPI: FACS 0x00000000BDF1DE80 000040
217KERN: remove_memory_type_range(125, 0xbdf1d000, 0x1000, 0)
218KERN: add_memory_type_range(128, 0xbdf1a000, 0x1000, 0)
219KERN: remove_memory_type_range(128, 0xbdf1a000, 0x1000, 0)
220KERN: add_memory_type_range(129, 0xbdf1a000, 0x1000, 0)
221KERN: add_memory_type_range(130, 0xbdf1a000, 0x1000, 0)
222KERN: remove_memory_type_range(130, 0xbdf1a000, 0x1000, 0)
223KERN: add_memory_type_range(131, 0xbdf15000, 0x6000, 0)
224KERN: remove_memory_type_range(131, 0xbdf15000, 0x6000, 0)
225KERN: add_memory_type_range(132, 0xbdf1d000, 0x1000, 0)
226KERN: remove_memory_type_range(132, 0xbdf1d000, 0x1000, 0)
227KERN: ACPI: APIC 0x00000000BDF1AEF0 000072 (v03 ALASKA A M I    01072009 AMI  00010013)
228KERN: remove_memory_type_range(129, 0xbdf1a000, 0x1000, 0)
229KERN: add_memory_type_range(133, 0xbdf1a000, 0x1000, 0)
230KERN: remove_memory_type_range(133, 0xbdf1a000, 0x1000, 0)
231KERN: add_memory_type_range(134, 0xbdf1a000, 0x1000, 0)
232KERN: add_memory_type_range(135, 0xbdf1a000, 0x1000, 0)
233KERN: remove_memory_type_range(135, 0xbdf1a000, 0x1000, 0)
234KERN: add_memory_type_range(136, 0xbdf15000, 0x6000, 0)
235KERN: remove_memory_type_range(136, 0xbdf15000, 0x6000, 0)
236KERN: add_memory_type_range(137, 0xbdf1d000, 0x1000, 0)
237KERN: remove_memory_type_range(137, 0xbdf1d000, 0x1000, 0)
238KERN: add_memory_type_range(138, 0xbdf1a000, 0x1000, 0)
239KERN: remove_memory_type_range(138, 0xbdf1a000, 0x1000, 0)
240KERN: ACPI: FPDT 0x00000000BDF1AF68 000044 (v01 ALASKA A M I    01072009 AMI  00010013)
241KERN: remove_memory_type_range(134, 0xbdf1a000, 0x1000, 0)
242KERN: add_memory_type_range(139, 0xbdf1a000, 0x1000, 0)
243KERN: remove_memory_type_range(139, 0xbdf1a000, 0x1000, 0)
244KERN: add_memory_type_range(140, 0xbdf1a000, 0x1000, 0)
245KERN: add_memory_type_range(141, 0xbdf1a000, 0x1000, 0)
246KERN: remove_memory_type_range(141, 0xbdf1a000, 0x1000, 0)
247KERN: add_memory_type_range(142, 0xbdf15000, 0x6000, 0)
248KERN: remove_memory_type_range(142, 0xbdf15000, 0x6000, 0)
249KERN: add_memory_type_range(143, 0xbdf1d000, 0x1000, 0)
250KERN: remove_memory_type_range(143, 0xbdf1d000, 0x1000, 0)
251KERN: add_memory_type_range(144, 0xbdf1a000, 0x1000, 0)
252KERN: remove_memory_type_range(144, 0xbdf1a000, 0x1000, 0)
253KERN: add_memory_type_range(145, 0xbdf1a000, 0x1000, 0)
254KERN: remove_memory_type_range(145, 0xbdf1a000, 0x1000, 0)
255KERN: ACPI: MCFG 0x00000000BDF1AFB0 00003C (v01 ALASKA A M I    01072009 MSFT 00010013)
256KERN: remove_memory_type_range(140, 0xbdf1a000, 0x1000, 0)
257KERN: add_memory_type_range(146, 0xbdf1a000, 0x2000, 0)
258KERN: remove_memory_type_range(146, 0xbdf1a000, 0x2000, 0)
259KERN: add_memory_type_range(147, 0xbdf1a000, 0x2000, 0)
260KERN: add_memory_type_range(148, 0xbdf1a000, 0x1000, 0)
261KERN: remove_memory_type_range(148, 0xbdf1a000, 0x1000, 0)
262KERN: add_memory_type_range(149, 0xbdf15000, 0x6000, 0)
263KERN: remove_memory_type_range(149, 0xbdf15000, 0x6000, 0)
264KERN: add_memory_type_range(150, 0xbdf1d000, 0x1000, 0)
265KERN: remove_memory_type_range(150, 0xbdf1d000, 0x1000, 0)
266KERN: add_memory_type_range(151, 0xbdf1a000, 0x1000, 0)
267KERN: remove_memory_type_range(151, 0xbdf1a000, 0x1000, 0)
268KERN: add_memory_type_range(152, 0xbdf1a000, 0x1000, 0)
269KERN: remove_memory_type_range(152, 0xbdf1a000, 0x1000, 0)
270KERN: add_memory_type_range(153, 0xbdf1a000, 0x1000, 0)
271KERN: remove_memory_type_range(153, 0xbdf1a000, 0x1000, 0)
272KERN: ACPI: AAFT 0x00000000BDF1AFF0 0000E7 (v01 ALASKA OEMAAFT  01072009 MSFT 00000097)
273KERN: remove_memory_type_range(147, 0xbdf1a000, 0x2000, 0)
274KERN: add_memory_type_range(154, 0xbdf1b000, 0x1000, 0)
275KERN: remove_memory_type_range(154, 0xbdf1b000, 0x1000, 0)
276KERN: add_memory_type_range(155, 0xbdf1b000, 0x1000, 0)
277KERN: add_memory_type_range(156, 0xbdf1a000, 0x1000, 0)
278KERN: remove_memory_type_range(156, 0xbdf1a000, 0x1000, 0)
279KERN: add_memory_type_range(157, 0xbdf15000, 0x6000, 0)
280KERN: remove_memory_type_range(157, 0xbdf15000, 0x6000, 0)
281KERN: add_memory_type_range(158, 0xbdf1d000, 0x1000, 0)
282KERN: remove_memory_type_range(158, 0xbdf1d000, 0x1000, 0)
283KERN: add_memory_type_range(159, 0xbdf1a000, 0x1000, 0)
284KERN: remove_memory_type_range(159, 0xbdf1a000, 0x1000, 0)
285KERN: add_memory_type_range(160, 0xbdf1a000, 0x1000, 0)
286KERN: remove_memory_type_range(160, 0xbdf1a000, 0x1000, 0)
287KERN: add_memory_type_range(161, 0xbdf1a000, 0x1000, 0)
288KERN: remove_memory_type_range(161, 0xbdf1a000, 0x1000, 0)
289KERN: add_memory_type_range(162, 0xbdf1a000, 0x2000, 0)
290KERN: remove_memory_type_range(162, 0xbdf1a000, 0x2000, 0)
291KERN: ACPI: HPET 0x00000000BDF1B0D8 000038 (v01 ALASKA A M I    01072009 AMI  00000005)
292KERN: remove_memory_type_range(155, 0xbdf1b000, 0x1000, 0)
293KERN: add_memory_type_range(163, 0xbdf1b000, 0x1000, 0)
294KERN: remove_memory_type_range(163, 0xbdf1b000, 0x1000, 0)
295KERN: add_memory_type_range(164, 0xbdf1b000, 0x1000, 0)
296KERN: add_memory_type_range(165, 0xbdf1a000, 0x1000, 0)
297KERN: remove_memory_type_range(165, 0xbdf1a000, 0x1000, 0)
298KERN: add_memory_type_range(166, 0xbdf15000, 0x6000, 0)
299KERN: remove_memory_type_range(166, 0xbdf15000, 0x6000, 0)
300KERN: add_memory_type_range(167, 0xbdf1d000, 0x1000, 0)
301KERN: remove_memory_type_range(167, 0xbdf1d000, 0x1000, 0)
302KERN: add_memory_type_range(168, 0xbdf1a000, 0x1000, 0)
303KERN: remove_memory_type_range(168, 0xbdf1a000, 0x1000, 0)
304KERN: add_memory_type_range(169, 0xbdf1a000, 0x1000, 0)
305KERN: remove_memory_type_range(169, 0xbdf1a000, 0x1000, 0)
306KERN: add_memory_type_range(170, 0xbdf1a000, 0x1000, 0)
307KERN: remove_memory_type_range(170, 0xbdf1a000, 0x1000, 0)
308KERN: add_memory_type_range(171, 0xbdf1a000, 0x2000, 0)
309KERN: remove_memory_type_range(171, 0xbdf1a000, 0x2000, 0)
310KERN: add_memory_type_range(172, 0xbdf1b000, 0x1000, 0)
311KERN: remove_memory_type_range(172, 0xbdf1b000, 0x1000, 0)
312KERN: ACPI: SSDT 0x00000000BDF1B110 000D40 (v01 AMD    ANNAPURN 00000001 AMD  00000001)
313KERN: remove_memory_type_range(164, 0xbdf1b000, 0x1000, 0)
314KERN: add_memory_type_range(173, 0xbdf1b000, 0x1000, 0)
315KERN: remove_memory_type_range(173, 0xbdf1b000, 0x1000, 0)
316KERN: add_memory_type_range(174, 0xbdf1b000, 0x2000, 0)
317KERN: add_memory_type_range(175, 0xbdf1a000, 0x1000, 0)
318KERN: remove_memory_type_range(175, 0xbdf1a000, 0x1000, 0)
319KERN: add_memory_type_range(176, 0xbdf15000, 0x6000, 0)
320KERN: remove_memory_type_range(176, 0xbdf15000, 0x6000, 0)
321KERN: add_memory_type_range(177, 0xbdf1d000, 0x1000, 0)
322KERN: remove_memory_type_range(177, 0xbdf1d000, 0x1000, 0)
323KERN: add_memory_type_range(178, 0xbdf1a000, 0x1000, 0)
324KERN: remove_memory_type_range(178, 0xbdf1a000, 0x1000, 0)
325KERN: add_memory_type_range(179, 0xbdf1a000, 0x1000, 0)
326KERN: remove_memory_type_range(179, 0xbdf1a000, 0x1000, 0)
327KERN: add_memory_type_range(180, 0xbdf1a000, 0x1000, 0)
328KERN: remove_memory_type_range(180, 0xbdf1a000, 0x1000, 0)
329KERN: add_memory_type_range(181, 0xbdf1a000, 0x2000, 0)
330KERN: remove_memory_type_range(181, 0xbdf1a000, 0x2000, 0)
331KERN: add_memory_type_range(182, 0xbdf1b000, 0x1000, 0)
332KERN: remove_memory_type_range(182, 0xbdf1b000, 0x1000, 0)
333KERN: add_memory_type_range(183, 0xbdf1b000, 0x1000, 0)
334KERN: remove_memory_type_range(183, 0xbdf1b000, 0x1000, 0)
335KERN: ACPI: SSDT 0x00000000BDF1BE50 0004B7 (v02 AMD    ANNAPURN 00000001 MSFT 04000000)
336KERN: remove_memory_type_range(174, 0xbdf1b000, 0x2000, 0)
337KERN: add_memory_type_range(184, 0xbdf1c000, 0x1000, 0)
338KERN: remove_memory_type_range(184, 0xbdf1c000, 0x1000, 0)
339KERN: add_memory_type_range(185, 0xbdf1c000, 0x1000, 0)
340KERN: add_memory_type_range(186, 0xbdf1a000, 0x1000, 0)
341KERN: remove_memory_type_range(186, 0xbdf1a000, 0x1000, 0)
342KERN: add_memory_type_range(187, 0xbdf15000, 0x6000, 0)
343KERN: remove_memory_type_range(187, 0xbdf15000, 0x6000, 0)
344KERN: add_memory_type_range(188, 0xbdf1d000, 0x1000, 0)
345KERN: remove_memory_type_range(188, 0xbdf1d000, 0x1000, 0)
346KERN: add_memory_type_range(189, 0xbdf1a000, 0x1000, 0)
347KERN: remove_memory_type_range(189, 0xbdf1a000, 0x1000, 0)
348KERN: add_memory_type_range(190, 0xbdf1a000, 0x1000, 0)
349KERN: remove_memory_type_range(190, 0xbdf1a000, 0x1000, 0)
350KERN: add_memory_type_range(191, 0xbdf1a000, 0x1000, 0)
351KERN: remove_memorKERN: y_type_range(191, 0xbdf1a000, 0x1000, 0)
352KERN: add_memory_type_range(192, 0xbdf1a000, 0x2000, 0)
353KERN: remove_memory_type_range(192, 0xbdf1a000, 0x2000, 0)
354KERN: add_memory_type_range(193, 0xbdf1b000, 0x1000, 0)
355KERN: remove_memory_type_range(193, 0xbdf1b000, 0x1000, 0)
356KERN: add_memory_type_range(194, 0xbdf1b000, 0x1000, 0)
357KERN: remove_memory_type_range(194, 0xbdf1b000, 0x1000, 0)
358KERN: add_memory_type_range(195, 0xbdf1b000, 0x2000, 0)
359KERN: remove_memory_type_range(195, 0xbdf1b000, 0x2000, 0)
360KERN: ACPI: CRAT 0x00000000BDF1C308 0002F8 (v01 AMD    ANNAPURN 00000001 AMD  00000001)
361KERN: remove_memory_type_range(185, 0xbdf1c000, 0x1000, 0)
362KERN: add_memory_type_range(196, 0xbdf1c000, 0x1000, 0)
363KERN: remove_memory_type_range(196, 0xbdf1c000, 0x1000, 0)
364KERN: add_memory_type_range(197, 0xbdf1c000, 0x1000, 0)
365KERN: add_memory_type_range(198, 0xbdf1a000, 0x1000, 0)
366KERN: remove_memory_type_range(198, 0xbdf1a000, 0x1000, 0)
367KERN: add_memory_type_range(199, 0xbdf15000, 0x6000, 0)
368KERN: remove_memory_type_range(199, 0xbdf15000, 0x6000, 0)
369KERN: add_memory_type_range(200, 0xbdf1d000, 0x1000, 0)
370KERN: remove_memory_type_range(200, 0xbdf1d000, 0x1000, 0)
371KERN: add_memory_type_range(201, 0xbdf1a000, 0x1000, 0)
372KERN: remove_memory_type_range(201, 0xbdf1a000, 0x1000, 0)
373KERN: add_memory_type_range(202, 0xbdf1a000, 0x1000, 0)
374KERN: remove_memory_type_range(202, 0xbdf1a000, 0x1000, 0)
375KERN: add_memory_type_range(203, 0xbdf1a000, 0x1000, 0)
376KERN: remove_memory_type_range(203, 0xbdf1a000, 0x1000, 0)
377KERN: add_memory_type_range(204, 0xbdf1a000, 0x2000, 0)
378KERN: remove_memory_type_range(204, 0xbdf1a000, 0x2000, 0)
379KERN: add_memory_type_range(205, 0xbdf1b000, 0x1000, 0)
380KERN: remove_memory_type_range(205, 0xbdf1b000, 0x1000, 0)
381KERN: add_memory_type_range(206, 0xbdf1b000, 0x1000, 0)
382KERN: remove_memory_type_range(206, 0xbdf1b000, 0x1000, 0)
383KERN: add_memory_type_range(207, 0xbdf1b000, 0x2000, 0)
384KERN: remove_memory_type_range(207, 0xbdf1b000, 0x2000, 0)
385KERN: add_memory_type_range(208, 0xbdf1c000, 0x1000, 0)
386KERN: remove_memory_type_range(208, 0xbdf1c000, 0x1000, 0)
387KERN: ACPI: BGRT 0x00000000BDF1C600 000038 (v00 ALASKA A M I    01072009 AMI  00010013)
388KERN: remove_memory_type_range(197, 0xbdf1c000, 0x1000, 0)
389KERN: remove_memory_type_range(117, 0xbdf15000, 0x1000, 0)
390KERN: add_memory_type_range(209, 0xbdf15000, 0x6000, 0)
391KERN: remove_memory_type_range(209, 0xbdf15000, 0x6000, 0)
392KERN: ACPI: Forced DSDT copy: length 0x05C69 copied locally, original unmapped
393KERN: ACPI: Executed 1 blocks of module-level executable AML code
394KERN: add_memory_type_range(210, 0xbdf1b000, 0x1000, 0)
395KERN: add_memory_type_range(211, 0xbdf1b000, 0x2000, 0)
396KERN: ACPI: 3 ACPI AML tables successfully acquired and loaded
397KERN: add_memory_type_range(212, 0xbdf1d000, 0x1000, 0)
398KERN: add_memory_type_range(213, 0xe00a0000, 0x1000, 0)
399KERN: add_memory_type_range(214, 0xfed80000, 0x1000, 0)
400KERN: ACPI: Enabled 9 GPEs in block 00 to 1F
401KERN: add_memory_type_range(215, 0xbdf1a000, 0x1000, 0)
402KERN: found io-apic with address 0xfec00000, global interrupt base 0, apic-id 5
403KERN: mapping io-apic 0 at physical address 0xfec00000
404KERN: add_memory_type_range(216, 0xfec00000, 0x1000, 0)
405KERN: io-apic 0 has range 0-23, 24 entries, version 0x00178021, apic-id 5
406KERN: setting ACPI interrupt model to APIC
407KERN: IRQ routing table with 14 entries
408KERN: address 0x2ffff; pin 0; GSI 18; pci 0:2 pin 1 func mask 1; bios irq: 11; gsi 18; config 0x06
409KERN: address 0x14ffff; pin 0; GSI 16; pci 0:20 pin 1 func mask 4; bios irq: 4; gsi 16; config 0x06
410KERN: address 0x14ffff; pin 2; GSI 18; pci 0:20 pin 3 func mask 20; bios irq: 11; gsi 18; config 0x06
411KERN: address 0x12ffff; pin 0; GSI 18; pci 0:18 pin 1 func mask 1; bios irq: 11; gsi 18; config 0x06
412KERN: address 0x12ffff; pin 1; GSI 17; pci 0:18 pin 2 func mask 4; bios irq: 5; gsi 17; config 0x06
413KERN: address 0x13ffff; pin 0; GSI 18; pci 0:19 pin 1 func mask 1; bios irq: 11; gsi 18; config 0x06
414KERN: address 0x13ffff; pin 1; GSI 17; pci 0:19 pin 2 func mask 4; bios irq: 5; gsi 17; config 0x06
415KERN: address 0x10ffff; pin 0; GSI 18; pci 0:16 pin 1 func mask 1; bios irq: 11; gsi 18; config 0x06
416KERN: address 0x10ffff; pin 1; GSI 17; pci 0:16 pin 2 func mask 2; bios irq: 5; gsi 17; config 0x06
417KERN: address 0x11ffff; pin 0; GSI 19; pci 0:17 pin 1 func mask 1; bios irq: 10; gsi 19; config 0x06
418KERN: address 0x15ffff; pin 0; GSI 16; pci 0:21 pin 1 func mask 1; bios irq: 255; gsi 16; config 0x06
419KERN: address 0xffff; pin 0; GSI 18; pci 1:0 pin 1 func mask 1; bios irq: 11; gsi 18; config 0x06
420KERN: address 0xffff; pin 1; GSI 19; pci 1:0 pin 2 func mask 2; bios irq: 10; gsi 19; config 0x06
421KERN: address 0xffff; pin 0; GSI 16; pci 3:0 pin 1 func mask 1; bios irq: 4; gsi 16; config 0x06
422KERN: found interrupt override for bus 0, source irq 0, global irq 2, flags 0x00000000
423KERN: found interrupt override for bus 0, source irq 9, global irq 9, flags 0x0000000f
424KERN: free_io_interrupt_vectors: freeing 16 vectors starting from 0
425KERN: reserve_io_interrupt_vectors: reserved 24 vectors starting from 0
426KERN: using io-apics for interrupt routing
427KERN: setting up apic for CPU 1: apic id 17, version 2147811344
428KERN: setting up apic for CPU 2: apic id 18, version 2147811344
429KERN: setting up apic for CPU 3: apic id 19, version 2147811344
430KERN: CPU 1: logical apic id: 0x2
431KERN: CPU 3: logical apic id: 0x8
432KERN: CPU 2: logical apic id: 0x4
433KERN: x86_init_fpu: CPU has SSE... enabling FXSR and XMM.
434KERN: Last message repeated 2 times.
435KERN: slab memory manager: created area 0xffffffff80801000 (227)
436KERN: allocate_commpage_entry(3, 76) -> 0x0000000000000210
437KERN: publish device: node 0xffffffff82022b40, path acpi/namespace, module bus_managers/acpi/namespace/device_v1
438KERN: registering power button
439KERN: remove_memory_type_range(213, 0xe00a0000, 0x1000, 0)
440KERN: add_memory_type_range(435, 0xe0088000, 0x1000, 0)
441KERN: add_memory_type_range(440, 0xff70d000, 0x1000, 0)
442KERN: remove_memory_type_range(440, 0xff70d000, 0x1000, 0)
443KERN: add_memory_type_range(445, 0xff70d000, 0x1000, 0)
444KERN: remove_memory_type_range(445, 0xff70d000, 0x1000, 0)
445KERN: add_memory_type_range(454, 0xff70d000, 0x1000, 0)
446KERN: remove_memory_type_range(454, 0xff70d000, 0x1000, 0)
447KERN: add_memory_type_range(459, 0xff70d000, 0x1000, 0)
448KERN: remove_memory_type_range(459, 0xff70d000, 0x1000, 0)
449KERN: Highpoint-IDE: supports_device()
450KERN: Highpoint-IDE: supports_device(): unsupported device: vendor ID: 1022, deviceID: 780b
451KERN: add_memory_type_range(555, 0xff706000, 0x2000, 0)
452KERN: usb xhci -1: interface version: 0x0096
453KERN: usb xhci -1: structural parameters: 1:0x04000820 2:0x00000011 3:0x00000000
454KERN: usb xhci -1: capability params: 0x014042c3
455KERN: allocate_io_interrupt_vectors: allocated 1 vectors starting from 24
456KERN: msi_allocate_vectors: allocated 1 vectors starting from 24
457KERN: msi enabled: 0x0087
458KERN: usb xhci -1: using message signaled interrupts
459KERN: usb xhci -1: starting XHCI host controller
460KERN: usb xhci -1: successfully started the controller
461KERN: add_memory_type_range(560, 0xff704000, 0x2000, 0)
462KERN: usb xhci -1: interface version: 0x0096
463KERN: usb xhci -1: structural parameters: 1:0x04000820 2:0x00000011 3:0x00000000
464KERN: usb xhci -1: capability params: 0x014042c3
465KERN: allocate_io_interrupt_vectors: allocated 1 vectors starting from 25
466KERN: msi_allocate_vectors: allocated 1 vectors starting from 25
467KERN: msi enabled: 0x0087
468KERN: usb xhci -1: using message signaled interrupts
469KERN: usb xhci -1: starting XHCI host controller
470KERN: usb xhci -1: successfully started the controller
471KERN: usb uhci: no devices found
472KERN: usb ohci -1: iospace offset: 0xff70c000
473KERN: add_memory_type_range(565, 0xff70c000, 0x1000, 0)
474KERN: usb ohci -1: smm is in control of the host controller
475KERN: usb ohci -1: ownership change successful
476KERN: usb ohci -1: successfully started the controller
477KERN: usb ohci -1: iospace offset: 0xff70a000
478KERN: add_memory_type_range(568, 0xff70a000, 0x1000, 0)
479KERN: usb ohci -1: smm is in control of the host controller
480KERN: usb ohci -1: ownership change successful
481KERN: usb ohci -1: successfully started the controller
482KERN: usb ohci -1: iospace offset: 0xff708000
483KERN: add_memory_type_range(571, 0xff708000, 0x1000, 0)
484KERN: usb ohci -1: smm is in control of the host controller
485KERN: usb ohci -1: ownership change successful
486KERN: usb ohci -1: successfully started the controller
487KERN: add_memory_type_range(574, 0xff70b000, 0x1000, 0)
488KERN: sitd entry size 128, itd entry size 128
489KERN: usb ehci -1: successfully started the controller
490KERN: add_memory_type_range(579, 0xff709000, 0x1000, 0)
491KERN: sitd entry size 128, itd entry size 128
492KERN: usb ehci -1: successfully started the controller
493KERN: usb hub 17: port 1: device removed
494KERN: usb hub 32: port 1: new device connected
495KERN: usb hub 38: port 2: new device connected
496KERN: usb hub 38: port 3: new device connected
497KERN: get_boot_partitions(): boot volume message:
498KERN: KMessage: buffer: 0xffffffff81dd9720 (size/capacity: 347/347), flags: 0xaKERN:
499KERN:   field: "booted from image" (BOOL): false
500KERN:   field: "partition offset"  (LLNG): 20480 (0x5000)
501KERN:   field: "packaged"          (BOOL): true
502KERN:   field: "boot method"       (LONG): 0 (0x0)
503KERN:   field: "boot drive number" (LLNG): 131 (0x83)
504KERN:   field: "disk identifier"   (RAWT): data at 0xffffffff81dd982c, 79 bytes
505KERN: get_boot_partitions(): boot method type: 0
506KERN: partitioning system: partitioning_systems/intel/extended/v1
507KERN: KDiskDeviceManager::_AddDiskSystem(partitioning_systems/intel/extended/v1)
508KERN: intel: ep_std_ops(0x1)
509KERN: intel: ep_std_ops(0x2)
510KERN: KDiskDeviceManager::_AddDiskSystem() done: No error
511KERN: partitioning system: partitioning_systems/efi_gpt/v1
512KERN: KDiskDeviceManager::_AddDiskSystem(partitioning_systems/efi_gpt/v1)
513KERN: KDiskDeviceManager::_AddDiskSystem() done: No error
514KERN: partitioning system: partitioning_systems/intel/map/v1
515KERN: KDiskDeviceManager::_AddDiskSystem(partitioning_systems/intel/map/v1)
516KERN: intel: pm_std_ops(0x1)
517KERN: intel: pm_std_ops(0x2)
518KERN: KDiskDeviceManager::_AddDiskSystem() done: No error
519KERN: file system: file_systems/devfs/v1
520KERN: KDiskDeviceManager::_AddDiskSystem(file_systems/devfs/v1)
521KERN: KDiskDeviceManager::_AddDiskSystem() done: No error
522KERN: file system: file_systems/packagefs/v1
523KERN: KDiskDeviceManager::_AddDiskSystem(file_systems/packagefs/v1)
524KERN: KDiskDeviceManager::_AddDiskSystem() done: No error
525KERN: file system: file_systems/rootfs/v1
526KERN: KDiskDeviceManager::_AddDiskSystem(file_systems/rootfs/v1)
527KERN: KDiskDeviceManager::_AddDiskSystem() done: No error
528KERN: file system: file_systems/bfs/v1
529KERN: KDiskDeviceManager::_AddDiskSystem(file_systems/bfs/v1)
530KERN: KDiskDeviceManager::_AddDiskSystem() done: No error
531KERN: number of disk systems: 7
532KERN: KDiskDeviceManager::_Scan(/dev/disk)
533KERN: Highpoint-IDE: supports_device()
534KERN: Highpoint-IDE: supports_device(): unsupported device: vendor ID: 1022, deviceID: 7801
535KERN: ahci: generic AHCI controller found! vendor 0x1022, device 0x7801
536KERN: ahci: ahci_register_device
537KERN: ahci: ahci_init_driver
538KERN: ahci: ahci_sim_init_bus
539KERN: ahci: ahci_sim_init_bus: pciDevice 0xffffffff8240ac30
540KERN: ahci: AHCIController::Init 0:17:0 vendor 1022, device 7801
541KERN: ahci: PCI SATA capability found at offset 0x70
542KERN: ahci: satacr0 = 0x00100012, satacr1 = 0x0000000f
543KERN: ahci: pcicmd old 0x0007
544KERN: ahci: pcicmd new 0x0006
545KERN: allocate_io_interrupt_vectors: allocated 1 vectors starting from 26
546KERN: msi_allocate_vectors: allocated 1 vectors starting from 26
547KERN: msi enabled: 0x0087
548KERN: ahci: using MSI vector 26
549KERN: ahci: registers at 0xff70d000, size 0x800
550KERN: ahci: mapping physical address 0xff70d000 with 2048 bytes for AHCI HBA regs
551KERN: add_memory_type_range(600, 0xff70d000, 0x1000, 0)
552KERN: ahci: physical = 0xff70d000, virtual = 0xffffffff81d06000, offset = 0, phyadr = 0xff70d000, mapadr = 0xffffffff81d06000, size = 4096, area = 0x00000258
553KERN: ahci: cap: Interface Speed Support: generation 3
554KERN: ahci: cap: Number of Command Slots: 32 (raw 0x1f)
555KERN: ahci: cap: Number of Ports: 6 (raw 0x5)
556KERN: ahci: cap: Supports Port Multiplier: yes
557KERN: ahci: cap: Supports External SATA: yes
558KERN: ahci: cap: Enclosure Management Supported: no
559KERN: ahci: cap: FIS-based Switching Control: no
560KERN: ahci: cap: Supports Command List Override: yes
561KERN: ahci: cap: Supports Staggered Spin-up: no
562KERN: ahci: cap: Supports Mechanical Presence Switch: yes
563KERN: ahci: cap: Supports 64-bit Addressing: yes
564KERN: ahci: cap: Supports Native Command Queuing: yes
565KERN: ahci: cap: Supports SNotification Register: yes
566KERN: ahci: cap: Supports Command List Override: yes
567KERN: ahci: cap: Supports AHCI mode only: no
568KERN: ahci: cap2: DevSleep Entrance from Slumber Only: no
569KERN: ahci: cap2: Supports Aggressive Device Sleep Management: no
570KERN: ahci: cap2: Supports Device Sleep: no
571KERN: ahci: cap2: Automatic Partial to Slumber Transitions: no
572KERN: ahci: cap2: NVMHCI Present: no
573KERN: ahci: cap2: BIOS/OS Handoff: no
574KERN: ahci: ghc: AHCI Enable: yes
575KERN: ahci: Ports Implemented Mask: 0x00003f Number of Available Ports: 6
576KERN: ahci: AHCI Version 0001.03.00 Interrupt 26
577KERN: ahci: allocating 4096 bytes for AHCI port 0
578KERN: ahci: area = 601, size = 4096, virt = 0xffffffff81d07000, phy = 0x19699000
579KERN: ahci: allocating 4096 bytes for AHCI port 1
580KERN: ahci: area = 602, size = 4096, virt = 0xffffffff81d08000, phy = 0x19698000
581KERN: ahci: allocating 4096 bytes for AHCI port 2
582KERN: ahci: area = 603, size = 4096, virt = 0xffffffff81d09000, phy = 0x19697000
583KERN: ahci: allocating 4096 bytes for AHCI port 3
584KERN: ahci: area = 604, size = 4096, virt = 0xffffffff81d0a000, phy = 0x19696000
585KERN: ahci: allocating 4096 bytes for AHCI port 4
586KERN: ahci: area = 605, size = 4096, virt = 0xffffffff81d0b000, phy = 0x19695000
587KERN: ahci: allocating 4096 bytes for AHCI port 5
588KERN: ahci: area = 606, size = 4096, virt = 0xffffffff81d0c000, phy = 0x19694000
589KERN: ahci: Probe: port 0 link speed 6.0Gb/s
590KERN: ahci: Probe: port 1 link speed 6.0Gb/s
591KERN: ahci: Probe: port 2 link speed 3.0Gb/s
592KERN: ahci: Probe: port 3 link speed 6.0Gb/s
593KERN: ahci: PortReset: port 4 undergoing COMRESET
594KERN: ahci: PortReset: port 5 undergoing COMRESET
595KERN: ahci: cookie = 0xffffffff82290180
596KERN: ahci: ahci_path_inquiry, cookie 0xffffffff82290180
597Last message repeated 1 time
598KERN: ahci: ahci_scan_bus, cookie 0xffffffff82290180
599KERN: ahci: sg_memcpy phyAddr 0x189a5120, size 96
600KERN: ahci: ahci_get_restrictions, cookie 0xffffffff82290180
601KERN: publish device: node 0xffffffff82478e88, path disk/scsi/0/0/0/raw, module drivers/disk/scsi/scsi_disk/device_v1
602KERN: ahci: sg_memcpy phyAddr 0x189a5120, size 96
603KERN: ahci: ahci_get_restrictions, cookie 0xffffffff82290180
604KERN: publish device: node 0xffffffff82478988, path disk/scsi/0/1/0/raw, module drivers/disk/scsi/scsi_disk/device_v1
605KERN: ahci: sg_memcpy phyAddr 0x189a5120, size 96
606KERN: ahci: ahci_get_restrictions, cookie 0xffffffff82290180
607KERN: publish device: node 0xffffffff824785c8, path disk/scsi/0/2/0/raw, module drivers/disk/scsi/scsi_disk/device_v1
608KERN: ahci: sg_memcpy phyAddr 0x189a5120, size 96
609KERN: ahci: ahci_get_restrictions, cookie 0xffffffff82290180
610KERN: publish device: node 0xffffffff82478208, path disk/scsi/0/3/0/raw, module drivers/disk/scsi/scsi_disk/device_v1
611KERN: Highpoint-IDE: supports_device()
612Last message repeated 1 time
613KERN: KDiskDeviceManager::_Scan(/dev/disk/scsi)
614KERN: KDiskDeviceManager::_Scan(/dev/disk/scsi/0)
615KERN: KDiskDeviceManager::_Scan(/dev/disk/scsi/0/0)
616KERN: KDiskDeviceManager::_Scan(/dev/disk/scsi/0/0/0)
617KERN: KDiskDeviceManager::_Scan(/dev/disk/scsi/0/0/0/raw)
618KERN:   found device: /dev/disk/scsi/0/0/0/raw
619KERN: ahci: sg_memcpy phyAddr 0x189a5268, size 8
620KERN: DMAResource@0xffffffff82478de8: low/high 0/100000000, max segment count 32, align 2, boundary 65536, max transfer 130560, max segment size 33554432
621KERN: ahci: sg_memcpy phyAddr 0x189a52a8, size 8
622KERN: ahci: ahci_ioctl, cookie 0xffffffff82290180
623KERN: KDiskDeviceManager::_Scan(/dev/disk/scsi/0/1)
624KERN: KDiskDeviceManager::_Scan(/dev/disk/scsi/0/1/0)
625KERN: KDiskDeviceManager::_Scan(/dev/disk/scsi/0/1/0/raw)
626KERN:   found device: /dev/disk/scsi/0/1/0/raw
627KERN: ahci: sg_memcpy phyAddr 0x189a5268, size 8
628KERN: DMAResource@0xffffffff824788e8: low/high 0/100000000, max segment count 32, align 2, boundary 65536, max transfer 130560, max segment size 33554432
629KERN: slab memory manager: created area 0xffffffffa9801000 (680)
630KERN: ahci: sg_memcpy phyAddr 0x189a52a8, size 8
631KERN: ahci: ahci_ioctl, cookie 0xffffffff82290180
632KERN: KDiskDeviceManager::_Scan(/dev/disk/scsi/0/2)
633KERN: KDiskDeviceManager::_Scan(/dev/disk/scsi/0/2/0)
634KERN: KDiskDeviceManager::_Scan(/dev/disk/scsi/0/2/0/raw)
635KERN:   found device: /dev/disk/scsi/0/2/0/raw
636KERN: ahci: sg_memcpy phyAddr 0x189a5268, size 8
637KERN: DMAResource@0xffffffff82478528: low/high 0/100000000, max segment count 32, align 2, boundary 65536, max transfer 130560, max segment size 33554432
638KERN: ahci: sg_memcpy phyAddr 0x189a52a8, size 8
639KERN: ahci: ahci_ioctl, cookie 0xffffffff82290180
640KERN: KDiskDeviceManager::_Scan(/dev/disk/scsi/0/3)
641KERN: KDiskDeviceManager::_Scan(/dev/disk/scsi/0/3/0)
642KERN: KDiskDeviceManager::_Scan(/dev/disk/scsi/0/3/0/raw)
643KERN:   found device: /dev/disk/scsi/0/3/0/raw
644KERN: ahci: sg_memcpy phyAddr 0x189a5268, size 8
645KERN: DMAResource@0xffffffff82478168: low/high 0/100000000, max segment count 32, align 2, boundary 65536, max transfer 130560, max segment size 33554432
646KERN: ahci: sg_memcpy phyAddr 0x189a52a8, size 8
647KERN: ahci: ahci_ioctl, cookie 0xffffffff82290180
648KERN: KDiskDeviceManager::_ScanPartition(/dev/disk/scsi/0/0/0/raw)
649KERN: intel: ep_std_ops(0x1)
650KERN:   trying: partitioning_systems/intel/extended/v1
651KERN:   returned: -1
652KERN: intel: ep_std_ops(0x2)
653KERN:   trying: partitioning_systems/efi_gpt/v1
654KERN:   returned: -1
655KERN: intel: pm_std_ops(0x1)
656KERN:   trying: partitioning_systems/intel/map/v1
657KERN: intel: pm_identify_partition(0, 0: 0, 250059350016, 512)
658KERN:   returnedKERN: : 0.81
659KERN:   trying: file_systems/devfs/v1
660KERN:   returned: -1
661KERN:   trying: file_systems/packagefs/v1
662KERN:   returned: -1
663KERN:   trying: file_systems/rootfs/v1
664KERN:   returned: -1
665KERN:   trying: file_systems/bfs/v1
666KERN:   returned: -1
667KERN:   scanning with: partitioning_systems/intel/map/v1
668KERN: intel: pm_scan_partition(0, 0: 0, 250059350016, 512)
669KERN: KDiskDeviceManager::_ScanPartition(/dev/disk/scsi/0/0/0/0)
670KERN: intel: ep_std_ops(0x1)
671KERN:   trying: partitioning_systems/intel/extended/v1
672KERN: intel: ep_identify_partition(0, 1048576, 76799000064, 512)
673KERN:   returned: -1
674KERN: intel: ep_std_ops(0x2)
675KERN:   trying: partitioning_systems/efi_gpt/v1
676KERN:   returned: -1
677KERN:   trying: partitioning_systems/intel/map/v1
678KERN: intel: pm_identify_partition(0, 4: 1048576, 76799000064, 512)
679KERN:   returned: -1
680KERN:   trying: file_systems/devfs/v1
681KERN:   returned: -1
682KERN:   trying: file_systems/packagefs/v1
683KERN:   returned: -1
684KERN:   trying: file_systems/rootfs/v1
685KERN:   returned: -1
686KERN:   trying: file_systems/bfs/v1
687KERN:   returned: -1
688KERN: KDiskDeviceManager::_ScanPartition(/dev/disk/scsi/0/0/0/1)
689KERN: intel: ep_std_ops(0x1)
690KERN:   trying: partitioning_systems/intel/extended/v1
691KERN: intel: ep_identify_partition(0, 76800850944, 173258310656, 512)
692KERN:   returned: 0.949
693KERN:   trying: partitioning_systems/efi_gpt/v1
694KERN:   returned: -1
695KERN:   trying: partitioning_systems/intel/map/v1
696KERN: intel: pm_identify_partition(0, 5: 76800850944, 173258310656, 512)
697KERN:   returned: -1
698KERN:   trying: file_systems/devfs/v1
699KERN:   returned: -1
700KERN:   trying: file_systems/packagefs/v1
701KERN:   returned: -1
702KERN:   trying: file_systems/rootfs/v1
703KERN:   returned: -1
704KERN:   trying: file_systems/bfs/v1
705KERN:   returned: -1
706KERN:   scanning with: partitioning_systems/intel/extended/v1
707KERN: intel: ep_scan_partition(0, 76800850944, 173258310656, 512)
708KERN: KDiskDeviceManager::_ScanPartition(/dev/disk/scsi/0/0/0/1_0)
709KERN:   trying: partitioning_systems/intel/extended/v1
710KERN: intel: ep_identify_partition(0, 76800851968, 173258309632, 512)
711KERN:   returned: -1
712KERN:   trying: partitioning_systems/efi_gpt/v1
713KERN:   returned: -1
714KERN:   trying: partitioning_systems/intel/map/v1
715KERN: intel: pm_identify_partition(0, 6: 76800851968, 173258309632, 512)
716KERN:   returned: -1
717KERN:   trying: file_systems/devfs/v1
718KERN:   returned: -1
719KERN:   trying: file_systems/packagefs/v1
720KERN:   returned: -1
721KERN:   trying: file_systems/rootfs/v1
722KERN:   returned: -1
723KERN:   trying: file_systems/bfs/v1
724KERN:   returned: -1
725KERN: KDiskDeviceManager::_ScanPartition(/dev/disk/scsi/0/1/0/raw)
726KERN:   trying: partitioning_systems/intel/extended/v1
727KERN:   returned: -1
728KERN:   trying: partitioning_systems/efi_gpt/v1
729KERN:   returned: -1
730KERN:   trying: partitioning_systems/intel/map/v1
731KERN: intel: pm_identify_partition(0, 1: 0, 250059350016, 512)
732KERN:   returned: 0.81
733KERN:   trying: file_systems/devfs/v1
734KERN:   returned: -1
735KERN:   trying: file_systems/packagefs/v1
736KERN:   returned: -1
737KERN:   trying: file_systems/rootfs/v1
738KERN:   returned: -1
739KERN:   trying: file_systems/bfs/v1
740KERN:   returned: -1
741KERN:   scanning with: partitioning_systems/intel/map/v1
742KERN: intel: pm_scan_partition(0, 1: 0, 250059350016, 512)
743KERN: KDiskDeviceManager::_ScanPartition(/dev/disk/scsi/0/1/0/0)
744KERN:   trying: partitioning_systems/intel/extended/v1
745KERN: intel: ep_identify_partition(0, 1048576, 250058113024, 512)
746KERN:   returned: -1
747KERN:   trying: partitioning_systems/efi_gpt/v1
748KERN:   returned: -1
749KERN:   trying: partitioning_systems/intel/map/v1
750KERN: intel: pm_identify_partition(0, 7: 1048576, 250058113024, 512)
751KERN:   returned: -1
752KERN:   trying: file_systems/devfs/v1
753KERN:   returned: -1
754KERN:   trying: file_systems/packagefs/v1
755KERN:   returned: -1
756KERN:   trying: file_systems/rootfs/v1
757KERN:   returned: -1
758KERN:   trying: file_systems/bfs/v1
759KERN:   returned: -1
760KERN: KDiskDeviceManager::_ScanPartition(/dev/disk/scsi/0/2/0/raw)
761KERN:   trying: partitioning_systems/intel/extended/v1
762KERN:   returned: -1
763KERN:   trying: partitioning_systems/efi_gpt/v1
764KERN: EFI header: EFI PART
765KERN: EFI revision: 10000
766KERN: header size: 92
767KERN: header CRC: a6443fe7
768KERN: absolute block: 1
769KERN: alternate block: 1953525167
770KERN: first usable block: 34
771KERN: last usable block: 1953525134
772KERN: disk GUID: c2fc31ae-b057-4a09-9609-206a1e8b5be2
773KERN: entries block: 2
774KERN: entry size:  128
775KERN: entry count: 128
776KERN: entries CRC: 91b40f92
777KERN: EFI header: EFI PART
778KERN: EFI revision: 10000
779KERN: header size: 92
780KERN: header CRC: 5d98705
781KERN: absolute block: 1953525167
782KERN: alternate block: 1
783KERN: first usable block: 34
784KERN: last usable block: 1953525134
785KERN: disk GUID: c2fc31ae-b057-4a09-9609-206a1e8b5be2
786KERN: entries block: 1953525135
787KERN: entry size:  128
788KERN: entry count: 128
789KERN: entries CRC: 91b40f92
790KERN: [  0] partition type: 0fc63daf-8483-4772-8e79-3d69d8477de4
791KERN:       unique id: 0c6ca3d2-10f4-4219-84e2-d16d558f48db
792KERN:       start block: 2048
793KERN:       end block: 501954559
794KERN:       size: 245093.999 MB
795KERN:       attributes: 0
796KERN:       name:
797KERN: [  2] partition type: 0fc63daf-8483-4772-8e79-3d69d8477de4
798KERN:       unique id: 6da84dd5-b1cb-485c-9d4d-b6ac894c106f
799KERN:       start block: 501954560
800KERN:       end block: 1953523711
801KERN:       size: 708773.999 MB
802KERN:       attributes: 0
803KERN:       name:
804KERN:   returned: 0.959
805KERN:   trying: partitioning_systems/intel/map/v1
806KERN: intel: pm_identify_partition(0, 2: 0, 1000204886016, 512)
807KERN: intel: Found GPT signature, ignoring.
808KERN:   returned: -1
809KERN:   trying: file_systems/devfs/v1
810KERN:   returned: -1
811KERN:   trying: file_systems/packagefs/v1
812KERN:   returned: -1
813KERN:   trying: file_systems/rootfs/v1
814KERN:   returned: -1
815KERN:   trying: file_systems/bfs/v1
816KERN:   returned: -1
817KERN:   scanning with: partitioning_systems/efi_gpt/v1
818KERN: efi_gpt_scan_partition(cookie = 0xffffffff8200dd20)
819KERN: KDiskDeviceManager::_ScanPartition(/dev/disk/scsi/0/2/0/0)
820KERN:   trying: partitioning_systems/intel/extended/v1
821KERN:   returned: -1
822KERN:   trying: partitioning_systems/efi_gpt/v1
823KERN:   returned: -1
824KERN:   trying: partitioning_systems/intel/map/v1
825KERN: intel: pm_identify_partition(0, 8: 1048576, 256999686144, 512)
826KERN:   returned: -1
827KERN:   trying: file_systems/devfs/v1
828KERN:   returned: -1
829KERN:   trying: file_systems/packagefs/v1
830KERN:   returned: -1
831KERN:   trying: file_systems/rootfs/v1
832KERN:   returned: -1
833KERN:   trying: file_systems/bfs/v1
834KERN:   returned: -1
835KERN: KDiskDeviceManager::_ScanPartition(/dev/disk/scsi/0/2/0/1)
836KERN:   trying: partitioning_systems/intel/extended/v1
837KERN: intel: ep_identify_partition(0, 257000734720, 743203405824, 512)
838KERN:   returned: -1
839KERN:   trying: partitioning_systems/efi_gpt/v1
840KERN:   returned: -1
841KERN:   trying: partitioning_systems/intel/map/v1
842KERN: intel: pm_identify_partition(0, 9: 257000734720, 743203405824, 512)
843KERN:   returned: -1
844KERN:   trying: file_systems/devfs/v1
845KERN:   returned: -1
846KERN:   trying: file_systems/packagefs/v1
847KERN:   returned: -1
848KERN:   trying: file_systems/rootfs/v1
849KERN:   returned: -1
850KERN:   trying: file_systems/bfs/v1
851KERN:   returned: -1
852KERN: KDiskDeviceManager::_ScanPartition(/dev/disk/scsi/0/3/0/raw)
853KERN:   trying: partitioning_systems/intel/extended/v1
854KERN:   returned: -1
855KERN:   trying: partitioning_systems/efi_gpt/v1
856KERN: EFI header: EFI PART
857KERN: EFI revision: 10000
858KERN: header size: 92
859KERN: header CRC: 11e2e9a4
860KERN: absolute block: 1
861KERN: alternate block: 976773167
862KERN: first usable block: 34
863KERN: last usable block: 976773134
864KERN: disk GUID: 3ce31739-319c-4d40-b9ee-0dd7132b100c
865KERN: entries block: 2
866KERN: entry size:  128
867KERN: entry count: 128
868KERN: entries CRC: 8d949d25
869KERN: EFI header: EFI PART
870KERN: EFI revision: 10000
871KERN: header size: 92
872KERN: header CRC: aa58eba4
873KERN: absolute block: 976773167
874KERN: alternate block: 1
875KERN: first usable block: 34
876KERN: last usable block: 976773134
877KERN: disk GUID: 3ce31739-319c-4d40-b9ee-0dd7132b100c
878KERN: entries block: 976773135
879KERN: entry size:  128
880KERN: entry count: 128
881KERN: entries CRC: 8d949d25
882KERN: [  0] partition type: 42465331-3ba3-10f1-802a-4861696b7521
883KERN:       unique id: 015ae7c9-6bc8-bc40-81ff-d6e276eb27f4
884KERN:       start block: 40
885KERN:       end block: 209715239
886KERN:       size: 102399.999 MB
887KERN:       attributes: 0
888KERN:       name: System
889KERN: [  1] partition type: 42465331-3ba3-10f1-802a-4861696b7521
890KERN:       unique id: 764af4b4-c9ac-b44e-b18b-10d4aaa61aa7
891KERN:       start block: 209715240
892KERN:       end block: 976771111
893KERN:       size: 374538.999 MB
894KERN:       attributes: 0
895KERN:       name: RoiRed
896KERN:   returned: 0.959
897KERN:   trying: partitioning_systems/intel/map/v1
898KERN: intel: pm_identify_partition(0, 3: 0, 500107862016, 512)
899KERN: intel: Found GPT signature, ignoring.
900KERN:   returned: -1
901KERN:   trying: file_systems/devfs/v1
902KERN:   returned: -1
903KERN:   trying: file_systems/packagefs/v1
904KERN:   returned: -1
905KERN:   trying: file_systems/rootfs/v1
906KERN:   returned: -1
907KERN:   trying: file_systems/bfs/v1
908KERN:   returned: -1
909KERN:   scanning with: partitioning_systems/efi_gpt/v1
910KERN: efi_gpt_scan_partition(cookie = 0xffffffff8200dc40)
911KERN: KDiskDeviceManager::_ScanPartition(/dev/disk/scsi/0/3/0/0)
912KERN:   trying: partitioning_systems/intel/extended/v1
913KERN:   returned: -1
914KERN:   trying: partitioning_systems/efi_gpt/v1
915KERN:   returned: -1
916KERN:   trying: partitioning_systems/intel/map/v1
917KERN: intel: pm_identify_partition(0, 10: 20480, 107374182400, 512)
918KERN:   returned: -1
919KERN:   trying: file_systems/devfs/v1
920KERN:   returned: -1
921KERN:   trying: file_systems/packagefs/v1
922KERN:   rKERN: eturned: -1
923KERN:   trying: file_systems/rootfs/v1
924KERN:   returned: -1
925KERN:   trying: file_systems/bfs/v1
926KERN:   returned: 0.8
927KERN:   scanning with: file_systems/bfs/v1
928KERN: KDiskDeviceManager::_ScanPartition(/dev/disk/scsi/0/3/0/1)
929KERN:   trying: partitioning_systems/intel/extended/v1
930KERN: intel: ep_identify_partition(0, 107374202880, 392732606464, 512)
931KERN:   returned: -1
932KERN:   trying: partitioning_systems/efi_gpt/v1
933KERN:   returned: -1
934KERN:   trying: partitioning_systems/intel/map/v1
935KERN: intel: pm_identify_partition(0, 11: 107374202880, 392732606464, 512)
936KERN:   returned: -1
937KERN:   trying: file_systems/devfs/v1
938KERN:   returned: -1
939KERN:   trying: file_systems/packagefs/v1
940KERN:   returned: -1
941KERN:   trying: file_systems/rootfs/v1
942KERN:   returned: -1
943KERN:   trying: file_systems/bfs/v1
944KERN:   returned: 0.8
945KERN:   scanning with: file_systems/bfs/v1
946KERN: device 0: /dev/disk/scsi/0/0/0/raw
947KERN:   media status:      No error
948KERN:   device flags:      2
949KERN:   offset:            0
950KERN:   size:              250059350016 (238475.179 MB)
951KERN:   content size:      250059350016
952KERN:   block size:        512
953KERN:   child count:       2
954KERN:   index:             -1
955KERN:   status:            0
956KERN:   flags:             5
957KERN:   volume:            -1
958KERN:   disk system:       partitioning_systems/intel/map/v1
959KERN:   name:              WDC WDS250G1B0A-00H9
960KERN:   content name:      <NULL>
961KERN:   type:              <NULL>
962KERN:   content type:      Intel Partition Map
963KERN:   params:            <NULL>
964KERN:   content params:    <NULL>
965KERN:   partition 4: /dev/disk/scsi/0/0/0/0
966KERN:     offset:            1048576
967KERN:     size:              76799000064 (73241.233 MB)
968KERN:     content size:      0
969KERN:     block size:        512
970KERN:     child count:       0
971KERN:     index:             0
972KERN:     status:            2
973KERN:     flags:             0
974KERN:     volume:            -1
975KERN:     disk system:       <NULL>
976KERN:     name:              <NULL>
977KERN:     content name:      <NULL>
978KERN:     type:              Linux native
979KERN:     content type:      <NULL>
980KERN:     params:            type = 131 ; active = 1
981KERN:     content params:    <NULL>
982KERN:   partition 5: /dev/disk/scsi/0/0/0/1
983KERN:     offset:            76800850944
984KERN:     size:              173258310656 (165232 MB)
985KERN:     content size:      173258310656
986KERN:     block size:        512
987KERN:     child count:       1
988KERN:     index:             1
989KERN:     status:            0
990KERN:     flags:             4
991KERN:     volume:            -1
992KERN:     disk system:       partitioning_systems/intel/extended/v1
993KERN:     name:              <NULL>
994KERN:     content name:      <NULL>
995KERN:     type:              Intel Extended Partition
996KERN:     content type:      Intel Extended Partition
997KERN:     params:            type = 5 ; active = 0
998KERN:     content params:    <NULL>
999KERN:     partition 6: /dev/disk/scsi/0/0/0/1_0
1000KERN:       offset:            76800851968
1001KERN:       size:              173258309632 (165232 MB)
1002KERN:       content size:      0
1003KERN:       block size:        512
1004KERN:       child count:       0
1005KERN:       index:             0
1006KERN:       status:            2
1007KERN:       flags:             0
1008KERN:       volume:            -1
1009KERN:       disk system:       <NULL>
1010KERN:       name:              <NULL>
1011KERN:       content name:      <NULL>
1012KERN:       type:              Linux native
1013KERN:       content type:      <NULL>
1014KERN:       params:            active false ;
1015KERN: partition_table_offset 76800850944 ;
1016KERN:
1017KERN:       content params:    <NULL>
1018KERN: device 1: /dev/disk/scsi/0/1/0/raw
1019KERN:   media status:      No error
1020KERN:   device flags:      2
1021KERN:   offset:            0
1022KERN:   size:              250059350016 (238475.179 MB)
1023KERN:   content size:      250059350016
1024KERN:   block size:        512
1025KERN:   child count:       1
1026KERN:   index:             -1
1027KERN:   status:            0
1028KERN:   flags:             5
1029KERN:   volume:            -1
1030KERN:   disk system:       partitioning_systems/intel/map/v1
1031KERN:   name:              Samsung SSD 840 Series
1032KERN:   content name:      <NULL>
1033KERN:   type:              <NULL>
1034KERN:   content type:      Intel Partition Map
1035KERN:   params:            <NULL>
1036KERN:   content params:    <NULL>
1037KERN:   partition 7: /dev/disk/scsi/0/1/0/0
1038KERN:     offset:            1048576
1039KERN:     size:              250058113024 (238474 MB)
1040KERN:     content size:      0
1041KERN:     block size:        512
1042KERN:     child count:       0
1043KERN:     index:             0
1044KERN:     status:            2
1045KERN:     flags:             0
1046KERN:     volume:            -1
1047KERN:     disk system:       <NULL>
1048KERN:     name:              <NULL>
1049KERN:     content name:      <NULL>
1050KERN:     type:              Linux native
1051KERN:     content type:      <NULL>
1052KERN:     params:            type = 131 ; active = 0
1053KERN:     content params:    <NULL>
1054KERN: device 2: /dev/disk/scsi/0/2/0/raw
1055KERN:   media status:      No error
1056KERN:   device flags:      2
1057KERN:   offset:            0
1058KERN:   size:              1000204886016 (953869.71 MB)
1059KERN:   content size:      1000204886016
1060KERN:   block size:        512
1061KERN:   child count:       2
1062KERN:   index:             -1
1063KERN:   status:            0
1064KERN:   flags:             5
1065KERN:   volume:            -1
1066KERN:   disk system:       partitioning_systems/efi_gpt/v1
1067KERN:   name:              WDC WD10JPVT-00A1YT0
1068KERN:   content name:      <NULL>
1069KERN:   type:              <NULL>
1070KERN:   content type:      GUID Partition Map
1071KERN:   params:            <NULL>
1072KERN:   content params:    <NULL>
1073KERN:   partition 8: /dev/disk/scsi/0/2/0/0
1074KERN:     offset:            1048576
1075KERN:     size:              256999686144 (245094 MB)
1076KERN:     content size:      0
1077KERN:     block size:        512
1078KERN:     child count:       0
1079KERN:     index:             0
1080KERN:     status:            2
1081KERN:     flags:             0
1082KERN:     volume:            -1
1083KERN:     disk system:       <NULL>
1084KERN:     name:             
1085KERN:     content name:      <NULL>
1086KERN:     type:              Linux data
1087KERN:     content type:      <NULL>
1088KERN:     params:            <NULL>
1089KERN:     content params:    <NULL>
1090KERN:   partition 9: /dev/disk/scsi/0/2/0/1
1091KERN:     offset:            257000734720
1092KERN:     size:              743203405824 (708774 MB)
1093KERN:     content size:      0
1094KERN:     block size:        512
1095KERN:     child count:       0
1096KERN:     index:             1
1097KERN:     status:            2
1098KERN:     flags:             0
1099KERN:     volume:            -1
1100KERN:     disk system:       <NULL>
1101KERN:     name:             
1102KERN:     content name:      <NULL>
1103KERN:     type:              Linux data
1104KERN:     content type:      <NULL>
1105KERN:     params:            <NULL>
1106KERN:     content params:    <NULL>
1107KERN: device 3: /dev/disk/scsi/0/3/0/raw
1108KERN:   media status:      No error
1109KERN:   device flags:      2
1110KERN:   offset:            0
1111KERN:   size:              500107862016 (476940.23 MB)
1112KERN:   content size:      500107862016
1113KERN:   block size:        512
1114KERN:   child count:       2
1115KERN:   index:             -1
1116KERN:   status:            0
1117KERN:   flags:             5
1118KERN:   volume:            -1
1119KERN:   disk system:       partitioning_systems/efi_gpt/v1
1120KERN:   name:              WDC WDS500G2B0A-00SM
1121KERN:   content name:      <NULL>
1122KERN:   type:              <NULL>
1123KERN:   content type:      GUID Partition Map
1124KERN:   params:            <NULL>
1125KERN:   content params:    <NULL>
1126KERN:   partition 10: /dev/disk/scsi/0/3/0/0
1127KERN:     offset:            20480
1128KERN:     size:              107374182400 (102400 MB)
1129KERN:     content size:      107374182400
1130KERN:     block size:        2048
1131KERN:     child count:       0
1132KERN:     index:             0
1133KERN:     status:            0
1134KERN:     flags:             2
1135KERN:     volume:            -1
1136KERN:     disk system:       file_systems/bfs/v1
1137KERN:     name:              System
1138KERN:     content name:      System
1139KERN:     type:              Be File System
1140KERN:     content type:      Be File System
1141KERN:     params:            <NULL>
1142KERN:     content params:    <NULL>
1143KERN:   partition 11: /dev/disk/scsi/0/3/0/1
1144KERN:     offset:            107374202880
1145KERN:     size:              392732606464 (374539 MB)
1146KERN:     content size:      392732606464
1147KERN:     block size:        2048
1148KERN:     child count:       0
1149KERN:     index:             1
1150KERN:     status:            0
1151KERN:     flags:             2
1152KERN:     volume:            -1
1153KERN:     disk system:       file_systems/bfs/v1
1154KERN:     name:              RoiRed
1155KERN:     content name:      RoiRed
1156KERN:     type:              Be File System
1157KERN:     content type:      Be File System
1158KERN:     params:            <NULL>
1159KERN:     content params:    <NULL>
1160KERN: Identified boot partition by partition offset.
1161KERN: ahci: sg_memcpy phyAddr 0x189a54f8, size 8
1162KERN: ahci: sg_memcpy phyAddr 0x189a5488, size 8
1163KERN: bfs: mounted "System" (root node at 524288, device = /dev/disk/scsi/0/3/0/0)
1164KERN: Mounted boot partition: /dev/disk/scsi/0/3/0/0
1165KERN: packagefs [5386151:    18] Adding packages from "/boot/system/packages"
1166KERN: slab memory manager: created area 0xffffffffaa001000 (752)
1167KERN: slab memory manager: created area 0xffffffffaa801000 (753)
1168KERN: slab memory manager: created area 0xffffffffab001000 (754)
1169KERN: slab memory manager: created area 0xffffffffab801000 (755)
1170KERN: packagefs [6157506:    18] StringPool usage:
1171KERN: packagefs [6157630:    18]   total unique strings:       38796,   56839KERN: 4 bytes, overhead: 892308 bytes
1172KERN: packagefs [6157898:    18]   total strings with dups:   193494,  2183775 bytes
1173KERN: packagefs [6158105:    18]   unshared strings:            1561
1174KERN: packagefs [6158270:    18]   bytes saved:               723073
1175KERN: packagefs [6160008:    18] Adding packages from "/boot/home/config/packages"
1176KERN: packagefs [6160559:    18] Failed to open packages activation file: No such file or directory
1177KERN: packagefs [6160804:    18] Loading packages from activation file failed. Loading all packages in packages directory.
1178KERN: packagefs [6164089:    18] StringPool usage:
1179KERN: packagefs [6164212:    18]   total unique strings:       38796,   568394 bytes, overhead: 892308 bytes
1180KERN: packagefs [6164483:    18]   total strings with dups:   193505,  2183840 bytes
1181KERN: packagefs [6164689:    18]   unshared strings:            1558
1182KERN: packagefs [6164855:    18]   bytes saved:               723138
1183KERN: module: Search for file_cache/launch_speedup/v1 failed.
1184KERN: slab memory manager: created area 0xffffffffac001000 (756)
1185KERN: partitioning system: partitioning_systems/session/v1
1186KERN: KDiskDeviceManager::_AddDiskSystem(partitioning_systems/session/v1)
1187KERN: KDiskDeviceManager::_AddDiskSystem() done: No error
1188KERN: file system: file_systems/btrfs/v1
1189KERN: KDiskDeviceManager::_AddDiskSystem(file_systems/btrfs/v1)
1190KERN: KDiskDeviceManager::_AddDiskSystem() done: No error
1191KERN: file system: file_systems/cdda/v1
1192KERN: KDiskDeviceManager::_AddDiskSystem(file_systems/cdda/v1)
1193KERN: KDiskDeviceManager::_AddDiskSystem() done: No error
1194KERN: file system: file_systems/udf/v1
1195KERN: KDiskDeviceManager::_AddDiskSystem(file_systems/udf/v1)
1196KERN: KDiskDeviceManager::_AddDiskSystem() done: No error
1197KERN: file system: file_systems/nfs/v1
1198KERN: KDiskDeviceManager::_AddDiskSystem(file_systems/nfs/v1)
1199KERN: KDiskDeviceManager::_AddDiskSystem() done: No error
1200KERN: file system: file_systems/bindfs/v1
1201KERN: KDiskDeviceManager::_AddDiskSystem(file_systems/bindfs/v1)
1202KERN: KDiskDeviceManager::_AddDiskSystem() done: No error
1203KERN: file system: file_systems/iso9660/v1
1204KERN: KDiskDeviceManager::_AddDiskSystem(file_systems/iso9660/v1)
1205KERN: KDiskDeviceManager::_AddDiskSystem() done: No error
1206KERN: file system: file_systems/fat/v1
1207KERN: KDiskDeviceManager::_AddDiskSystem(file_systems/fat/v1)
1208KERN: dos_std_ops()
1209Last message repeated 1 time
1210KERN: KDiskDeviceManager::_AddDiskSystem() done: No error
1211KERN: file system: file_systems/ntfs/v1
1212KERN: KDiskDeviceManager::_AddDiskSystem(file_systems/ntfs/v1)
1213KERN: KDiskDeviceManager::_AddDiskSystem() done: No error
1214KERN: file system: file_systems/log_overlay/v1
1215KERN: KDiskDeviceManager::_AddDiskSystem(file_systems/log_overlay/v1)
1216KERN: KDiskDeviceManager::_AddDiskSystem() done: No error
1217KERN: file system: file_systems/exfat/v1
1218KERN: KDiskDeviceManager::_AddDiskSystem(file_systems/exfat/v1)
1219KERN: KDiskDeviceManager::_AddDiskSystem() done: No error
1220KERN: file system: file_systems/write_overlay/v1
1221KERN: KDiskDeviceManager::_AddDiskSystem(file_systems/write_overlay/v1)
1222KERN: KDiskDeviceManager::_AddDiskSystem() done: No error
1223KERN: file system: file_systems/nfs4/v1
1224KERN: KDiskDeviceManager::_AddDiskSystem(file_systems/nfs4/v1)
1225KERN: KDiskDeviceManager::_AddDiskSystem() done: No error
1226KERN: file system: file_systems/attribute_overlay/v1
1227KERN: KDiskDeviceManager::_AddDiskSystem(file_systems/attribute_overlay/v1)
1228KERN: KDiskDeviceManager::_AddDiskSystem() done: No error
1229KERN: file system: file_systems/ext2/v1
1230KERN: KDiskDeviceManager::_AddDiskSystem(file_systems/ext2/v1)
1231KERN: KDiskDeviceManager::_AddDiskSystem() done: No error
1232KERN: KDiskDeviceManager::_ScanPartition(/dev/disk/scsi/0/0/0/0)
1233KERN:   trying: partitioning_systems/session/v1
1234KERN: publish device: node 0xffffffffab775e68, path disk/virtual/ram/control, module drivers/disk/virtual/ram_disk/control/device_v1
1235KERN: loaded driver /boot/system/add-ons/kernel/drivers/dev/null
1236KERN: usb_modeswitch: init_hardware()
1237KERN: usb_modeswitch: init_driver()
1238KERN: usb_modeswitch: trying module bus_managers/usb/v3
1239KERN: usb_modeswitch: publish_devices()
1240KERN: usb_modeswitch: uninit_driver()
1241KERN: loaded driver /boot/system/add-ons/kernel/drivers/dev/usb_modeswitch
1242KERN: con_init: trying module console/frame_buffer/v1
1243KERN: loaded driver /boot/system/add-ons/kernel/drivers/dev/console
1244KERN: loaded driver /boot/system/add-ons/kernel/drivers/dev/dprintf
1245KERN: loaded driver /boot/system/add-ons/kernel/drivers/dev/zero
1246KERN: loaded driver /boot/system/add-ons/kernel/drivers/dev/tty
1247KERN: module: Search for bus_managers/ide/controller/driver_v1 failed.
1248KERN: loading dependent module bus_managers/ide/controller/driver_v1 of busses/ata/silicon_image_3112/driver_v1 failed!
1249KERN: module: Search for bus_managers/ide/controller/driver_v1 failed.
1250KERN: loading dependent module bus_managers/ide/controller/driver_v1 of busses/ata/legacy_sata/driver_v1 failed!
1251KERN: module: Search for bus_managers/ide/controller/driver_v1 failed.
1252KERN: loading dependent module bus_managers/ide/controller/driver_v1 of busses/ata/highpoint_ide_pci/driver_v1 failed!
1253KERN: module: Search for bus_managers/ide/controller/driver_v1 failed.
1254KERN: loading dependent module bus_managers/ide/controller/driver_v1 of busses/ata/generic_ide_pci/driver_v1 failed!
1255KERN: module: Search for bus_managers/ide/controller/driver_v1 failed.
1256KERN: loading dependent module bus_managers/ide/controller/driver_v1 of generic/ata_adapter/v1 failed!
1257KERN: loading dependent module generic/ata_adapter/v1 of busses/ata/it8211/driver_v1 failed!
1258KERN: module: Search for bus_managers/ide/controller/driver_v1 failed.
1259KERN: loading dependent module bus_managers/ide/controller/driver_v1 of busses/ata/silicon_image_3112/driver_v1 failed!
1260KERN: module: Search for bus_managers/ide/controller/driver_v1 failed.
1261KERN: loading dependent module bus_managers/ide/controller/driver_v1 of busses/ata/legacy_sata/driver_v1 failed!
1262KERN: module: Search for bus_managers/ide/controller/driver_v1 failed.
1263KERN: loading dependent module bus_managers/ide/controller/driver_v1 of busses/ata/highpoint_ide_pci/driver_v1 failed!
1264KERN: module: Search for bus_managers/ide/controller/driver_v1 failed.
1265KERN: loading dependent module bus_managers/ide/controller/driver_v1 of busses/ata/generic_ide_pci/driver_v1 failed!
1266KERN: module: Search for bus_managers/ide/controller/driver_v1 failed.
1267KERN: loading dependent module bus_managers/ide/controller/driver_v1 of generic/ata_adapter/v1 failed!
1268KERN: loading dependent module generic/ata_adapter/v1 of busses/ata/it8211/driver_v1 failed!
1269KERN: module: Search for bus_managers/ide/controller/driver_v1 failed.
1270KERN: loading dependent module bus_managers/ide/controller/driver_v1 of busses/ata/silicon_image_3112/driver_v1 failed!
1271KERN: module: Search for bus_managers/ide/controller/driver_v1 failed.
1272KERN: loading dependent module bus_managers/ide/controller/driver_v1 of busses/ata/legacy_sata/driver_v1 failed!
1273KERN: module: Search for bus_managers/ide/controller/driver_v1 failed.
1274KERN: loading dependent module bus_managers/ide/controller/driver_v1 of busses/ata/highpoint_ide_pci/driver_v1 failed!
1275KERN: module: Search for bus_managers/ide/controller/driver_v1 failed.
1276KERN: loading dependent module bus_managers/ide/controller/driver_v1 of busses/ata/generic_ide_pci/driver_v1 failed!
1277KERN: module: Search for bus_managers/ide/controller/driver_v1 failed.
1278KERN: loading dependent module bus_managers/ide/controller/driver_v1 of generic/ata_adapter/v1 failed!
1279KERN: loading dependent module generic/ata_adapter/v1 of busses/ata/it8211/driver_v1 failed!
1280KERN:   returned: -1
1281KERN:   trying: file_systems/btrfs/v1
1282KERN: [34mbtrfs:[0m invalid superblock!
1283KERN:   returned: -1
1284KERN:   trying: file_systems/cdda/v1
1285KERN: raw_command:
1286KERN: ahci: AHCIPort::ScsiExecuteRequest port 0 unsupported request opcode 0x43
1287KERN:   returned: -1
1288KERN:   trying: file_systems/udf/v1
1289KERN: udf_recognize: Invalid sequence. status = -1
1290KERN:   returned: -1
1291KERN:   trying: file_systems/nfs/v1
1292KERN:   returned: -1
1293KERN:   trying: file_systems/bindfs/v1
1294KERN:   returned: -1
1295KERN:   trying: file_systems/iso9660/v1
1296KERN: identify(4, 0xffffffffab7498c0)
1297KERN:   returned: -1
1298KERN: dos_std_ops()
1299KERN:   trying: file_systems/fat/v1
1300KERN:   returned: -1
1301KERN: dos_std_ops()
1302KERN:   trying: file_systems/ntfs/v1
1303KERN: fs_identify_partition: boot signature NTFS doesn't match
1304KERN:   returned: -1
1305KERN:   trying: file_systems/log_overlay/v1
1306KERN:   returned: -1
1307KERN:   trying: file_systems/exfat/v1
1308KERN: [34mexfat:[0m invalid superblock!
1309KERN:   returned: -1
1310KERN:   trying: file_systems/write_overlay/v1
1311KERN:   returned: -1
1312KERN:   trying: file_systems/nfs4/v1
1313KERN:   returned: -1
1314KERN:   trying: file_systems/attribute_overlay/v1
1315KERN:   returned: -1
1316KERN:   trying: file_systems/ext2/v1
1317KERN:   returned: 0.8
1318KERN:   scanning with: file_systems/ext2/v1
1319KERN: KDiskDeviceManager::_ScanPartition(/dev/disk/scsi/0/0/0/1_0)
1320KERN:   trying: partitioning_systems/session/v1
1321KERN:   returned: -1
1322KERN:   trying: file_sysKERN: tems/btrfs/v1
1323KERN: [34mbtrfs:[0m invalid superblock!
1324KERN:   returned: -1
1325KERN:   trying: file_systems/cdda/v1
1326KERN: raw_command:
1327KERN: ahci: AHCIPort::ScsiExecuteRequest port 0 unsupported request opcode 0x43
1328KERN:   returned: -1
1329KERN:   trying: file_systems/udf/v1
1330KERN: read_pos(pos:39322036215808, len:512) failed with: 0xffffffffffffffff
1331KERN: udf_recognize: Invalid sequence. status = -1
1332KERN:   returned: -1
1333KERN:   trying: file_systems/nfs/v1
1334KERN:   returned: -1
1335KERN:   trying: file_systems/bindfs/v1
1336KERN:   returned: -1
1337KERN:   trying: file_systems/iso9660/v1
1338KERN: identify(4, 0xffffffffab7498a8)
1339KERN:   returned: -1
1340KERN: dos_std_ops()
1341KERN:   trying: file_systems/fat/v1
1342KERN:   returned: -1
1343KERN: dos_std_ops()
1344KERN:   trying: file_systems/ntfs/v1
1345KERN: fs_identify_partition: boot signature NTFS doesn't match
1346KERN:   returned: -1
1347KERN:   trying: file_systems/log_overlay/v1
1348KERN:   returned: -1
1349KERN:   trying: file_systems/exfat/v1
1350KERN: [34mexfat:[0m invalid superblock!
1351KERN:   returned: -1
1352KERN:   trying: file_systems/write_overlay/v1
1353KERN:   returned: -1
1354KERN:   trying: file_systems/nfs4/v1
1355KERN:   returned: -1
1356KERN:   trying: file_systems/attribute_overlay/v1
1357KERN:   returned: -1
1358KERN:   trying: file_systems/ext2/v1
1359KERN:   returned: 0.8
1360KERN:   scanning with: file_systems/ext2/v1
1361KERN: KDiskDeviceManager::_ScanPartition(/dev/disk/scsi/0/1/0/0)
1362KERN:   trying: partitioning_systems/session/v1
1363KERN:   returned: -1
1364KERN:   trying: file_systems/btrfs/v1
1365KERN: [34mbtrfs:[0m invalid superblock!
1366KERN:   returned: -1
1367KERN:   trying: file_systems/cdda/v1
1368KERN: raw_command:
1369KERN: ahci: AHCIPort::ScsiExecuteRequest port 1 unsupported request opcode 0x43
1370KERN:   returned: -1
1371KERN:   trying: file_systems/udf/v1
1372KERN: udf_recognize: Invalid sequence. status = -1
1373KERN:   returned: -1
1374KERN:   trying: file_systems/nfs/v1
1375KERN:   returned: -1
1376KERN:   trying: file_systems/bindfs/v1
1377KERN:   returned: -1
1378KERN:   trying: file_systems/iso9660/v1
1379KERN: identify(4, 0xffffffffab7498c0)
1380KERN:   returned: -1
1381KERN: dos_std_ops()
1382KERN:   trying: file_systems/fat/v1
1383KERN:   returned: -1
1384KERN: dos_std_ops()
1385KERN:   trying: file_systems/ntfs/v1
1386KERN: fs_identify_partition: boot signature NTFS doesn't match
1387KERN:   returned: -1
1388KERN:   trying: file_systems/log_overlay/v1
1389KERN:   returned: -1
1390KERN:   trying: file_systems/exfat/v1
1391KERN: [34mexfat:[0m invalid superblock!
1392KERN:   returned: -1
1393KERN:   trying: file_systems/write_overlay/v1
1394KERN:   returned: -1
1395KERN:   trying: file_systems/nfs4/v1
1396KERN:   returned: -1
1397KERN:   trying: file_systems/attribute_overlay/v1
1398KERN:   returned: -1
1399KERN:   trying: file_systems/ext2/v1
1400KERN:   returned: 0.8
1401KERN:   scanning with: file_systems/ext2/v1
1402KERN: KDiskDeviceManager::_ScanPartition(/dev/disk/scsi/0/2/0/0)
1403KERN:   trying: partitioning_systems/session/v1
1404KERN:   returned: -1
1405KERN:   trying: file_systems/btrfs/v1
1406KERN: [34mbtrfs:[0m invalid superblock!
1407KERN:   returned: -1
1408KERN:   trying: file_systems/cdda/v1
1409KERN: raw_command:
1410KERN: ahci: AHCIPort::ScsiExecuteRequest port 2 unsupported request opcode 0x43
1411KERN:   returned: -1
1412KERN:   trying: file_systems/udf/v1
1413KERN: udf_recognize: Invalid sequence. status = -1
1414KERN:   returned: -1
1415KERN:   trying: file_systems/nfs/v1
1416KERN:   returned: -1
1417KERN:   trying: file_systems/bindfs/v1
1418KERN:   returned: -1
1419KERN:   trying: file_systems/iso9660/v1
1420KERN: identify(4, 0xffffffffab7498a8)
1421KERN:   returned: -1
1422KERN: dos_std_ops()
1423KERN:   trying: file_systems/fat/v1
1424KERN:   returned: -1
1425KERN: dos_std_ops()
1426KERN:   trying: file_systems/ntfs/v1
1427KERN: fs_identify_partition: boot signature NTFS doesn't match
1428KERN:   returned: -1
1429KERN:   trying: file_systems/log_overlay/v1
1430KERN:   returned: -1
1431KERN:   trying: file_systems/exfat/v1
1432KERN: [34mexfat:[0m invalid superblock!
1433KERN:   returned: -1
1434KERN:   trying: file_systems/write_overlay/v1
1435KERN:   returned: -1
1436KERN:   trying: file_systems/nfs4/v1
1437KERN:   returned: -1
1438KERN:   trying: file_systems/attribute_overlay/v1
1439KERN:   returned: -1
1440KERN:   trying: file_systems/ext2/v1
1441KERN: [34mext2:[0m ext2: incompatible features not supported: 80 (extents 40)
1442KERN:   returned: -1
1443KERN: KDiskDeviceManager::_ScanPartition(/dev/disk/scsi/0/2/0/1)
1444KERN:   trying: partitioning_systems/session/v1
1445KERN:   returned: -1
1446KERN:   trying: file_systems/btrfs/v1
1447KERN: [34mbtrfs:[0m invalid superblock!
1448KERN:   returned: -1
1449KERN:   trying: file_systems/cdda/v1
1450KERN: raw_command:
1451KERN: ahci: AHCIPort::ScsiExecuteRequest port 2 unsupported request opcode 0x43
1452KERN:   returned: -1
1453KERN:   trying: file_systems/udf/v1
1454KERN: read_pos(pos:131584376184832, len:512) failed with: 0xffffffffffffffff
1455KERN: udf_recognize: Invalid sequence. status = -1
1456KERN:   returned: -1
1457KERN:   trying: file_systems/nfs/v1
1458KERN:   returned: -1
1459KERN:   trying: file_systems/bindfs/v1
1460KERN:   returned: -1
1461KERN:   trying: file_systems/iso9660/v1
1462KERN: identify(4, 0xffffffffab7498c0)
1463KERN:   returned: -1
1464KERN: dos_std_ops()
1465KERN:   trying: file_systems/fat/v1
1466KERN:   returned: -1
1467KERN: dos_std_ops()
1468KERN:   trying: file_systems/ntfs/v1
1469KERN: fs_identify_partition: boot signature NTFS doesn't match
1470KERN:   returned: -1
1471KERN:   trying: file_systems/log_overlay/v1
1472KERN:   returned: -1
1473KERN:   trying: file_systems/exfat/v1
1474KERN: [34mexfat:[0m invalid superblock!
1475KERN:   returned: -1
1476KERN:   trying: file_systems/write_overlay/v1
1477KERN:   returned: -1
1478KERN:   trying: file_systems/nfs4/v1
1479KERN:   returned: -1
1480KERN:   trying: file_systems/attribute_overlay/v1
1481KERN:   returned: -1
1482KERN:   trying: file_systems/ext2/v1
1483KERN:   returned: 0.8
1484KERN:   scanning with: file_systems/ext2/v1
1485KERN: KDiskDeviceManager::_ScanPartition(/dev/disk/scsi/0/3/0/1)
1486KERN:   trying: partitioning_systems/session/v1
1487KERN:   returned: -1
1488KERN:   trying: file_systems/btrfs/v1
1489KERN: [34mbtrfs:[0m invalid superblock!
1490KERN:   returned: -1
1491KERN:   trying: file_systems/cdda/v1
1492KERN: raw_command:
1493KERN: ahci: AHCIPort::ScsiExecuteRequest port 3 unsupported request opcode 0x43
1494KERN:   returned: -1
1495KERN:   trying: file_systems/udf/v1
1496KERN: read_pos(pos:219902367531008, len:2048) failed with: 0xffffffffffffffff
1497KERN: udf_recognize: Invalid sequence. status = -1
1498KERN:   returned: -1
1499KERN:   trying: file_systems/nfs/v1
1500KERN:   returned: -1
1501KERN:   trying: file_systems/bindfs/v1
1502KERN:   returned: -1
1503KERN:   trying: file_systems/iso9660/v1
1504KERN: identify(4, 0xffffffffab7498a8)
1505KERN:   returned: -1
1506KERN: dos_std_ops()
1507KERN:   trying: file_systems/fat/v1
1508KERN:   returned: -1
1509KERN: dos_std_ops()
1510KERN:   trying: file_systems/ntfs/v1
1511KERN: fs_identify_partition: boot signature NTFS doesn't match
1512KERN:   returned: -1
1513KERN:   trying: file_systems/log_overlay/v1
1514KERN:   returned: -1
1515KERN:   trying: file_systems/exfat/v1
1516KERN: [34mexfat:[0m invalid superblock!
1517KERN:   returned: -1
1518KERN:   trying: file_systems/write_overlay/v1
1519KERN:   returned: -1
1520KERN:   trying: file_systems/nfs4/v1
1521KERN:   returned: -1
1522KERN:   trying: file_systems/attribute_overlay/v1
1523KERN:   returned: -1
1524KERN:   trying: file_systems/ext2/v1
1525KERN: [34mext2:[0m invalid superblock!
1526KERN:   returned: -1
1527KERN: KDiskDeviceManager::_Scan(/dev/disk)
1528KERN: KDiskDeviceManager::_Scan(/dev/disk/scsi)
1529KERN: KDiskDeviceManager::_Scan(/dev/disk/scsi/0)
1530KERN: KDiskDeviceManager::_Scan(/dev/disk/scsi/0/0)
1531KERN: KDiskDeviceManager::_Scan(/dev/disk/scsi/0/0/0)
1532KERN: KDiskDeviceManager::_Scan(/dev/disk/scsi/0/0/0/0)
1533KERN: KDiskDeviceManager::_Scan(/dev/disk/scsi/0/0/0/1)
1534KERN: KDiskDeviceManager::_Scan(/dev/disk/scsi/0/0/0/1_0)
1535KERN: KDiskDeviceManager::_Scan(/dev/disk/scsi/0/0/0/raw)
1536KERN: KDiskDeviceManager::_Scan(/dev/disk/scsi/0/1)
1537KERN: KDiskDeviceManager::_Scan(/dev/disk/scsi/0/1/0)
1538KERN: KDiskDeviceManager::_Scan(/dev/disk/scsi/0/1/0/0)
1539KERN: KDiskDeviceManager::_Scan(/dev/disk/scsi/0/1/0/raw)
1540KERN: KDiskDeviceManager::_Scan(/dev/disk/scsi/0/2)
1541KERN: KDiskDeviceManager::_Scan(/dev/disk/scsi/0/2/0)
1542KERN: KDiskDeviceManager::_Scan(/dev/disk/scsi/0/2/0/0)
1543KERN: KDiskDeviceManager::_Scan(/dev/disk/scsi/0/2/0/1)
1544KERN: KDiskDeviceManager::_Scan(/dev/disk/scsi/0/2/0/raw)
1545KERN: KDiskDeviceManager::_Scan(/dev/disk/scsi/0/3)
1546KERN: KDiskDeviceManager::_Scan(/dev/disk/scsi/0/3/0)
1547KERN: KDiskDeviceManager::_Scan(/dev/disk/scsi/0/3/0/0)
1548KERN: KDiskDeviceManager::_Scan(/dev/disk/scsi/0/3/0/1)
1549KERN: KDiskDeviceManager::_Scan(/dev/disk/scsi/0/3/0/raw)
1550KERN: KDiskDeviceManager::_Scan(/dev/disk/usb)
1551KERN: loaded driver /boot/system/add-ons/kernel/drivers/dev/disk/usb/usb_disk
1552KERN: loaded driver /boot/system/add-ons/kernel/drivers/dev/disk/usb/usb_floppy
1553KERN: KDiskDeviceManager::_Scan(/dev/disk/virtual)
1554KERN: KDiskDeviceManager::_Scan(/dev/disk/virtual/ram)
1555KERN: KDiskDeviceManager::_Scan(/dev/disk/virtual/ram/control)
1556KERN: KDiskDeviceManager::_ScanPartition(/dev/disk/scsi/0/0/0/0)
1557KERN:   trying: partitioning_systems/intel/extended/v1
1558KERN: intel: ep_identify_partition(4, 1048576, 76799000064, 4096)
1559KERN:   returned: -1
1560KERN:   trying: partitioning_systems/efi_gpt/v1
1561KERN:   returned: -1
1562KERN:   trying: partitioning_systems/intel/map/v1
1563KERN: intel: pm_identify_partition(4, 4: 1048576, 76799000064, 4096)
1564KERN:   returned: -1
1565KERN:   trying: file_systems/devfs/v1
1566KERN:   returned: -1
1567KERN:   trying: file_systems/packagefs/v1
1568KERN:   returned: -1
1569KERN:   trying: file_systems/rootfs/v1
1570KERN:   returned: -1
1571KERN:   trying: file_systems/bfs/v1
1572KERN:   returned: -1
1573KERN:   trying: partitioning_systems/session/v1
1574KERN:   returned: -1
1575KERN:   trying: file_systems/btrfs/v1
1576KERN: [34mbtrfs:[0m invalid superblock!
1577KERN:   returned: -1
1578KERN:   trying: file_systems/cdda/v1
1579KERN: raw_command:
1580KERN: ahci: AHCIPort::ScsiExecuteRequest port 0 unsupported request opcode 0xKERN: 43
1581KERN:   returned: -1
1582KERN:   trying: file_systems/udf/v1
1583KERN: udf_recognize: Invalid sequence. status = -1
1584KERN:   returned: -1
1585KERN:   trying: file_systems/nfs/v1
1586KERN:   returned: -1
1587KERN:   trying: file_systems/bindfs/v1
1588KERN:   returned: -1
1589KERN:   trying: file_systems/iso9660/v1
1590KERN: identify(4, 0xffffffffab749770)
1591KERN:   returned: -1
1592KERN: dos_std_ops()
1593KERN:   trying: file_systems/fat/v1
1594KERN:   returned: -1
1595KERN: dos_std_ops()
1596KERN:   trying: file_systems/ntfs/v1
1597KERN: fs_identify_partition: boot signature NTFS doesn't match
1598KERN:   returned: -1
1599KERN:   trying: file_systems/log_overlay/v1
1600KERN:   returned: -1
1601KERN:   trying: file_systems/exfat/v1
1602KERN: [34mexfat:[0m invalid superblock!
1603KERN:   returned: -1
1604KERN:   trying: file_systems/write_overlay/v1
1605KERN:   returned: -1
1606KERN:   trying: file_systems/nfs4/v1
1607KERN:   returned: -1
1608KERN:   trying: file_systems/attribute_overlay/v1
1609KERN:   returned: -1
1610KERN:   trying: file_systems/ext2/v1
1611KERN:   returned: 0.8
1612KERN: KDiskDeviceManager::_ScanPartition(/dev/disk/scsi/0/0/0/1_0)
1613KERN:   trying: partitioning_systems/intel/extended/v1
1614KERN: intel: ep_identify_partition(4, 76800851968, 173258309632, 4096)
1615KERN:   returned: -1
1616KERN:   trying: partitioning_systems/efi_gpt/v1
1617KERN:   returned: -1
1618KERN:   trying: partitioning_systems/intel/map/v1
1619KERN: intel: pm_identify_partition(4, 6: 76800851968, 173258309632, 4096)
1620KERN:   returned: -1
1621KERN:   trying: file_systems/devfs/v1
1622KERN:   returned: -1
1623KERN:   trying: file_systems/packagefs/v1
1624KERN:   returned: -1
1625KERN:   trying: file_systems/rootfs/v1
1626KERN:   returned: -1
1627KERN:   trying: file_systems/bfs/v1
1628KERN:   returned: -1
1629KERN:   trying: partitioning_systems/session/v1
1630KERN:   returned: -1
1631KERN:   trying: file_systems/btrfs/v1
1632KERN: [34mbtrfs:[0m invalid superblock!
1633KERN:   returned: -1
1634KERN:   trying: file_systems/cdda/v1
1635KERN: raw_command:
1636KERN: ahci: AHCIPort::ScsiExecuteRequest port 0 unsupported request opcode 0x43
1637KERN:   returned: -1
1638KERN:   trying: file_systems/udf/v1
1639KERN: read_pos(pos:314576289726464, len:4096) failed with: 0xffffffffffffffff
1640KERN: udf_recognize: Invalid sequence. status = -1
1641KERN:   returned: -1
1642KERN:   trying: file_systems/nfs/v1
1643KERN:   returned: -1
1644KERN:   trying: file_systems/bindfs/v1
1645KERN:   returned: -1
1646KERN:   trying: file_systems/iso9660/v1
1647KERN: identify(4, 0xffffffffab7498c0)
1648KERN:   returned: -1
1649KERN: dos_std_ops()
1650KERN:   trying: file_systems/fat/v1
1651KERN:   returned: -1
1652KERN: dos_std_ops()
1653KERN:   trying: file_systems/ntfs/v1
1654KERN: fs_identify_partition: boot signature NTFS doesn't match
1655KERN:   returned: -1
1656KERN:   trying: file_systems/log_overlay/v1
1657KERN:   returned: -1
1658KERN:   trying: file_systems/exfat/v1
1659KERN: [34mexfat:[0m invalid superblock!
1660KERN:   returned: -1
1661KERN:   trying: file_systems/write_overlay/v1
1662KERN:   returned: -1
1663KERN:   trying: file_systems/nfs4/v1
1664KERN:   returned: -1
1665KERN:   trying: file_systems/attribute_overlay/v1
1666KERN:   returned: -1
1667KERN:   trying: file_systems/ext2/v1
1668KERN:   returned: 0.8
1669KERN: KDiskDeviceManager::_ScanPartition(/dev/disk/scsi/0/1/0/0)
1670KERN:   trying: partitioning_systems/intel/extended/v1
1671KERN: intel: ep_identify_partition(4, 1048576, 250058113024, 4096)
1672KERN:   returned: -1
1673KERN:   trying: partitioning_systems/efi_gpt/v1
1674KERN:   returned: -1
1675KERN:   trying: partitioning_systems/intel/map/v1
1676KERN: intel: pm_identify_partition(4, 7: 1048576, 250058113024, 4096)
1677KERN:   returned: -1
1678KERN:   trying: file_systems/devfs/v1
1679KERN:   returned: -1
1680KERN:   trying: file_systems/packagefs/v1
1681KERN:   returned: -1
1682KERN:   trying: file_systems/rootfs/v1
1683KERN:   returned: -1
1684KERN:   trying: file_systems/bfs/v1
1685KERN:   returned: -1
1686KERN:   trying: partitioning_systems/session/v1
1687KERN:   returned: -1
1688KERN:   trying: file_systems/btrfs/v1
1689KERN: [34mbtrfs:[0m invalid superblock!
1690KERN:   returned: -1
1691KERN:   trying: file_systems/cdda/v1
1692KERN: raw_command:
1693KERN: ahci: AHCIPort::ScsiExecuteRequest port 1 unsupported request opcode 0x43
1694KERN:   returned: -1
1695KERN:   trying: file_systems/udf/v1
1696KERN: udf_recognize: Invalid sequence. status = -1
1697KERN:   returned: -1
1698KERN:   trying: file_systems/nfs/v1
1699KERN:   returned: -1
1700KERN:   trying: file_systems/bindfs/v1
1701KERN:   returned: -1
1702KERN:   trying: file_systems/iso9660/v1
1703KERN: identify(4, 0xffffffffab749770)
1704KERN:   returned: -1
1705KERN: dos_std_ops()
1706KERN:   trying: file_systems/fat/v1
1707KERN:   returned: -1
1708KERN: dos_std_ops()
1709KERN:   trying: file_systems/ntfs/v1
1710KERN: fs_identify_partition: boot signature NTFS doesn't match
1711KERN:   returned: -1
1712KERN:   trying: file_systems/log_overlay/v1
1713KERN:   returned: -1
1714KERN:   trying: file_systems/exfat/v1
1715KERN: [34mexfat:[0m invalid superblock!
1716KERN:   returned: -1
1717KERN:   trying: file_systems/write_overlay/v1
1718KERN:   returned: -1
1719KERN:   trying: file_systems/nfs4/v1
1720KERN:   returned: -1
1721KERN:   trying: file_systems/attribute_overlay/v1
1722KERN:   returned: -1
1723KERN:   trying: file_systems/ext2/v1
1724KERN:   returned: 0.8
1725KERN: KDiskDeviceManager::_ScanPartition(/dev/disk/scsi/0/2/0/0)
1726KERN:   trying: partitioning_systems/intel/extended/v1
1727KERN:   returned: -1
1728KERN:   trying: partitioning_systems/efi_gpt/v1
1729KERN:   returned: -1
1730KERN:   trying: partitioning_systems/intel/map/v1
1731KERN: intel: pm_identify_partition(4, 8: 1048576, 256999686144, 512)
1732KERN:   returned: -1
1733KERN:   trying: file_systems/devfs/v1
1734KERN:   returned: -1
1735KERN:   trying: file_systems/packagefs/v1
1736KERN:   returned: -1
1737KERN:   trying: file_systems/rootfs/v1
1738KERN:   returned: -1
1739KERN:   trying: file_systems/bfs/v1
1740KERN:   returned: -1
1741KERN:   trying: partitioning_systems/session/v1
1742KERN:   returned: -1
1743KERN:   trying: file_systems/btrfs/v1
1744KERN: [34mbtrfs:[0m invalid superblock!
1745KERN:   returned: -1
1746KERN:   trying: file_systems/cdda/v1
1747KERN: raw_command:
1748KERN: ahci: AHCIPort::ScsiExecuteRequest port 2 unsupported request opcode 0x43
1749KERN:   returned: -1
1750KERN:   trying: file_systems/udf/v1
1751KERN: udf_recognize: Invalid sequence. status = -1
1752KERN:   returned: -1
1753KERN:   trying: file_systems/nfs/v1
1754KERN:   returned: -1
1755KERN:   trying: file_systems/bindfs/v1
1756KERN:   returned: -1
1757KERN:   trying: file_systems/iso9660/v1
1758KERN: identify(4, 0xffffffffab7498c0)
1759KERN:   returned: -1
1760KERN: dos_std_ops()
1761KERN:   trying: file_systems/fat/v1
1762KERN:   returned: -1
1763KERN: dos_std_ops()
1764KERN:   trying: file_systems/ntfs/v1
1765KERN: fs_identify_partition: boot signature NTFS doesn't match
1766KERN:   returned: -1
1767KERN:   trying: file_systems/log_overlay/v1
1768KERN:   returned: -1
1769KERN:   trying: file_systems/exfat/v1
1770KERN: [34mexfat:[0m invalid superblock!
1771KERN:   returned: -1
1772KERN:   trying: file_systems/write_overlay/v1
1773KERN:   returned: -1
1774KERN:   trying: file_systems/nfs4/v1
1775KERN:   returned: -1
1776KERN:   trying: file_systems/attribute_overlay/v1
1777KERN:   returned: -1
1778KERN:   trying: file_systems/ext2/v1
1779KERN: [34mext2:[0m ext2: incompatible features not supported: 80 (extents 40)
1780KERN:   returned: -1
1781KERN: KDiskDeviceManager::_ScanPartition(/dev/disk/scsi/0/2/0/1)
1782KERN:   trying: partitioning_systems/intel/extended/v1
1783KERN: intel: ep_identify_partition(4, 257000734720, 743203405824, 4096)
1784KERN:   returned: -1
1785KERN:   trying: partitioning_systems/efi_gpt/v1
1786KERN:   returned: -1
1787KERN:   trying: partitioning_systems/intel/map/v1
1788KERN: intel: pm_identify_partition(4, 9: 257000734720, 743203405824, 4096)
1789KERN:   returned: -1
1790KERN:   trying: file_systems/devfs/v1
1791KERN:   returned: -1
1792KERN:   trying: file_systems/packagefs/v1
1793KERN:   returned: -1
1794KERN:   trying: file_systems/rootfs/v1
1795KERN:   returned: -1
1796KERN:   trying: file_systems/bfs/v1
1797KERN:   returned: -1
1798KERN:   trying: partitioning_systems/session/v1
1799KERN:   returned: -1
1800KERN:   trying: file_systems/btrfs/v1
1801KERN: [34mbtrfs:[0m invalid superblock!
1802KERN:   returned: -1
1803KERN:   trying: file_systems/cdda/v1
1804KERN: raw_command:
1805KERN: ahci: AHCIPort::ScsiExecuteRequest port 2 unsupported request opcode 0x43
1806KERN:   returned: -1
1807KERN:   trying: file_systems/udf/v1
1808KERN: read_pos(pos:1052675009478656, len:4096) failed with: 0xffffffffffffffff
1809KERN: udf_recognize: Invalid sequence. status = -1
1810KERN:   returned: -1
1811KERN:   trying: file_systems/nfs/v1
1812KERN:   returned: -1
1813KERN:   trying: file_systems/bindfs/v1
1814KERN:   returned: -1
1815KERN:   trying: file_systems/iso9660/v1
1816KERN: identify(4, 0xffffffffab749770)
1817KERN:   returned: -1
1818KERN: dos_std_ops()
1819KERN:   trying: file_systems/fat/v1
1820KERN:   returned: -1
1821KERN: dos_std_ops()
1822KERN:   trying: file_systems/ntfs/v1
1823KERN: fs_identify_partition: boot signature NTFS doesn't match
1824KERN:   returned: -1
1825KERN:   trying: file_systems/log_overlay/v1
1826KERN:   returned: -1
1827KERN:   trying: file_systems/exfat/v1
1828KERN: [34mexfat:[0m invalid superblock!
1829KERN:   returned: -1
1830KERN:   trying: file_systems/write_overlay/v1
1831KERN:   returned: -1
1832KERN:   trying: file_systems/nfs4/v1
1833KERN:   returned: -1
1834KERN:   trying: file_systems/attribute_overlay/v1
1835KERN:   returned: -1
1836KERN:   trying: file_systems/ext2/v1
1837KERN:   returned: 0.8
1838KERN: KDiskDeviceManager::_ScanPartition(/dev/disk/scsi/0/3/0/1)
1839KERN:   trying: partitioning_systems/intel/extended/v1
1840KERN: intel: ep_identify_partition(4, 107374202880, 392732606464, 2048)
1841KERN:   returned: -1
1842KERN:   trying: partitioning_systems/efi_gpt/v1
1843KERN:   returned: -1
1844KERN:   trying: partitioning_systems/intel/map/v1
1845KERN: intel: pm_identify_partition(4, 11: 107374202880, 392732606464, 2048)
1846KERN:   returned: -1
1847KERN:   trying: file_systems/devfs/v1
1848KERN:   returned: -1
1849KERN:   trying: file_systems/packagefs/v1
1850KERN:   returned: -1
1851KERN:   trying: file_systems/rootfs/v1
1852KERN:   returned: -1
1853KERN:   trying: file_systems/bfs/v1
1854KERN:   returned: 0.8
1855KERN:   trying: partitioning_systems/session/v1
1856KERN:   returned: -1
1857KERN:   trying: file_systems/btrfs/v1
1858KERN: [34mbtrfs:[0m invalid superblock!
1859KERN:   returned: -1
1860KERN:   trKERN: ying: file_systems/cdda/v1
1861KERN: raw_command:
1862KERN: ahci: AHCIPort::ScsiExecuteRequest port 3 unsupported request opcode 0x43
1863KERN:   returned: -1
1864KERN:   trying: file_systems/udf/v1
1865KERN: read_pos(pos:219902367531008, len:2048) failed with: 0xffffffffffffffff
1866KERN: udf_recognize: Invalid sequence. status = -1
1867KERN:   returned: -1
1868KERN:   trying: file_systems/nfs/v1
1869KERN:   returned: -1
1870KERN:   trying: file_systems/bindfs/v1
1871KERN:   returned: -1
1872KERN:   trying: file_systems/iso9660/v1
1873KERN: identify(4, 0xffffffffab7498c0)
1874KERN:   returned: -1
1875KERN: dos_std_ops()
1876KERN:   trying: file_systems/fat/v1
1877KERN:   returned: -1
1878KERN: dos_std_ops()
1879KERN:   trying: file_systems/ntfs/v1
1880KERN: fs_identify_partition: boot signature NTFS doesn't match
1881KERN:   returned: -1
1882KERN:   trying: file_systems/log_overlay/v1
1883KERN:   returned: -1
1884KERN:   trying: file_systems/exfat/v1
1885KERN: [34mexfat:[0m invalid superblock!
1886KERN:   returned: -1
1887KERN:   trying: file_systems/write_overlay/v1
1888KERN:   returned: -1
1889KERN:   trying: file_systems/nfs4/v1
1890KERN:   returned: -1
1891KERN:   trying: file_systems/attribute_overlay/v1
1892KERN:   returned: -1
1893KERN:   trying: file_systems/ext2/v1
1894KERN: [34mext2:[0m invalid superblock!
1895KERN:   returned: -1
1896KERN: allocate_commpage_entry(4, 16) -> 0x0000000000000260
1897KERN: no valid cpufreq module found
1898KERN: no valid cpuidle module found
1899KERN: add_memory_type_range(-1, 0x100000, 0xbd7be000, 6)
1900KERN: set MTRRs to:
1901KERN:   mtrr:  0: base: 0xbdc00000, size:   0x400000, type: 0
1902KERN:   mtrr:  1: base: 0xc0000000, size: 0x40000000, type: 0
1903KERN: add_memory_type_range(-1, 0xbdbc8000, 0x2bf000, 6)
1904KERN: set MTRRs to:
1905KERN:   mtrr:  0: base: 0xbdf00000, size:   0x100000, type: 0
1906KERN:   mtrr:  1: base: 0xc0000000, size: 0x40000000, type: 0
1907KERN: add_memory_type_range(-1, 0xbec4c000, 0x418000, 6)
1908KERN: set MTRRs to:
1909KERN:   mtrr:  0: base: 0xbdf00000, size:   0x100000, type: 0
1910KERN:   mtrr:  1: base: 0xc0000000, size: 0x40000000, type: 0
1911KERN: add_memory_type_range(-1, 0x100001000, 0x33efff000, 6)
1912KERN: set MTRRs to:
1913KERN:   mtrr:  0: base: 0xbdf00000, size:   0x100000, type: 0
1914KERN:   mtrr:  1: base: 0xc0000000, size: 0x40000000, type: 0
1915KERN: kernel debugger extension "debugger/run_on_exit/v1": loaded
1916KERN: kernel debugger extension "debugger/usb_keyboard/v1": loaded
1917KERN: kernel debugger extension "debugger/disasm/v1": loaded
1918KERN: kernel debugger extension "debugger/invalidate_on_exit/v1": loaded
1919KERN: kernel debugger extension "debugger/hangman/v1": loaded
1920KERN: add_memory_type_range(91, 0xc0000000, 0x7e9000, 1)
1921KERN: set MTRRs to:
1922KERN:   mtrr:  0: base: 0xbdf00000, size:   0x100000, type: 0
1923KERN:   mtrr:  1: base: 0xe0000000, size: 0x20000000, type: 0
1924KERN:   mtrr:  2: base: 0xc0000000, size: 0x40000000, type: 1
1925KERN: module: Search for bus_managers/ide/controller/driver_v1 failed.
1926KERN: publish device: node 0xffffffffab775dc8, path random, module bus_managers/random/device_v1
1927KERN: publish device: node 0xffffffffab775dc8, path urandom, module bus_managers/random/device_v1
1928KERN: module: Search for bus_managers/ide/controller/driver_v1 failed.
1929KERN: loading dependent module bus_managers/ide/controller/driver_v1 of busses/ata/silicon_image_3112/driver_v1 failed!
1930KERN: module: Search for bus_managers/ide/controller/driver_v1 failed.
1931KERN: loading dependent module bus_managers/ide/controller/driver_v1 of busses/ata/legacy_sata/driver_v1 failed!
1932KERN: module: Search for bus_managers/ide/controller/driver_v1 failed.
1933KERN: loading dependent module bus_managers/ide/controller/driver_v1 of busses/ata/highpoint_ide_pci/driver_v1 failed!
1934KERN: module: Search for bus_managers/ide/controller/driver_v1 failed.
1935KERN: loading dependent module bus_managers/ide/controller/driver_v1 of busses/ata/generic_ide_pci/driver_v1 failed!
1936KERN: module: Search for bus_managers/ide/controller/driver_v1 failed.
1937KERN: loading dependent module bus_managers/ide/controller/driver_v1 of generic/ata_adapter/v1 failed!
1938KERN: loading dependent module generic/ata_adapter/v1 of busses/ata/it8211/driver_v1 failed!
1939KERN: module: Search for bus_managers/ide/controller/driver_v1 failed.
1940KERN: loading dependent module bus_managers/ide/controller/driver_v1 of busses/ata/silicon_image_3112/driver_v1 failed!
1941KERN: module: Search for bus_managers/ide/controller/driver_v1 failed.
1942KERN: loading dependent module bus_managers/ide/controller/driver_v1 of busses/ata/legacy_sata/driver_v1 failed!
1943KERN: module: Search for bus_managers/ide/controller/driver_v1 failed.
1944KERN: loading dependent module bus_managers/ide/controller/driver_v1 of busses/ata/highpoint_ide_pci/driver_v1 failed!
1945KERN: module: Search for bus_managers/ide/controller/driver_v1 failed.
1946KERN: loading dependent module bus_managers/ide/controller/driver_v1 of busses/ata/generic_ide_pci/driver_v1 failed!
1947KERN: module: Search for bus_managers/ide/controller/driver_v1 failed.
1948KERN: loading dependent module bus_managers/ide/controller/driver_v1 of generic/ata_adapter/v1 failed!
1949KERN: loading dependent module generic/ata_adapter/v1 of busses/ata/it8211/driver_v1 failed!
1950KERN: publish device: node 0xffffffffab816b48, path power/button/power, module drivers/power/acpi_button/device_v1
1951KERN: publish device: node 0xffffffffab816968, path power/button/power_fixed, module drivers/power/acpi_button/device_v1
1952KERN: REG: Failed to open shadow passwd DB file "/etc/shadow": No such file or directory
1953KERN: devfs: reload driver "usb_disk" (-1, -1)
1954KERN: register_domain(5, internet6)
1955KERN: unregister_domain(0xffffffffabaa0300, 5, internet6)
1956KERN: register_domain(9, unix)
1957KERN: unregister_domain(0xffffffffabaa0280, 9, unix)
1958KERN: register_domain(5, internet6)
1959KERN: unregister_domain(0xffffffffabaa0080, 5, internet6)
1960KERN: register_domain(1, internet)
1961KERN: unregister_domain(0xffffffffabab0f00, 1, internet)
1962KERN: register_domain(5, internet6)
1963KERN: unregister_domain(0xffffffffabab0e80, 5, internet6)
1964KERN: register_domain(5, internet6)
1965KERN: unregister_domain(0xffffffffabab0e80, 5, internet6)
1966KERN: register_domain(5, internet6)
1967KERN: register_domain(4, link)
1968KERN: unregister_domain(0xffffffffabab0d80, 4, link)
1969KERN: unregister_domain(0xffffffffabaa0500, 5, internet6)
1970KERN: package_daemon [7150758:   399] root at "/boot" (device: 3, node: 524288) registered
1971KERN: package_daemon [7151021:   399] volume at "/boot/system" registered
1972KERN: package_daemon [7151338:   399] volume at "/boot/home/config" registered
1973KERN: register_domain(5, internet6)
1974KERN: unregister_domain(0xffffffffabab0d80, 5, internet6)
1975KERN: register_domain(9, unix)
1976KERN: unregister_domain(0xffffffffabab0d80, 9, unix)
1977KERN: register_domain(5, internet6)
1978KERN: unregister_domain(0xffffffffabab0d80, 5, internet6)
1979KERN: register_domain(1, internet)
1980KERN: unregister_domain(0xffffffffabab0d80, 1, internet)
1981KERN: register_domain(5, internet6)
1982KERN: unregister_domain(0xffffffffabab0d80, 5, internet6)
1983KERN: register_domain(5, internet6)
1984KERN: unregister_domain(0xffffffffabab0d80, 5, internet6)
1985KERN: register_domain(1, internet)
1986KERN: unregister_domain(0xffffffffabaa0500, 1, internet)
1987KERN: devfs: "intel_810" api_version missing
1988KERN: i810: init_hardware() - no supported devices
1989KERN: intel_extreme: CALLED status_t init_hardware()
1990KERN: radeon_hd: init_hardware
1991KERN: radeon_hd: init_driver
1992KERN: radeon_hd: init_driver: GPU(0) Radeon RX 560, revision = 0xcf
1993KERN: radeon_hd: publish_devices
1994KERN: radeon_hd: find_device
1995KERN: loaded driver /boot/system/add-ons/kernel/drivers/dev/graphics/radeon_hd
1996KERN: etherpci: init_driver init_driver: etherpci not found
1997KERN: Radeon - init_hardware: Version: 5.1.6.0
1998KERN: Radeon - Radeon_CardDetect: no supported devices found
1999KERN: vesa: init_hardware()
2000KERN: vesa: init_driver()
2001KERN: vesa: publish_devices()
2002KERN: vesa: find_device()
2003KERN: loaded driver /boot/system/add-ons/kernel/drivers/dev/graphics/vesa
2004KERN: radeon_hd: device_open: open(name = graphics/radeon_hd_010000)
2005KERN: radeon_hd: card(0): radeon_hd_init: called
2006KERN: radeon_hd: radeon_hd_init: card(0): Radeon Polaris 1002:67FF
2007KERN: add_memory_type_range(3369, 0xff600000, 0x40000, 0)
2008KERN: set MTRRs to:
2009KERN:   mtrr:  0: base: 0xbdf00000, size:   0x100000, type: 0
2010KERN:   mtrr:  1: base: 0xe0000000, size: 0x20000000, type: 0
2011KERN:   mtrr:  2: base: 0xc0000000, size: 0x40000000, type: 1
2012KERN: radeon_hd: radeon_hd_init: shrinking frame buffer to PCI bar...
2013KERN: radeon_hd: radeon_hd_init: mapping a frame buffer of 256MB out of 4096MB video ram
2014KERN: add_memory_type_range(3370, 0xc0000000, 0x10000000, 0)
2015KERN: set MTRRs to:
2016KERN:   mtrr:  0: base: 0xbdf00000, size:   0x100000, type: 0
2017KERN:   mtrr:  1: base: 0xc0000000, size: 0x40000000, type: 0
2018KERN: add_memory_type_range(3370, 0xc0000000, 0x10000000, 1)
2019KERN: set MTRRs to:
2020KERN:   mtrr:  0: base: 0xbdf00000, size:   0x100000, type: 0
2021KERN:   mtrr:  1: base: 0xe0000000, size: 0x20000000, type: 0
2022KERN:   mtrr:  2: base: 0xc0000000, size: 0x40000000, type: 1
2023KERN: radeon_hd: card(0): radeon_hd_getbios: called
2024KERN: radeon_hd: radeon_hd_getbios: ACPI ATRM AtomBIOS TODO
2025KERN: radeon_hd: radeon_hd_getbios: AtomBIOS not found using active method 0 at 0x0
2026KERN: radeon_hd: mapAtomBIOS: KERN: seeking AtomBIOS @ 0xC0000000 [size: 0x40000]
2027KERN: add_memory_type_range(3372, 0xc0000000, 0x40000, 0)
2028KERN: set MTRRs to:
2029KERN:   mtrr:  0: base: 0xbdf00000, size:   0x100000, type: 0
2030KERN:   mtrr:  1: base: 0xc0000000, size:    0x40000, type: 0
2031KERN:   mtrr:  2: base: 0xe0000000, size: 0x20000000, type: 0
2032KERN:   mtrr:  3: base: 0xc0000000, size: 0x40000000, type: 1
2033KERN: radeon_hd: mapAtomBIOS: BIOS signature incorrect @ 0xC0000000 (0)
2034KERN: remove_memory_type_range(3372, 0xc0000000, 0x40000, 0)
2035KERN: set MTRRs to:
2036KERN:   mtrr:  0: base: 0xbdf00000, size:   0x100000, type: 0
2037KERN:   mtrr:  1: base: 0xe0000000, size: 0x20000000, type: 0
2038KERN:   mtrr:  2: base: 0xc0000000, size: 0x40000000, type: 1
2039KERN: radeon_hd: radeon_hd_getbios: AtomBIOS not found using active method 1 at 0xC0000000
2040KERN: radeon_hd: radeon_hd_getbios: PCI ROM decode enabled
2041KERN: radeon_hd: mapAtomBIOS: seeking AtomBIOS @ 0xFF640000 [size: 0x20000]
2042KERN: add_memory_type_range(3373, 0xff640000, 0x20000, 0)
2043KERN: set MTRRs to:
2044KERN:   mtrr:  0: base: 0xbdf00000, size:   0x100000, type: 0
2045KERN:   mtrr:  1: base: 0xe0000000, size: 0x20000000, type: 0
2046KERN:   mtrr:  2: base: 0xc0000000, size: 0x40000000, type: 1
2047KERN: package_daemon [7449858:   419] Failed to open packages activation file: No such file or directory
2048KERN: package_daemon [7452377:   419] Failed to get activated packages info from activated packages file. Assuming all package files in package directory are activated.
2049KERN: package_daemon [7456552:   419] latest volume state:
2050KERN: package_daemon [7457905:   419] active package: "devdocs_cplusplus12_en-1.0-3-any.hpkg"
2051KERN: package_daemon [7460145:   419] active package: "ctags-5.8-5-x86_64.hpkg"
2052KERN: package_daemon [7462012:   419] active package: "glib2-2.57.1-1-x86_64.hpkg"
2053KERN: package_daemon [7463976:   419] active package: "mupdf-1.8-3-x86_64.hpkg"
2054KERN: package_daemon [7465865:   419] active package: "pdfwriter-1.0-3-x86_64.hpkg"
2055KERN: package_daemon [7467846:   419] active package: "p7zip-9.20.1-7-x86_64.hpkg"
2056KERN: package_daemon [7469808:   419] active package: "haiku_welcome-r1~alpha4_pm_hrev52205-1-any.hpkg"
2057KERN: package_daemon [7472289:   419] active package: "libvorbis-1.3.5-5-x86_64.hpkg"
2058KERN: package_daemon [7474329:   419] active package: "haiku_devel-r1~alpha4_pm_hrev52203-1-x86_64.hpkg"
2059KERN: package_daemon [7476824:   419] active package: "curl-7.60.0-1-x86_64.hpkg"
2060KERN: package_daemon [7478763:   419] active package: "libgcrypt-1.8.3-1-x86_64.hpkg"
2061KERN: package_daemon [7480780:   419] active package: "pdftranslator-1.0.2-2-x86_64.hpkg"
2062KERN: package_daemon [7482925:   419] active package: "patch-2.7.5-2-x86_64.hpkg"
2063KERN: package_daemon [7484851:   419] active package: "libvpx3-1.5.0-3-x86_64.hpkg"
2064KERN: package_daemon [7486842:   419] active package: "beos_sounds-1.0-1-any.hpkg"
2065KERN: package_daemon [7488807:   419] active package: "haiku_loader-r1~alpha4_pm_hrev52203-1-x86_64.hpkg"
2066KERN: package_daemon [7491316:   419] active package: "curl_devel-7.60.0-1-x86_64.hpkg"
2067KERN: package_daemon [7493409:   419] active package: "weather-1.0.0-1-x86_64.hpkg"
2068KERN: package_daemon [7495385:   419] active package: "libsndfile-1.0.28-1-x86_64.hpkg"
2069KERN: package_daemon [7497475:   419] active package: "pe-2.4.5-8-x86_64.hpkg"
2070KERN: package_daemon [7499318:   419] active package: "libwebp-1.0.0-1-x86_64.hpkg"
2071KERN: package_daemon [7501309:   419] active package: "haikuwebkit-1.6.5-1-x86_64.hpkg"
2072KERN: package_daemon [7503390:   419] active package: "diffutils-3.6-1-x86_64.hpkg"
2073KERN: package_daemon [7505377:   419] active package: "mpg123-1.25.10-1-x86_64.hpkg"
2074KERN: package_daemon [7507369:   419] active package: "bescreencapture-2.3.3-1-x86_64.hpkg"
2075KERN: package_daemon [7509561:   419] active package: "perl-5.26.1-2-x86_64.hpkg"
2076KERN: package_daemon [7511501:   419] active package: "libxml2-2.9.7-2-x86_64.hpkg"
2077KERN: package_daemon [7513481:   419] active package: "icu-57.1-3-x86_64.hpkg"
2078KERN: package_daemon [7515344:   419] active package: "expat-2.2.5-1-x86_64.hpkg"
2079KERN: package_daemon [7517260:   419] active package: "glib_networking-2.54.1-1-x86_64.hpkg"
2080KERN: package_daemon [7519477:   419] active package: "beae-1.2-5-x86_64.hpkg"
2081KERN: package_daemon [7521330:   419] active package: "pkgconfig-0.29.2-3-x86_64.hpkg"
2082KERN: package_daemon [7523398:   419] active package: "libxml2_devel-2.9.7-2-x86_64.hpkg"
2083KERN: package_daemon [7525525:   419] active package: "icu_devel-57.1-3-x86_64.hpkg"
2084KERN: package_daemon [7527541:   419] active package: "ffmpeg-4.0.1-2-x86_64.hpkg"
2085KERN: package_daemon [7529507:   419] active package: "libmms-0.5-1-x86_64.hpkg"
2086KERN: package_daemon [7531410:   419] active package: "librevenge-0.0.4-4-x86_64.hpkg"
2087KERN: package_daemon [7533478:   419] active package: "python-2.7.14-2-x86_64.hpkg"
2088KERN: package_daemon [7535455:   419] active package: "haikuporter-1.2.2-1-any.hpkg"
2089KERN: package_daemon [7537470:   419] active package: "libxslt-1.1.32-1-x86_64.hpkg"
2090KERN: package_daemon [7539474:   419] active package: "ilmbase-2.2.1-1-x86_64.hpkg"
2091KERN: package_daemon [7541464:   419] active package: "ffmpeg_devel-4.0.1-2-x86_64.hpkg"
2092KERN: package_daemon [7543581:   419] active package: "libnice-0.1.14-2-x86_64.hpkg"
2093KERN: package_daemon [7545571:   419] active package: "libpng16-1.6.35-1-x86_64.hpkg"
2094KERN: package_daemon [7547612:   419] active package: "hunspell-1.6.2-1-x86_64.hpkg"
2095KERN: package_daemon [7549605:   419] active package: "readline-7.0.3-2-x86_64.hpkg"
2096KERN: package_daemon [7551619:   419] active package: "llvm_libs-5.0.0-3-x86_64.hpkg"
2097KERN: package_daemon [7553650:   419] active package: "devdocs_besamplecode-1.0-2-any.hpkg"
2098KERN: package_daemon [7555839:   419] active package: "jam-2.5_2012_10_12-5-x86_64.hpkg"
2099KERN: package_daemon [7557945:   419] active package: "findutils-4.6.0-1-x86_64.hpkg"
2100KERN: package_daemon [7559984:   419] active package: "openal-1.13.0-4-x86_64.hpkg"
2101KERN: package_daemon [7561973:   419] active package: "gstreamer-1.14.0-1-x86_64.hpkg"
2102KERN: package_daemon [7564029:   419] active package: "hyphen-2.8.8-3-x86_64.hpkg"
2103KERN: package_daemon [7565992:   419] active package: "podofo-0.9.5-3-x86_64.hpkg"
2104KERN: package_daemon [7567946:   419] active package: "scons-2.5.1-3-x86_64.hpkg"
2105KERN: package_daemon [7569886:   419] active package: "m4-1.4.18-3-x86_64.hpkg"
2106KERN: package_daemon [7571752:   419] active package: "jasper-2.0.14-1-x86_64.hpkg"
2107KERN: package_daemon [7573745:   419] active package: "flex-2.6.4-1-x86_64.hpkg"
2108KERN: package_daemon [7575657:   419] active package: "minizip-1.2.11-1-x86_64.hpkg"
2109KERN: package_daemon [7577660:   419] active package: "twolame-0.3.13-4-x86_64.hpkg"
2110KERN: package_daemon [7579675:   419] active package: "colors-2.3-5-x86_64.hpkg"
2111KERN: package_daemon [7581566:   419] active package: "pixman-0.34.0-2-x86_64.hpkg"
2112KERN: package_daemon [7583558:   419] active package: "sed-4.4-3-x86_64.hpkg"
2113KERN: package_daemon [7585384:   419] active package: "make-4.1-3-x86_64.hpkg"
2114KERN: package_daemon [7587247:   419] active package: "jpeg-9c-2-x86_64.hpkg"
2115KERN: package_daemon [7589086:   419] active package: "fontconfig-2.12.6-2-x86_64.hpkg"
2116KERN: package_daemon [7591166:   419] active package: "telegram_desktop-1.3.10-1-x86_64.hpkg"
2117KERN: package_daemon [7593411:   419] active package: "libsoup-2.60.2-1-x86_64.hpkg"
2118KERN: package_daemon [7595412:   419] active package: "boost163-1.63.0-4-x86_64.hpkg"
2119KERN: package_daemon [7597453:   419] active package: "sharutils-4.15.2-3-x86_64.hpkg"
2120KERN: package_daemon [7599507:   419] active package: "makefile_engine-r1~alpha4_pm_hrev52203-1-any.hpkg"
2121KERN: package_daemon [7602050:   419] active package: "jpeg_devel-9c-2-x86_64.hpkg"
2122KERN: package_daemon [7604031:   419] active package: "fontconfig_devel-2.12.6-2-x86_64.hpkg"
2123KERN: package_daemon [7606272:   419] active package: "gst_plugins_base-1.14.0-1-x86_64.hpkg"
2124KERN: package_daemon [7608503:   419] active package: "poppler_data-0.4.9-1-any.hpkg"
2125KERN: package_daemon [7610542:   419] active package: "speex-1.2.0-3-x86_64.hpkg"
2126KERN: package_daemon [7612473:   419] active package: "man-1.6g-6-x86_64.hpkg"
2127KERN: package_daemon [7614337:   419] active package: "less-531-1-x86_64.hpkg"
2128KERN: package_daemon [7616202:   419] active package: "devdocs_cplusplus8_en-1.0-3-any.hpkg"
2129KERN: package_daemon [7618409:   419] active package: "freetype-2.9-1-x86_64.hpkg"
2130KERN: package_daemon [7620371:   419] active package: "graphite2-1.3.10-1-x86_64.hpkg"
2131KERN: package_daemon [7622415:   419] active package: "speex_devel-1.2.0-3-x86_64.hpkg"
2132KERN: package_daemon [7624507:   419] active package: "mesa-17.1.7-8-x86_64.hpkg"
2133KERN: package_daemon [7626436:   419] active package: "devdocs_bash1_en-1.0-6-any.hpkg"
2134KERN: package_daemon [7628543:   4KERN: 19] active package: "libedit-20180525_3.1-1-x86_64.hpkg"
2135KERN: package_daemon [7630687:   419] active package: "freetype_devel-2.9-1-x86_64.hpkg"
2136KERN: package_daemon [7632803:   419] active package: "orc-0.4.27-1-x86_64.hpkg"
2137KERN: package_daemon [7634717:   419] active package: "libcdr-0.1.4-3-x86_64.hpkg"
2138KERN: package_daemon [7636660:   419] active package: "be_book-2008_10_26-2-any.hpkg"
2139KERN: package_daemon [7638703:   419] active package: "sqlite-3.24.0.0-1-x86_64.hpkg"
2140KERN: package_daemon [7640719:   419] active package: "mesa_devel-17.1.7-8-x86_64.hpkg"
2141KERN: package_daemon [7642811:   419] active package: "libexecinfo-1.1-4-x86_64.hpkg"
2142KERN: package_daemon [7644838:   419] active package: "gawk-4.2.0-1-x86_64.hpkg"
2143KERN: package_daemon [7646753:   419] active package: "flite-2.0.0-3-x86_64.hpkg"
2144KERN: package_daemon [7648695:   419] active package: "ftppositive-1.1-1-x86_64.hpkg"
2145KERN: package_daemon [7650722:   419] active package: "libfreehand-0.1.2-1-x86_64.hpkg"
2146KERN: package_daemon [7652812:   419] active package: "tar-1.29-3-x86_64.hpkg"
2147KERN: package_daemon [7654664:   419] active package: "muparser-2.2.5-1-x86_64.hpkg"
2148KERN: package_daemon [7656679:   419] active package: "mesa_swpipe-17.1.7-8-x86_64.hpkg"
2149KERN: package_daemon [7658774:   419] active package: "libffi-3.2.1-4-x86_64.hpkg"
2150KERN: package_daemon [7660736:   419] active package: "gcc-7.3.0_2018_05_01-2-x86_64.hpkg"
2151KERN: package_daemon [7662869:   419] active package: "lnlauncher-1.1.2-7-x86_64.hpkg"
2152KERN: package_daemon [7664934:   419] active package: "gst_libav-1.14.0-1-x86_64.hpkg"
2153KERN: package_daemon [7667000:   419] active package: "double_conversion-3.0.0-1-x86_64.hpkg"
2154KERN: package_daemon [7669233:   419] active package: "cairo-1.14.12-1-x86_64.hpkg"
2155KERN: package_daemon [7671223:   419] active package: "tcpdump-4.9.2-1-x86_64.hpkg"
2156KERN: package_daemon [7673189:   419] active package: "librecad-2.1.3-4-x86_64.hpkg"
2157KERN: package_daemon [7675205:   419] active package: "mkdepend-1.7-5-x86_64.hpkg"
2158KERN: package_daemon [7677147:   419] active package: "gcc_syslibs-7.3.0_2018_05_01-2-x86_64.hpkg"
2159KERN: package_daemon [7679517:   419] active package: "gst_plugins_good-1.14.0-1-x86_64.hpkg"
2160KERN: package_daemon [7681745:   419] active package: "qsystray-0.1-5-x86_64.hpkg"
2161KERN: package_daemon [7683710:   419] active package: "libpagemaker-0.0.4-1-x86_64.hpkg"
2162KERN: package_daemon [7685791:   419] active package: "texinfo-6.5-1-x86_64.hpkg"
2163KERN: package_daemon [7687730:   419] active package: "mpc-1.1.0-1-x86_64.hpkg"
2164KERN: package_daemon [7689621:   419] active package: "file_data-5.34-1-any.hpkg"
2165KERN: package_daemon [7691547:   419] active package: "gettext_libintl-0.19.8.1-5-x86_64.hpkg"
2166KERN: package_daemon [7693814:   419] active package: "gst_plugins_ugly-1.14.0-1-x86_64.hpkg"
2167KERN: package_daemon [7696021:   419] active package: "opus-1.2.1-1-x86_64.hpkg"
2168KERN: package_daemon [7697935:   419] active package: "libvisio-0.1.6-3-x86_64.hpkg"
2169KERN: package_daemon [7699941:   419] active package: "tiff4-4.0.9-1-x86_64.hpkg"
2170KERN: package_daemon [7701877:   419] active package: "mpfr-3.1.6-2-x86_64.hpkg"
2171KERN: package_daemon [7703769:   419] active package: "libicns-0.8.1-6-x86_64.hpkg"
2172KERN: package_daemon [7705762:   419] active package: "file-5.34-1-x86_64.hpkg"
2173KERN: package_daemon [7707649:   419] active package: "giflib-5.1.4-2-x86_64.hpkg"
2174KERN: package_daemon [7709593:   419] active package: "gst_plugins_bad-1.14.0-3-x86_64.hpkg"
2175KERN: package_daemon [7711807:   419] active package: "libsrtp-1.5.4-2-x86_64.hpkg"
2176KERN: package_daemon [7713786:   419] active package: "libmspub-0.1.4-1-x86_64.hpkg"
2177KERN: package_daemon [7715804:   419] active package: "unzip-6.0-5-x86_64.hpkg"
2178KERN: package_daemon [7717679:   419] active package: "nano-2.9.8-2-x86_64.hpkg"
2179KERN: package_daemon [7719593:   419] active package: "libiconv-1.15-4-x86_64.hpkg"
2180KERN: package_daemon [7721582:   419] active package: "guitar-0.3.0~git-1-x86_64.hpkg"
2181KERN: package_daemon [7723637:   419] active package: "git-2.16.4-1-x86_64.hpkg"
2182KERN: package_daemon [7725553:   419] active package: "qt5-5.11.1-2-x86_64.hpkg"
2183KERN: package_daemon [7727453:   419] active package: "x265-2.0-2-x86_64.hpkg"
2184KERN: package_daemon [7729317:   419] active package: "paladin-1.4~git-4-x86_64.hpkg"
2185KERN: package_daemon [7731335:   419] active package: "harfbuzz-1.8.7-1-x86_64.hpkg"
2186KERN: package_daemon [7733351:   419] active package: "vision-0.10.2-1-x86_64.hpkg"
2187KERN: package_daemon [7735336:   419] active package: "libidn2-2.0.4-1-x86_64.hpkg"
2188KERN: package_daemon [7737324:   419] active package: "git_daemon-2.16.4-1-x86_64.hpkg"
2189KERN: package_daemon [7739413:   419] active package: "autoconf-2.69-8-x86_64.hpkg"
2190KERN: package_daemon [7741380:   419] active package: "keymapswitcher-1.2.7.11-4-x86_64.hpkg"
2191KERN: package_daemon [7743622:   419] active package: "qthaikuplugins-5.11.1.1-1-x86_64.hpkg"
2192KERN: package_daemon [7745866:   419] active package: "poppler-0.62.0-1-x86_64.hpkg"
2193KERN: package_daemon [7747878:   419] active package: "webpositive-r1~alpha4_pm_hrev52203-1-x86_64.hpkg"
2194KERN: package_daemon [7750386:   419] active package: "msttcorefonts-1.0-1-any.hpkg"
2195KERN: package_daemon [7752401:   419] active package: "libmodplug-0.8.9.0-1-x86_64.hpkg"
2196KERN: package_daemon [7754505:   419] active package: "glu-9.0.0-7-x86_64.hpkg"
2197KERN: package_daemon [7756397:   419] active package: "devdocs_cplusplus10_en-1.0-4-any.hpkg"
2198KERN: package_daemon [7758614:   419] active package: "automake-1.15.1-1-x86_64.hpkg"
2199KERN: package_daemon [7760655:   419] active package: "qtwebkit-5.212.0~pre20180120-2-x86_64.hpkg"
2200KERN: package_daemon [7762990:   419] active package: "faad2-2.8.6-1-x86_64.hpkg"
2201KERN: package_daemon [7764930:   419] active package: "scribus-1.5.2-6-x86_64.hpkg"
2202KERN: package_daemon [7766921:   419] active package: "wget-1.19.4-1-x86_64.hpkg"
2203KERN: package_daemon [7768847:   419] active package: "nasm-2.12.01-4-x86_64.hpkg"
2204KERN: package_daemon [7770811:   419] active package: "libogg-1.3.3-2-x86_64.hpkg"
2205KERN: package_daemon [7772744:   419] active package: "glu_devel-9.0.0-7-x86_64.hpkg"
2206KERN: package_daemon [7774781:   419] active package: "bash-4.4.023-1-x86_64.hpkg"
2207KERN: package_daemon [7776735:   419] active package: "qupzilla-1.8.9-9-x86_64.hpkg"
2208KERN: package_daemon [7778749:   419] active package: "rtmpdump-2.4_20161210-3-x86_64.hpkg"
2209KERN: package_daemon [7780941:   419] active package: "which-2.21-4-x86_64.hpkg"
2210KERN: package_daemon [7782835:   419] active package: "ncurses6-6.0-3-x86_64.hpkg"
2211KERN: package_daemon [7784798:   419] active package: "libpcap-1.8.1-3-x86_64.hpkg"
2212KERN: package_daemon [7786765:   419] active package: "gmp-6.1.2-2-x86_64.hpkg"
2213KERN: package_daemon [7788653:   419] active package: "bc-1.07.1-2-x86_64.hpkg"
2214KERN: package_daemon [7790532:   419] active package: "gettext-0.19.8.1-5-x86_64.hpkg"
2215KERN: package_daemon [7792599:   419] active package: "wpa_supplicant-2.4-1-x86_64.hpkg"
2216KERN: package_daemon [7794712:   419] active package: "netcat-1.10-4-x86_64.hpkg"
2217KERN: package_daemon [7796628:   419] active package: "libpcre-8.42-1-x86_64.hpkg"
2218KERN: package_daemon [7798593:   419] active package: "becjk-1.0.1-3-x86_64.hpkg"
2219KERN: package_daemon [7800510:   419] active package: "gnutls36-3.6.2-1-x86_64.hpkg"
2220KERN: package_daemon [7802527:   419] active package: "binutils-2.28.1_2017_08_05-2-x86_64.hpkg"
2221KERN: package_daemon [7804832:   419] active package: "libgpg_error-1.32-1-x86_64.hpkg"
2222KERN: package_daemon [7806923:   419] active package: "xz_utils-5.2.4-2-x86_64.hpkg"
2223KERN: package_daemon [7808927:   419] active package: "bepdf-2.1.0-2-x86_64.hpkg"
2224KERN: package_daemon [7810866:   419] active package: "nettle-3.4-1-x86_64.hpkg"
2225KERN: package_daemon [7812783:   419] active package: "libpcre2-10.30-1-x86_64.hpkg"
2226KERN: package_daemon [7814785:   419] active package: "grep-3.1-1-x86_64.hpkg"
2227KERN: package_daemon [7816649:   419] active package: "bison-3.0.5-1-x86_64.hpkg"
2228KERN: package_daemon [7818579:   419] active package: "flac-1.3.2-3-x86_64.hpkg"
2229KERN: package_daemon [7820493:   419] active package: "lua-5.3.4-3-x86_64.hpkg"
2230KERN: package_daemon [7822373:   419] active package: "zip-3.0-4-x86_64.hpkg"
2231KERN: package_daemon [7824211:   419] active package: "open_sans-1.0-2-any.hpkg"
2232KERN: package_daemon [7826124:   419] active package: "noto-20170920-3-any.hpkg"
2233KERN: package_daemon [7828016:   419] active package: "groff-1.22.3-1-x86_64.hpkg"
2234KERN: package_daemon [7829981:   419] active package: "devdocs_cplusplus11_en-1.0-3-any.hpkg"
2235KERN: package_daemon [7832214:   419] active package: "bzip2-1.0.6-7-x86_64.hpkg"
2236KERN: package_daemon [7834151:   419] active package: "fskit-0.4-1-any.hpkg"
2237KERN: pKERN: ackage_daemon [7835953:   419] active package: "lame-3.100-1-x86_64.hpkg"
2238KERN: package_daemon [7837868:   419] active package: "sqlitebrowser-3.10.1-1-x86_64.hpkg"
2239KERN: package_daemon [7840033:   419] active package: "zlib-1.2.11-3-x86_64.hpkg"
2240KERN: package_daemon [7841953:   419] active package: "noto_sans_cjk_jp-1.004-2-any.hpkg"
2241KERN: package_daemon [7844091:   419] active package: "haiku_userguide_en-r1~alpha4_pm_hrev52205-1-any.hpkg"
2242KERN: package_daemon [7846701:   419] active package: "bzip2_devel-1.0.6-7-x86_64.hpkg"
2243KERN: package_daemon [7848789:   419] active package: "devdocs_main-1.0-10-any.hpkg"
2244KERN: package_daemon [7850794:   419] active package: "mimetic-0.9.8-2-x86_64.hpkg"
2245KERN: package_daemon [7852784:   419] active package: "a52dec-0.7.4-5-x86_64.hpkg"
2246KERN: package_daemon [7854725:   419] active package: "zlib_devel-1.2.11-3-x86_64.hpkg"
2247KERN: package_daemon [7856818:   419] active package: "openexr-2.2.1-2-x86_64.hpkg"
2248KERN: package_daemon [7858795:   419] active package: "libsolv-0.3.0_haiku_2014_12_22-2-x86_64.hpkg"
2249KERN: package_daemon [7861212:   419] active package: "ca_root_certificates-2018_01_17-2-any.hpkg"
2250KERN: package_daemon [7863568:   419] active package: "libtool_libltdl-2.4.6-1-x86_64.hpkg"
2251KERN: package_daemon [7865760:   419] active package: "jbig2dec-0.14-1-x86_64.hpkg"
2252KERN: package_daemon [7867749:   419] active package: "zstd-1.3.4-1-x86_64.hpkg"
2253KERN: package_daemon [7869651:   419] active package: "openssh-7.6p1-1-x86_64.hpkg"
2254KERN: package_daemon [7871644:   419] active package: "libtasn1-4.13-1-x86_64.hpkg"
2255KERN: package_daemon [7873621:   419] active package: "gutenprint-5.2.14-1-x86_64.hpkg"
2256KERN: package_daemon [7875711:   419] active package: "cdrtools-3.02~a09-1-x86_64.hpkg"
2257KERN: package_daemon [7877791:   419] active package: "taglib-1.11.1-4-x86_64.hpkg"
2258KERN: package_daemon [7879781:   419] active package: "lcms-2.9-2-x86_64.hpkg"
2259KERN: package_daemon [7881637:   419] active package: "openssl-1.0.2o-1-x86_64.hpkg"
2260KERN: package_daemon [7883650:   419] active package: "libtheora-1.1.1-7-x86_64.hpkg"
2261KERN: package_daemon [7885691:   419] active package: "gzip-1.8-2-x86_64.hpkg"
2262KERN: package_daemon [7887543:   419] active package: "coreutils-8.29-1-x86_64.hpkg"
2263KERN: package_daemon [7889559:   419] active package: "libpng16_devel-1.6.35-1-x86_64.hpkg"
2264KERN: package_daemon [7891731:   419] active package: "openjpeg-2.3.0-1-x86_64.hpkg"
2265KERN: package_daemon [7893744:   419] active package: "pdflib-5.0.3-3-x86_64.hpkg"
2266KERN: package_daemon [7895698:   419] active package: "openssl_devel-1.0.2o-1-x86_64.hpkg"
2267KERN: package_daemon [7897865:   419] active package: "libunistring-0.9.10-1-x86_64.hpkg"
2268KERN: package_daemon [7899984:   419] active package: "haiku-r1~alpha4_pm_hrev52203-1-x86_64.hpkg"
2269KERN: package_daemon [7902364:   419] The latest volume state is also the currently active one
2270KERN: package_daemon [7904665:   419] Volume::InitialVerify((nil), (nil))
2271KERN: package_daemon [7939257:   419] Volume::InitialVerify(): volume at "/boot/system" is consistent
2272KERN: package_daemon [7943083:   419] Failed to open packages activation file: No such file or directory
2273KERN: package_daemon [7945588:   419] Failed to get activated packages info from activated packages file. Assuming all package files in package directory are activated.
2274KERN: package_daemon [7949730:   419] latest volume state:
2275KERN: package_daemon [7951065:   419] The latest volume state is also the currently active one
2276KERN: package_daemon [7953353:   419] Volume::InitialVerify(0x1f8d6bcd220, (nil))
2277KERN: package_daemon [7960529:   419] Volume::InitialVerify(): volume at "/boot/home/config" is consistent
2278KERN: radeon_hd: mapAtomBIOS: AtomBIOS verified and locked
2279KERN: remove_memory_type_range(3373, 0xff640000, 0x20000, 0)
2280KERN: set MTRRs to:
2281KERN:   mtrr:  0: base: 0xbdf00000, size:   0x100000, type: 0
2282KERN:   mtrr:  1: base: 0xe0000000, size: 0x20000000, type: 0
2283KERN:   mtrr:  2: base: 0xc0000000, size: 0x40000000, type: 1
2284KERN: radeon_hd: radeon_hd_getbios: AtomBIOS found using active method 2 at 0xFF640000
2285KERN: radeon_hd: card(0): radeon_hd_init found VESA EDID information.
2286KERN: radeon_hd: card(0): radeon_hd_init completed successfully!
2287KERN: radeon_hd: card(0): GPU thermal status: 0C
2288KERN: radeon_hd: device_ioctl: accelerant: radeon_hd.accelerant
2289KERN: radeon_hd: radeon_init_accelerant enter
2290KERN: radeon_hd: radeon_dump_bios: Dumping AtomBIOS as ATOM_DEBUG is set...
2291KERN: radeon_hd: radeon_dump_bios: AtomBIOS dumped to /boot/system/cache/tmp/radeon_hd_bios_1002_67ff_0.bin
2292KERN: radeon_hd: radeon_init_bios: AtomBIOS is already posted
2293KERN: radeon_hd: radeon_gpu_probe: table 2.2
2294KERN: radeon_hd: gpio_general_populate: general GPIO @ 0, valid: true, hwPin: 0x1
2295KERN: radeon_hd: gpio_general_populate: general GPIO @ 1, valid: true, hwPin: 0x2
2296KERN: radeon_hd: gpio_general_populate: general GPIO @ 2, valid: true, hwPin: 0x3
2297KERN: radeon_hd: gpio_general_populate: general GPIO @ 3, valid: true, hwPin: 0x4
2298KERN: radeon_hd: gpio_general_populate: general GPIO @ 4, valid: true, hwPin: 0x5
2299KERN: radeon_hd: gpio_general_populate: general GPIO @ 5, valid: true, hwPin: 0x6
2300KERN: radeon_hd: gpio_i2c_populate: i2c GPIO @ 6, valid: true, hwPin: 0x90
2301KERN: radeon_hd: gpio_i2c_populate: i2c GPIO @ 7, valid: true, hwPin: 0x91
2302KERN: radeon_hd: gpio_i2c_populate: i2c GPIO @ 8, valid: true, hwPin: 0x92
2303KERN: radeon_hd: gpio_i2c_populate: i2c GPIO @ 9, valid: true, hwPin: 0x93
2304KERN: radeon_hd: gpio_i2c_populate: i2c GPIO @ 10, valid: true, hwPin: 0x94
2305KERN: radeon_hd: gpio_i2c_populate: i2c GPIO @ 11, valid: true, hwPin: 0x95
2306KERN: radeon_hd: gpio_i2c_populate: i2c GPIO @ 12, valid: true, hwPin: 0x96
2307KERN: radeon_hd: gpio_i2c_populate: i2c GPIO @ 13, valid: true, hwPin: 0x97
2308KERN: radeon_hd: connector_probe: found 3 potential display paths.
2309KERN: radeon_hd: pll_limit_probe: table 2.2
2310KERN: radeon_hd: pll_limit_probe: referenceFreq: 100000; pllOutMin: 2970000;  pllOutMax: 6000000; pllInMin: 25000;pllInMax: 100000
2311KERN: radeon_hd: pll_limit_probe: table 2.2
2312KERN: radeon_hd: pll_limit_probe: referenceFreq: 100000; pllOutMin: 2970000;  pllOutMax: 6000000; pllInMin: 25000;pllInMax: 100000
2313KERN: radeon_hd: pll_limit_probe: table 2.2
2314KERN: radeon_hd: pll_limit_probe: referenceFreq: 100000; pllOutMin: 2970000;  pllOutMax: 6000000; pllInMin: 25000;pllInMax: 100000
2315KERN: radeon_hd: Currently detected connectors=============
2316KERN: radeon_hd: Connector #0)
2317KERN: radeon_hd:  + connector:          DisplayPort
2318KERN: radeon_hd:  + i2c gpio table id:  6
2319KERN: radeon_hd:    - gpio hw pin:      0x90
2320KERN: radeon_hd:    - gpio valid:       true
2321KERN: radeon_hd:    - i2c valid:        true
2322KERN: radeon_hd:  + hpd gpio table id:  1
2323KERN: radeon_hd:    - gpio hw pin:      0x2
2324KERN: radeon_hd:    - gpio valid:       true
2325KERN: radeon_hd:  + encoder:            TMDS
2326KERN: radeon_hd:    - id:               32
2327KERN: radeon_hd:    - type:             Internal Kaleidoscope UNIPHY1
2328KERN: radeon_hd:    - capabilities:     0x0
2329KERN: radeon_hd:    - enumeration:      1
2330KERN: radeon_hd:    - is bridge:        false
2331KERN: radeon_hd:    + external encoder: none
2332KERN: radeon_hd:  + flags:
2333KERN: radeon_hd:    * device DFP1 support
2334KERN: radeon_hd: Connector #1)
2335KERN: radeon_hd:  + connector:          HDMI A
2336KERN: radeon_hd:  + i2c gpio table id:  9
2337KERN: radeon_hd:    - gpio hw pin:      0x93
2338KERN: radeon_hd:    - gpio valid:       true
2339KERN: radeon_hd:    - i2c valid:        true
2340KERN: radeon_hd:  + hpd gpio table id:  4
2341KERN: radeon_hd:    - gpio hw pin:      0x5
2342KERN: radeon_hd:    - gpio valid:       true
2343KERN: radeon_hd:  + encoder:            TMDS
2344KERN: radeon_hd:    - id:               32
2345KERN: radeon_hd:    - type:             Internal Kaleidoscope UNIPHY1
2346KERN: radeon_hd:    - capabilities:     0x0
2347KERN: radeon_hd:    - enumeration:      2
2348KERN: radeon_hd:    - is bridge:        false
2349KERN: radeon_hd:    + external encoder: none
2350KERN: radeon_hd:  + flags:
2351KERN: radeon_hd:    * device DFP2 support
2352KERN: radeon_hd: Connector #2)
2353KERN: radeon_hd:  + connector:          DVI-D (Digital Only)
2354KERN: radeon_hd:  + i2c gpio table id:  10
2355KERN: radeon_hd:    - gpio hw pin:      0x94
2356KERN: radeon_hd:    - gpio valid:       true
2357KERN: radeon_hd:    - i2c valid:        true
2358KERN: radeon_hd:  + hpd gpio table id:  2
2359KERN: radeon_hd:    - gpio hw pin:      0x3
2360KERN: radeon_hd:    - gpio valid:       true
2361KERN: radeon_hd:  + encoder:            TMDS
2362KERN: radeon_hd:    - id:               30
2363KERN: radeon_hd:    - type:             Internal Kaleidoscope UNIPHY
2364KERN: radeon_hd:    - capabilities:     0x0
2365KERN: radeon_hd:    - enumeration:      1
2366KERN: radeon_hd:    - is bridge:        false
2367KERN: radeon_hd:    + external encoder: none
2368KERN: radeon_hd:  + flags:
2369KERN: radeon_hd:    * device DFP3 support
2370KERN: radeon_hd: ==========================================
2371KERN: radeon_hd: encoder_init: called
2372KERN: radeon_hd: transmitterKERN: _dig_setup: connector 0, pixelClock: 0
2373KERN: radeon_hd: transmitter_dig_setup: table 1.6
2374KERN: radeon_hd: encoder_pick_dig: connector 0
2375KERN: radeon_hd: transmitter_dig_setup: connector 1, pixelClock: 0
2376KERN: radeon_hd: transmitter_dig_setup: table 1.6
2377KERN: radeon_hd: encoder_pick_dig: connector 1
2378KERN: radeon_hd: transmitter_dig_setup: connector 2, pixelClock: 0
2379KERN: radeon_hd: transmitter_dig_setup: table 1.6
2380KERN: radeon_hd: encoder_pick_dig: connector 2
2381KERN: radeon_hd: pll_set_dce: set external pll clock to 626100
2382KERN: radeon_hd: pll_set_dce: table 2.1
2383KERN: radeon_hd: pll_set_dce: set external pll clock to 626100
2384KERN: radeon_hd: pll_set_dce: table 2.1
2385KERN: radeon_hd: dp_setup_connectors
2386KERN: radeon_hd: detect_displays: connector(0): Checking DP.
2387KERN: radeon_hd: ddc2_dp_read_edid1
2388KERN: radeon_hd: dp_aux_speak: dp_aux channel flags not zero!
2389KERN: Last message repeated 6 times.
2390KERN: radeon_hd: dp_aux_transaction: IO Error. 7 attempts
2391KERN: radeon_hd: dp_aux_set_i2c_byte: aux_ch transaction failed!
2392KERN: radeon_hd: dp_aux_speak: dp_aux channel flags not zero!
2393KERN: Last message repeated 6 times.
2394KERN: radeon_hd: dp_aux_transaction: IO Error. 7 attempts
2395KERN: radeon_hd: dp_aux_set_i2c_byte: aux_ch transaction failed!
2396KERN: radeon_hd: dp_aux_speak: dp_aux channel flags not zero!
2397KERN: Last message repeated 6 times.
2398KERN: radeon_hd: dp_aux_transaction: IO Error. 7 attempts
2399KERN: radeon_hd: dp_aux_set_i2c_byte: aux_ch transaction failed!
2400KERN: radeon_hd: dp_aux_speak: dp_aux channel flags not zero!
2401KERN: Last message repeated 6 times.
2402KERN: radeon_hd: dp_aux_transaction: IO Error. 7 attempts
2403KERN: radeon_hd: dp_aux_set_i2c_byte: aux_ch transaction failed!
2404KERN: radeon_hd: dp_aux_speak: dp_aux channel flags not zero!
2405KERN: Last message repeated 6 times.
2406KERN: radeon_hd: dp_aux_transaction: IO Error. 7 attempts
2407KERN: radeon_hd: dp_aux_get_i2c_byte: aux_ch transaction failed!
2408KERN: radeon_hd: dp_aux_speak: dp_aux channel flags not zero!
2409KERN: Last message repeated 6 times.
2410KERN: radeon_hd: dp_aux_transaction: IO Error. 7 attempts
2411KERN: radeon_hd: dp_aux_get_i2c_byte: aux_ch transaction failed!
2412KERN: radeon_hd: dp_aux_speak: dp_aux channel flags not zero!
2413KERN: Last message repeated 6 times.
2414KERN: radeon_hd: dp_aux_transaction: IO Error. 7 attempts
2415KERN: radeon_hd: dp_aux_get_i2c_byte: aux_ch transaction failed!
2416KERN: radeon_hd: dp_aux_speak: dp_aux channel flags not zero!
2417KERN: Last message repeated 6 times.
2418KERN: radeon_hd: dp_aux_transaction: IO Error. 7 attempts
2419KERN: radeon_hd: dp_aux_set_i2c_byte: aux_ch transaction failed!
2420KERN: radeon_hd: dp_aux_speak: dp_aux channel flags not zero!
2421KERN: Last message repeated 6 times.
2422KERN: radeon_hd: dp_aux_transaction: IO Error. 7 attempts
2423KERN: radeon_hd: dp_aux_set_i2c_byte: aux_ch transaction failed!
2424KERN: radeon_hd: dp_aux_speak: dp_aux channel flags not zero!
2425KERN: Last message repeated 6 times.
2426KERN: radeon_hd: dp_aux_transaction: IO Error. 7 attempts
2427KERN: radeon_hd: dp_aux_get_i2c_byte: aux_ch transaction failed!
2428KERN: radeon_hd: dp_aux_speak: dp_aux channel flags not zero!
2429KERN: Last message repeated 6 times.
2430KERN: radeon_hd: dp_aux_transaction: IO Error. 7 attempts
2431KERN: radeon_hd: dp_aux_get_i2c_byte: aux_ch transaction failed!
2432KERN: radeon_hd: ddc2_dp_read_edid1: error reading EDID data at index 0, result = 0x80000001
2433KERN: radeon_hd: dp_aux_speak: dp_aux channel flags not zero!
2434KERN: Last message repeated 6 times.
2435KERN: radeon_hd: dp_aux_transaction: IO Error. 7 attempts
2436KERN: radeon_hd: dp_aux_get_i2c_byte: aux_ch transaction failed!
2437KERN: radeon_hd: detect_displays: connector(0): bit-banging ddc for EDID.
2438KERN: DDC: ddc2_read: DDC information read failure
2439KERN: Last message repeated 3 times.
2440KERN: radeon_hd: detect_displays: connector(1): bit-banging ddc for EDID.
2441KERN: [rtl81xx] (re) bus_alloc_resource(3, [24], 0x0, 0xffffffffffffffff, 0x1,0x2)
2442KERN: add_memory_type_range(3399, 0xd0304000, 0x20000, 0)
2443KERN: set MTRRs to:
2444KERN:   mtrr:  0: base: 0xbdf00000, size:   0x100000, type: 0
2445KERN:   mtrr:  1: base: 0xd0000000, size: 0x10000000, type: 0
2446KERN:   mtrr:  2: base: 0xe0000000, size: 0x20000000, type: 0
2447KERN:   mtrr:  3: base: 0xc0000000, size: 0x40000000, type: 1
2448KERN: [rtl81xx] (re) MSI count : 1
2449KERN: [rtl81xx] (re) MSI-X count : 4
2450KERN: [rtl81xx] (re) bus_alloc_resource(3, [32], 0x0, 0xffffffffffffffff, 0x1,0x2)
2451KERN: add_memory_type_range(3400, 0xd0300000, 0x20000, 0)
2452KERN: set MTRRs to:
2453KERN:   mtrr:  0: base: 0xbdf00000, size:   0x100000, type: 0
2454KERN:   mtrr:  1: base: 0xd0000000, size: 0x10000000, type: 0
2455KERN:   mtrr:  2: base: 0xe0000000, size: 0x20000000, type: 0
2456KERN:   mtrr:  3: base: 0xc0000000, size: 0x40000000, type: 1
2457KERN: add_memory_type_range(3401, 0xd0300000, 0x1000, 0)
2458KERN: set MTRRs to:
2459KERN:   mtrr:  0: base: 0xbdf00000, size:   0x100000, type: 0
2460KERN:   mtrr:  1: base: 0xd0000000, size: 0x10000000, type: 0
2461KERN:   mtrr:  2: base: 0xe0000000, size: 0x20000000, type: 0
2462KERN:   mtrr:  3: base: 0xc0000000, size: 0x40000000, type: 1
2463KERN: allocate_io_interrupt_vectors: allocated 1 vectors starting from 27
2464KERN: msi_allocate_vectors: allocated 1 vectors starting from 27
2465KERN: msix configured for 1 vectors
2466KERN: [rtl81xx] (re) Using 1 MSI-X message
2467KERN: [rtl81xx] (re) bus_alloc_resource(1, [1], 0x0, 0xffffffffffffffff, 0x1,0x2)
2468KERN: [rtl81xx] (re) Chip rev. 0x2c800000
2469KERN: [rtl81xx] (re) MAC rev. 0x00100000
2470KERN: radeon_hd: connector_read_edid: found edid monitor on connector #1
2471KERN: radeon_hd: detect_displays: connector(1): found EDID data.
2472KERN: radeon_hd: init_registers, registers for ATI chipset Polaris crt #0 loaded
2473KERN: radeon_hd: detect_displays: connector(2): bit-banging ddc for EDID.
2474KERN: DDC: ddc2_read: DDC information read failure
2475KERN: Last message repeated 3 times.
2476KERN: radeon_hd: Currently detected monitors===============
2477KERN: radeon_hd: Display #0 attached = true
2478KERN: radeon_hd:  + connector ID:   1
2479KERN: radeon_hd:  + connector type: HDMI A
2480KERN: radeon_hd:  + encoder type:   TMDS
2481KERN: radeon_hd:  + limits: Vert Min/Max: 56/76
2482KERN: radeon_hd:  + limits: Horz Min/Max: 30/83
2483KERN: radeon_hd: Display #1 attached = false
2484KERN: radeon_hd: ==========================================
2485KERN: radeon_hd: radeon_gpu_mc_setup: vramStart: 0x0, vramEnd: 0xFFFFFFF
2486KERN: radeon_hd: radeon_gpu_ring_setup called
2487KERN: radeon_hd: RingQueue: Requested 1048576 bytes for GFX RingQueue.
2488KERN: radeon_hd: RingQueue: Allocating 1048576 bytes for GFX RingQueue.
2489KERN: radeon_hd: radeon_gpu_ring_boot called
2490KERN: radeon_hd: radeon_gpu_ring_boot: TODO
2491KERN: radeon_hd: radeon_init_accelerant done
2492KERN: radeon_hd: radeon_get_edid_info
2493KERN: radeon_hd: radeon_get_preferred_mode
2494KERN: radeon_hd: radeon_get_edid_info
2495KERN: radeon_hd: radeon_accelerant_mode_count
2496KERN: radeon_hd: radeon_get_mode_list
2497KERN: radeon_hd: encoder_output_lock: true
2498KERN: radeon_hd: display_crtc_lock
2499KERN: radeon_hd: encoder_dpms_set: display 0, power: false
2500KERN: radeon_hd: encoder_dpms_set_dig: display 0, power: false
2501KERN: radeon_hd: transmitter_dig_setup: connector 1, pixelClock: 0
2502KERN: radeon_hd: transmitter_dig_setup: table 1.6
2503KERN: radeon_hd: encoder_pick_dig: connector 1
2504KERN: radeon_hd: display_crtc_dpms: crtc 0 dpms powerdown
2505KERN: radeon_hd: display_crtc_blank
2506KERN: if_initname(0xffffffff80ab3800, re, 38)
2507KERN: [rtl81xx] rtl81xx: /dev/net/rtl81xx/0
2508KERN: [rtl81xx] () Found MII: rgephy
2509KERN: [rtl81xx] () OUI 0x00e04c, model 0x0011, rev. 5
2510KERN: [rtl81xx] ()  ifmedia_add: Adding Entry...
2511KERN:   Type: Ethernet
2512KERN:   SubType: none
2513KERN: noneifmedia_add: Adding Entry...
2514KERN:   Type: Ethernet
2515KERN:   SubType: 10baseT/UTP
2516KERN: , 10baseTifmedia_add: Adding Entry...
2517KERN:   Type: Ethernet
2518KERN:   SubType: 10baseT/UTP
2519KERN:   Shared Option[0]: full-duplex
2520KERN: , 10baseT-FDXifmedia_add: Adding Entry...
2521KERN:   Type: Ethernet
2522KERN:   SubType: 100baseTX
2523KERN: , 100baseTXifmedia_add: Adding Entry...
2524KERN:   Type: Ethernet
2525KERN:   SubType: 100baseTX
2526KERN:   Shared Option[0]: full-duplex
2527KERN: , 100baseTX-FDXifmedia_add: Adding Entry...
2528KERN:   Type: Ethernet
2529KERN:   SubType: 1000baseT
2530KERN: , 1000baseTifmedia_add: Adding Entry...
2531KERN:   Type: Ethernet
2532KERN:   SubType: 1000baseT
2533KERN: , 1000baseT-masterifmedia_add: Adding Entry...
2534KERN:   Type: Ethernet
2535KERN:   SubType: 1000baseT
2536KERN:   Shared Option[0]: full-duplex
2537KERN: , 1000baseT-FDXifmedia_add: Adding Entry...
2538KERN:   Type: Ethernet
2539KERN:   SubType: 1000baseT
2540KERN:   Shared Option[0]: full-duplex
2541KERN: , 1000baseT-FDX-masterifmedia_add: Adding Entry...
2542KERN:   Type: Ethernet
2543KERN:   SubType: autoselect
2544KERN: , auto
2545KERN: Test: and [file_exists [/system/bin/FirstBootPrompt], or [not [file_exists [/boot/home/config/settings/Locale settings]], readonly ]] -> 0
2546KERN: ifmedia_set: target   Type: Ethernet
2547KERN:   SubType: autoselect
2548KERN: ifmedia_set: setting to   Type: Ethernet
2549KERN:   SubType: autoselect
2550KERN: if_attach 0xffffffff8200b318
2551KERN: msi-x enabled: 0x8003
2552KERN: rtl81xx: init_driver(0xffffffff986d8730) at 17
2553KERN: loaded driver /boot/system/add-ons/kernel/drivers/dev/net/rtl81xx
2554KERN: [33musb_asix:[0m00.10.161:init_driver::ver.0.10.1
2555KERN: loaded driver /boot/system/add-ons/kernel/drivers/dev/net/usb_asix
2556KERN: loaded driver /boot/system/add-ons/kKERN: ernel/drivers/dev/net/pegasus
2557KERN: [33musb_davicom:[0m00.10.195:init_driver::ver.0.9.5
2558KERN: loaded driver /boot/system/add-ons/kernel/drivers/dev/net/usb_davicom
2559KERN: loaded driver /boot/system/add-ons/kernel/drivers/dev/net/usb_ecm
2560KERN: sis19x:00.10.254:init_hardware::SiS19X:init_hardware()
2561KERN: register_domain(5, internet6)
2562KERN: unregister_domain(0xffffffffabbfb180, 5, internet6)
2563KERN: register_domain(9, unix)
2564KERN: unregister_domain(0xffffffffabbfb180, 9, unix)
2565KERN: register_domain(5, internet6)
2566KERN: unregister_domain(0xffffffffabbfb180, 5, internet6)
2567KERN: register_domain(1, internet)
2568KERN: unregister_domain(0xffffffffabbfb180, 1, internet)
2569KERN: register_domain(5, internet6)
2570KERN: unregister_domain(0xffffffffabbfb180, 5, internet6)
2571KERN: register_domain(5, internet6)
2572KERN: unregister_domain(0xffffffffabbfb180, 5, internet6)
2573KERN: register_domain(1, internet)
2574KERN: unregister_domain(0xffffffffabbfb200, 1, internet)
2575KERN: register_domain(5, internet6)
2576KERN: unregister_domain(0xffffffffabbfb180, 5, internet6)
2577KERN: register_domain(9, unix)
2578KERN: unregister_domain(0xffffffffabbfb180, 9, unix)
2579KERN: register_domain(5, internet6)
2580KERN: unregister_domain(0xffffffffabbfb180, 5, internet6)
2581KERN: register_domain(1, internet)
2582KERN: unregister_domain(0xffffffffabbfb180, 1, internet)
2583KERN: register_domain(5, internet6)
2584KERN: unregister_domain(0xffffffffabbfb180, 5, internet6)
2585KERN: register_domain(5, internet6)
2586KERN: unregister_domain(0xffffffffabbfb180, 5, internet6)
2587KERN: register_domain(1, internet)
2588KERN: [net/rtl81xx/0] compat_open(0x2)
2589KERN: ifmedia_ioctl: switching re to   Type: Ethernet
2590KERN:   SubType: autoselect
2591KERN: /dev/net/rtl81xx/0: media change, media 0x22 quality 1000 speed 10000000
2592KERN: register_domain(5, internet6)
2593KERN: /dev/net/rtl81xx/0: media change, media 0x900026 quality 1000 speed 10000000
2594KERN: register_domain(4, link)
2595KERN: radeon_hd: atom_op_jump: Error: AtomBIOS stuck in loop for more then 5 seconds. (4344834 identical jmp op's)
2596KERN: radeon_hd: atom_execute_table_locked: AtomBIOS parser aborted calling operation TEST_REG (0x4A) @ 0xC025
2597KERN: radeon_hd: atom_execute_table: AtomBIOS parser was aborted in table BlankCRTC (0x22)
2598KERN: radeon_hd: display_crtc_power
2599KERN: radeon_hd: encoder_assign_crtc
2600KERN: radeon_hd: encoder_assign_crtc: table 1.3
2601KERN: radeon_hd: encoder_crtc_scratch: display 0
2602KERN: radeon_hd: radeon_set_display_mode: pll 0 selected for connector 1
2603KERN: radeon_hd: pll_asic_ss_probe: No potential spread spectrum data found!
2604KERN: radeon_hd: pll_setup_flags: CRTC: 0, PLL: 0
2605KERN: radeon_hd: pll_adjust: table 1.3
2606KERN: radeon_hd: pll_adjust: was: 148500, now: 148500
2607KERN: radeon_hd: pll_compute_post_divider: vco = 2970000
2608KERN: radeon_hd: pll_compute_post_divider: postDiv = 19
2609KERN: radeon_hd: pll_compute: using minimum reference divider
2610KERN: radeon_hd: pll_compute: performing fractional feedback calculations
2611KERN: radeon_hd: pll_compute: Calculated pixel clock of 148684 based on:
2612KERN: radeon_hd: pll_compute:   referenceFrequency: 100000; referenceDivider: 4
2613KERN: radeon_hd: pll_compute:   feedbackDivider: 113; feedbackDividerFrac: 0
2614KERN: radeon_hd: pll_compute:   postDivider: 19
2615KERN: radeon_hd: pll_compute: pixel clock 148500 was changed to 148684
2616KERN: radeon_hd: pll_set: table 1.7
2617KERN: radeon_hd: pll_set: set adjusted pixel clock 148684 (was 148500)
2618KERN: radeon_hd: display_crtc_ss
2619KERN: radeon_hd: display_crtc_set_dtd called to do 1920x1080
2620KERN: radeon_hd: display_crtc_fb_set: Framebuffer at: 0x0
2621KERN: radeon_hd: display_crtc_fb_set: Set SurfaceAddress High: 0x0
2622KERN: radeon_hd: display_crtc_fb_set: Set SurfaceAddress: 0x0
2623KERN: radeon_hd: display_crtc_fb_set: fb: 1920x1080 (32 bpp)
2624KERN: radeon_hd: display_crtc_fb_set: fb pitch: 1920
2625KERN: radeon_hd: display_dce45_crtc_load_lut: crtcID 0
2626KERN: radeon_hd: display_crtc_scale
2627KERN: radeon_hd: encoder_mode_set: display 0
2628KERN: radeon_hd: encoder_dig_setup
2629KERN: radeon_hd: encoder_pick_dig: connector 1
2630KERN: radeon_hd: encoder_dig_setup: table 1.5
2631KERN: radeon_hd: encoder_dig_setup
2632KERN: radeon_hd: encoder_pick_dig: connector 1
2633KERN: radeon_hd: encoder_dig_setup: table 1.5
2634KERN: radeon_hd: encoder_apply_quirks: display 0
2635KERN: radeon_hd: display_crtc_dpms: crtc 0 dpms powerup
2636KERN: radeon_hd: display_crtc_power
2637KERN: radeon_hd: display_crtc_blank
2638KERN: radeon_hd: encoder_dpms_set: display 0, power: true
2639KERN: radeon_hd: encoder_dpms_set_dig: display 0, power: true
2640KERN: radeon_hd: encoder_dig_setup
2641KERN: radeon_hd: encoder_pick_dig: connector 1
2642KERN: radeon_hd: encoder_dig_setup: table 1.5
2643KERN: radeon_hd: encoder_dig_setup
2644KERN: radeon_hd: encoder_pick_dig: connector 1
2645KERN: radeon_hd: encoder_dig_setup: table 1.5
2646KERN: radeon_hd: transmitter_dig_setup: connector 1, pixelClock: 148684
2647KERN: radeon_hd: transmitter_dig_setup: table 1.6
2648KERN: radeon_hd: encoder_pick_dig: connector 1
2649KERN: radeon_hd: display_crtc_lock
2650KERN: radeon_hd: encoder_output_lock: false
2651KERN: radeon_hd: Current DisplayPort Info =================
2652KERN: radeon_hd: Connector #0) DP: true
2653KERN: radeon_hd:  + DP Config Data
2654KERN: radeon_hd: dp_aux_speak: dp_aux channel flags not zero!
2655KERN: Last message repeated 6 times.
2656KERN: radeon_hd: dp_aux_transaction: IO Error. 7 attempts
2657KERN: radeon_hd: dpcd_reg_read: error on DisplayPort aux read (0x80000001)
2658KERN: radeon_hd:    - max lane count:          0
2659KERN: radeon_hd: dp_aux_speak: dp_aux channel flags not zero!
2660KERN: Last message repeated 6 times.
2661KERN: radeon_hd: dp_aux_transaction: IO Error. 7 attempts
2662KERN: radeon_hd: dpcd_reg_read: error on DisplayPort aux read (0x80000001)
2663KERN: radeon_hd:    - max link rate:           0
2664KERN: radeon_hd: dp_aux_speak: dp_aux channel flags not zero!
2665KERN: Last message repeated 6 times.
2666KERN: radeon_hd: dp_aux_transaction: IO Error. 7 attempts
2667KERN: radeon_hd: dpcd_reg_read: error on DisplayPort aux read (0x80000001)
2668KERN: radeon_hd:    - receiver port count:     0
2669KERN: radeon_hd: dp_aux_speak: dp_aux channel flags not zero!
2670KERN: Last message repeated 6 times.
2671KERN: radeon_hd: dp_aux_transaction: IO Error. 7 attempts
2672KERN: radeon_hd: dpcd_reg_read: error on DisplayPort aux read (0x80000001)
2673KERN: radeon_hd:    - downstream port present: no
2674KERN: radeon_hd: dp_aux_speak: dp_aux channel flags not zero!
2675KERN: Last message repeated 6 times.
2676KERN: radeon_hd: dp_aux_transaction: IO Error. 7 attempts
2677KERN: radeon_hd: dpcd_reg_read: error on DisplayPort aux read (0x80000001)
2678KERN: radeon_hd:    - downstream port count:   0
2679KERN: radeon_hd:  + Training
2680KERN: radeon_hd:    - attempts:                0
2681KERN: radeon_hd:    - delay:                   0
2682KERN: radeon_hd:  + Data
2683KERN: radeon_hd:    - auxPin:                  0x90
2684KERN: radeon_hd:  + Video
2685KERN: radeon_hd:    - laneCount:               0
2686KERN: radeon_hd:    - linkRate:                0
2687KERN: radeon_hd: Connector #1) DP: false
2688KERN: radeon_hd: Connector #2) DP: false
2689KERN: radeon_hd: ==========================================
2690KERN: radeon_hd: D1CRTC_STATUS        Value: 0x0
2691KERN: radeon_hd: D2CRTC_STATUS        Value: 0x0
2692KERN: radeon_hd: D1CRTC_CONTROL       Value: 0xAAAAAAAA
2693KERN: radeon_hd: D2CRTC_CONTROL       Value: 0x0
2694KERN: radeon_hd: D1GRPH_ENABLE        Value: 0x0
2695KERN: radeon_hd: D2GRPH_ENABLE        Value: 0x0
2696KERN: radeon_hd: D1SCL_ENABLE         Value: 0x0
2697KERN: radeon_hd: D2SCL_ENABLE         Value: 0x0
2698KERN: radeon_hd: D1CRTC_BLANK_CONTROL Value: 0x0
2699KERN: radeon_hd: D2CRTC_BLANK_CONTROL Value: 0x0
2700KERN: radeon_hd: radeon_get_frame_buffer_config
2701KERN: ahci: sg_memcpy phyAddr 0x231e4798, size 8
2702KERN: ahci: sg_memcpy phyAddr 0x231e4728, size 8
2703KERN: bfs: mounted "RoiRed" (root node at 524288, device = /dev/disk/scsi/0/3/0/1)
2704KERN: loaded driver /boot/system/add-ons/kernel/drivers/dev/input/wacom
2705KERN: ps2_hid: init_hardware
2706KERN: ps2_hid: init_driver
2707KERN: ps2_hid: publish_devices
2708KERN: ps2_hid: uninit_driver
2709KERN: loaded driver /boot/system/add-ons/kernel/drivers/dev/input/ps2_hid
2710KERN: slab memory manager: created area 0xffffffffbc801000 (5855)
2711KERN: ps2: reset failed
2712KERN: ps2: devfs_publish_device input/mouse/ps2/0, status = 0xffffffff
2713KERN: ps2: devfs_publish_device input/keyboard/at/0, status = 0x00000000
2714KERN: loaded driver /boot/system/add-ons/kernel/drivers/dev/input/usb_hid
2715KERN: ps2: keyboard reset failed, status 0x80000001, data 0xff
2716KERN: ps2: keyboard probing failed
2717KERN: KeyboardDevice: error when opening /dev/input/keyboard/at/0: No error
2718KERN: ps2: devfs_unpublish_device input/keyboard/at/0, status = 0x00000000
2719KERN: usb_hid: keyboard device unhandled control 0x00002710
2720KERN: Last message repeated 3 times.
2721KERN: pci_reserve_device(1, 0, 1, hda)
2722KERN: HDA: Detected controller @ PCI:1:0:1, IRQ:19, type 1002/aae0 (1462/aae0)
2723KERN: pci_reserve_device(0, 20, 2, hda)
2724KERN: HDA: Detected controller @ PCI:0:20:2, IRQ:16, type 1022/780d (1849/8892)
2725KERN: loaded driver /boot/system/add-ons/kernel/drivers/dev/audio/hmulti/hda
2726KERN: emuxki: init_hardware()
2727KERN: auich: init_hardware()
2728KERN: auvia: init_hardware()
2729KERN: echo3g: init_hardware()
2730KERN: echo3g: no card found
2731KERN: sis7018:init_hardware:ver:2.0.2
2732KERN: module: Search for bus_managers/ide/controller/driver_v1 failed.
2733KERN: loading dependent module bus_managers/ide/controller/driver_v1 of busses/ata/silicon_image_3112/driver_v1 failed!
2734KERN: module: Search for bus_managers/ide/controller/driver_v1 failed.
2735KERN: loading dependent module bus_managers/ide/controller/driver_v1 of busses/ata/legacy_sata/driver_v1 failed!
2736KERN: module: Search for bus_managers/ide/controller/driver_v1 failed.
2737KERN: loading dependent module bus_managers/ide/controller/driver_v1 of busses/ata/highpoint_ide_pci/driver_v1 failed!
2738KERN: module: Search for bus_managers/ide/controller/driver_v1 failed.
2739KERN: loading dependent module bus_managers/ide/controller/driver_v1 of busses/ata/generic_ide_pci/driver_v1 failed!
2740KERN: module: Search for bus_managers/ide/controller/driver_v1 failed.
2741KERN: loading dependent module bus_managers/ide/controller/driver_v1 of generic/ata_adapter/v1 failed!
2742KERN: loading dependent module generic/ata_adapter/v1 of busses/ata/it8211/driver_v1 failed!
2743KERN: module: Search for bus_managers/ide/controller/driver_v1 failed.
2744KERN: loading dependent module bus_managers/ide/controller/driver_v1 of busses/ata/silicon_image_3112/driver_v1 failed!
2745KERN: module: Search for bus_managers/ide/controller/driver_v1 failed.
2746KERN: loading dependent module bus_managers/ide/controller/driver_v1 of busses/ata/legacy_sata/driver_v1 failed!
2747KERN: module: Search for bus_managers/ide/controller/driver_v1 failed.
2748KERN: loading dependent module bus_managers/ide/controller/driver_v1 of busses/ata/highpoint_ide_pci/driver_v1 failed!
2749KERN: module: Search for bus_managers/ide/controller/driver_v1 failed.
2750KERN: loading dependent module bus_managers/ide/controller/driver_v1 of busses/ata/generic_ide_pci/driver_v1 failed!
2751KERN: module: Search for bus_managers/ide/controller/driver_v1 failed.
2752KERN: loading dependent module bus_managers/ide/controller/driver_v1 of generic/ata_adapter/v1 failed!
2753KERN: loading dependent module generic/ata_adapter/v1 of busses/ata/it8211/driver_v1 failed!
2754KERN: loaded driver /boot/system/add-ons/kernel/drivers/dev/bus/usb_raw
2755KERN: add_memory_type_range(7008, 0xff660000, 0x4000, 0)
2756KERN: set MTRRs to:
2757KERN:   mtrr:  0: base: 0xbdf00000, size:   0x100000, type: 0
2758KERN:   mtrr:  1: base: 0xd0000000, size: 0x10000000, type: 0
2759KERN:   mtrr:  2: base: 0xe0000000, size: 0x20000000, type: 0
2760KERN:   mtrr:  3: base: 0xc0000000, size: 0x40000000, type: 1
2761KERN: allocate_io_interrupt_vectors: allocated 1 vectors starting from 28
2762KERN: msi_allocate_vectors: allocated 1 vectors starting from 28
2763KERN: msi enabled: 0x0081
2764KERN: hda: using MSI vector 28
2765KERN: hda: DMA snooping: no
2766KERN: hda: HDA v1.0, O:5/I:0/B:0, #SDO:1, 64bit:yes
2767KERN: add_memory_type_range(7011, 0x491f5000, 0x1000, 0)
2768KERN: set MTRRs to:
2769KERN:   mtrr:  0: base: 0x491f5000, size:     0x1000, type: 0
2770KERN:   mtrr:  1: base: 0xbdf00000, size:   0x100000, type: 0
2771KERN:   mtrr:  2: base: 0xd0000000, size: 0x10000000, type: 0
2772KERN:   mtrr:  3: base: 0xe0000000, size: 0x20000000, type: 0
2773KERN:   mtrr:  4: base: 0xc0000000, size: 0x40000000, type: 1
2774KERN: hda: Codec 0 Vendor: 1002 Product: aa01, Revision: 1.0.7.0 Quirks: 0700
2775KERN: hda: Audio Group: Output delay: 0 samples, Input delay: 0 samples, Beep Generator: no
2776KERN: hda:   #GPIO: 0, #GPO: 0, #GPI: 0, unsol: no, wake: no
2777KERN: hda:  Supported formats: 16bits
2778KERN: hda:  Supported rates: 32khz 44khz 48khz
2779KERN: hda:   widget start 2, count 12
2780KERN: hda: 2: Audio output
2781KERN: hda:  Supported formats: 16bits
2782KERN: hda:  Supported rates: 32khz 44khz 48khz
2783KERN: hda:  Supported power states:
2784KERN: hda:  [Digital] [Stripe] [Stereo]
2785KERN: hda: 3: Pin complex
2786KERN: hda:  [Output]
2787KERN: hda:  Jack, HDMI Digital other out, Other digital, N/A, Association:15
2788KERN: hda:  Supported power states:
2789KERN: hda:  [Digital] [Conn. list] [Unsol. responses] [Stereo]
2790KERN: hda:  Inputs: <2>
2791KERN: hda: 4: Audio output
2792KERN: hda:  Supported formats: 16bits
2793KERN: hda:  Supported rates: 32khz 44khz 48khz
2794KERN: hda:  Supported power states:
2795KERN: hda:  [Digital] [Stripe] [Stereo]
2796KERN: hda: 5: Pin complex
2797KERN: hda:  [Output]
2798KERN: hda:  Jack, HDMI Digital other out, Other digital, N/A, Association:15
2799KERN: hda:  Supported power states:
2800KERN: hda:  [Digital] [Conn. list] [Unsol. responses] [Stereo]
2801KERN: hda:  Inputs: <4>
2802KERN: hda: 6: Audio output
2803KERN: hda:  Supported formats: 16bits
2804KERN: hda:  Supported rates: 32khz 44khz 48khz
2805KERN: hda:  Supported power states:
2806KERN: hda:  [Digital] [Stripe] [Stereo]
2807KERN: hda: 7: Pin complex
2808KERN: hda:  [Output]
2809KERN: hda:  Jack, HDMI Digital other out, Other digital, N/A, Association:15
2810KERN: hda:  Supported power states:
2811KERN: hda:  [Digital] [Conn. list] [Unsol. responses] [Stereo]
2812KERN: hda:  Inputs: <6>
2813KERN: hda: 8: Audio output
2814KERN: hda:  Supported formats: 16bits
2815KERN: hda:  Supported rates: 32khz 44khz 48khz
2816KERN: hda:  Supported power states:
2817KERN: hda:  [Digital] [Stripe] [Stereo]
2818KERN: hda: 9: Pin complex
2819KERN: hda:  [Output]
2820KERN: hda:  Jack, HDMI Digital other out, Other digital, N/A, Association:15
2821KERN: hda:  Supported power states:
2822KERN: hda:  [Digital] [Conn. list] [Unsol. responses] [Stereo]
2823KERN: hda:  Inputs: <8>
2824KERN: hda: 10: Audio output
2825KERN: hda:  Supported formats: 16bits
2826KERN: hda:  Supported rates: 32khz 44khz 48khz
2827KERN: hda:  Supported power states:
2828KERN: hda:  [Digital] [Stripe] [Stereo]
2829KERN: hda: 11: Pin complex
2830KERN: hda:  [Output]
2831KERN: hda:  Jack, HDMI Digital other out, Other digital, N/A, Association:15
2832KERN: hda:  Supported power states:
2833KERN: hda:  [Digital] [Conn. list] [Unsol. responses] [Stereo]
2834KERN: hda:  Inputs: <10>
2835KERN: hda: 12: Audio output
2836KERN: hda:  Supported formats: 16bits
2837KERN: hda:  Supported rates: 32khz 44khz 48khz
2838KERN: hda:  Supported power states:
2839KERN: hda:  [Digital] [Stripe] [Stereo]
2840KERN: hda: 13: Pin complex
2841KERN: hda:  [Output]
2842KERN: hda:  None, HDMI Digital other out, Other digital, N/A, Association:15
2843KERN: hda:  Supported power states:
2844KERN: hda:  [Digital] [Conn. list] [Unsol. responses] [Stereo]
2845KERN: hda:  Inputs: <12>
2846KERN: hda: build output tree: use mixer
2847KERN: hda:   look at pin widget 3 (1 inputs)
2848KERN: hda:     try widget 2: 0xffffffffabdcb408
2849KERN: hda:   look at pin widget 5 (1 inputs)
2850KERN: hda:     try widget 4: 0xffffffffabdcb560
2851KERN: hda:   look at pin widget 7 (1 inputs)
2852KERN: hda:     try widget 6: 0xffffffffabdcb6b8
2853KERN: hda:   look at pin widget 9 (1 inputs)
2854KERN: hda:     try widget 8: 0xffffffffabdcb810
2855KERN: hda:   look at pin widget 11 (1 inputs)
2856KERN: hda:     try widget 10: 0xffffffffabdcb968
2857KERN: hda:   look at pin widget 13 (1 inputs)
2858KERN: hda:     try widget 12: 0xffffffffabdcbac0
2859KERN: hda: try without mixer!
2860KERN: hda: build output tree: don't use mixer
2861KERN: hda:   look at pin widget 3 (1 inputs)
2862KERN: hda:     try widget 2: 0xffffffffabdcb408
2863KERN: hda:     widget 2 is candidate
2864KERN: hda:       output: added output widget 2
2865KERN: hda:     add pin widget 3
2866KERN: hda:   look at pin widget 5 (1 inputs)
2867KERN: hda:     try widget 4: 0xffffffffabdcb560
2868KERN: hda:     widget 4 is candidate
2869KERN: hda:       output: added output widget 4
2870KERN: hda:     add pin widget 5
2871KERN: hda:   look at pin widget 7 (1 inputs)
2872KERN: hda:     try widget 6: 0xffffffffabdcb6b8
2873KERN: hda:     widget 6 is candidate
2874KERN: hda:       output: added output widget 6
2875KERN: hda:     add pin widget 7
2876KERN: hda:   look at pin widget 9 (1 inputs)
2877KERN: hda:     try widget 8: 0xffffffffabdcb810
2878KERN: hda:     widget 8 is candidate
2879KERN: hda:       output: added output widget 8
2880KERN: hda:     add pin widget 9
2881KERN: hda:   look at pin widget 11 (1 inputs)
2882KERN: hda:     try widget 10: 0xffffffffabdcb968
2883KERN: hda:     widget 10 is candidate
2884KERN: hda:       output: added output widget 10
2885KERN: hda:     add pin widget 11
2886KERN: hda:   look at pin widget 13 (1 inputs)
2887KERN: hda:     try widget 12: 0xffffffffabdcbac0
2888KERN: hda:     widget 12 is candidate
2889KERN: hda:       output: added output widget 12
2890KERN: hda:     add pin widget 13
2891KERN: hda: build input tree
2892KERN: hda: build input tree failed
2893KERN: hda: build tree!
2894KERN: hda:  Audiogroup:
2895KERN: hda: 2: Audio output
2896KERN: hda:  Supported power states:
2897KERN: hda:  [Digital] [Stripe] [Stereo]
2898KERN: hda: 3: Pin complex
2899KERN: hda:  [Pres Detect][Output]
2900KERN: hda:  Supported power states:
2901KERN: hda:  [Digital] [Conn. list] [Unsol. responses] [Stereo]
2902KERN: hda:  Inputs: <2>
2903KERN: hda: 4: Audio output
2904KERN: hda:  Supported power states:
2905KERN: hda:  [Digital] [Stripe] [Stereo]
2906KERN: hda: 5: Pin complex
2907KERN: hda:  [Pres Detect][Output]
2908KERN: hda:  Supported power states:
2909KERN: hda:  [Digital] [Conn. list] [Unsol. responses] [Stereo]
2910KERN: hda:  Inputs: <4>
2911KERN: hda: 6: Audio output
2912KERN: hda:  Supported power states:
2913KERN: hda:  [Digital] [Stripe] [Stereo]
2914KERN: hda: 7: Pin complex
2915KERN: hda:  [Pres Detect][Output]
2916KERN: hda:  Supported power states:
2917KERN: hda:  [Digital] [Conn. list] [Unsol. responses] [Stereo]
2918KERN: hda:  Inputs: <6>
2919KERN: hda: 8: Audio output
2920KERN: hda:  Supported power states:
2921KERN: hda:  [Digital] [Stripe] [Stereo]
2922KERN: hda: 9: Pin complex
2923KERN: hda:  [Pres Detect][Output]
2924KERN: hda:  Supported power states:
2925KERN: hda:  [Digital] [Conn. list] [Unsol. responses] [Stereo]
2926KERN: hda:  Inputs: <8>
2927KERN: hda: 10: Audio output
2928KERN: hda:  Supported power states:
2929KERN: hda:  [Digital] [Stripe] [Stereo]
2930KERN: hda: 11: Pin complex
2931KERN: hda:  [Pres Detect][Output]
2932KERN: hda:  Supported power states:
2933KERN: hda:  [Digital] [Conn. list] [Unsol. responses] [Stereo]
2934KERN: hda:  Inputs: <10>
2935KERN: hda: 12: Audio output
2936KERN: hda:  Supported power states:
2937KERN: hda:  [Digital] [Stripe] [Stereo]
2938KERN: hda: 13: Pin complex
2939KERN: hda:  [Pres Detect][Output]
2940KERN: hda:  Supported power states:
2941KERN: hda:  [Digital] [Conn. list] [Unsol. responses] [Stereo]
2942KERN: hda:  Inputs: <12>
2943KERN: hda: Enabled unsolicited responses on widget 3
2944KERN: hda: Enabled unsolicited responses on widget 5
2945KERN: hda: Enabled unsolicited responses on widget 7
2946KERN: hda: Enabled unsolicited responses on widget 9
2947KERN: hda: Enabled unsolicited responses on widget 11
2948KERN: hda: Enabled unsolicited responses on widget 13
2949KERN: hda: ENABLE pin widget 3
2950KERN: hda: ENABLE pin widget 5
2951KERN: hda: ENABLE pin widget 7
2952KERN: hda: ENABLE pin widget 9
2953KERN: hda: ENABLE pin widget 11
2954KERN: hda: ENABLE pin widget 13
2955KERN: hda: hda_audio_group_get_widgets failed for  playback stream
2956KERN: hda: hda_audio_group_get_widgets failed for record stream
2957KERN: hda: streams playback 0x0000000000000000, record 0x0000000000000000
2958KERN: hda: Failed to setup new audio function group (No such device)!
2959KERN: hda: no active codec
2960KERN: remove_memory_type_range(7008, 0xff660000, 0x4000, 0)
2961KERN: set MTRRs to:
2962KERN:   mtrr:  0: base: 0x491f5000, size:     0x1000, type: 0
2963KERN:   mtrr:  1: base: 0xbdf00000, size:   0x100000, type: 0
2964KERN:   mtrr:  2: base: 0xd0000000, size: 0x10000000, type: 0
2965KERN:   mtrr:  3: base: 0xe0000000, size: 0x20000000, type: 0
2966KERN:   mtrr:  4: base: 0xc0000000, size: 0x40000000, type: 1
2967KERN: hda: ERROR: No such device(80007007)
2968KERN: add_memory_type_range(7014, 0xff700000, 0x4000, 0)
2969KERN: set MTRRs to:
2970KERN:   mtrr:  0: base: 0x491f5000, size:     0x1000, type: 0
2971KERN:   mtrr:  1: base: 0xbdf00000, size:   0x100000, type: 0
2972KERN:   mtrr:  2: base: 0xd0000000, size: 0x10000000, type: 0
2973KERN:   mtrr:  3: base: 0xe0000000, size: 0x20000000, type: 0
2974KERN:   mtrr:  4: base: 0xc0000000, size: 0x40000000, type: 1
2975KERN: hda: DMA snooping: no
2976KERN: hda: HDA v1.0, O:4/I:4/B:0, #SDO:1, 64bit:yes
2977KERN: add_memory_type_range(7015, 0x493c8000, 0x1000, 0)
2978KERN: set MTRRs to:
2979KERN:   mtrr:  0: base: 0x491f5000, size:     0x1000, type: 0
2980KERN:   mtrr:  1: base: 0x493c8000, size:     0x1000, type: 0
2981KERN:   mtrr:  2: base: 0xbdf00000, size:   0x100000, type: 0
2982KERN:   mtrr:  3: base: 0xd0000000, size: 0x10000000, type: 0
2983KERN:   mtrr:  4: base: 0xe0000000, size: 0x20000000, type: 0
2984KERN:   mtrr:  5: base: 0xc0000000, size: 0x40000000, type: 1
2985KERN: hda: Codec 0 Vendor: 10ec Product: 0892, Revision: 1.0.3.2 Quirks: 0700
2986KERN: hda: Audio Group: Output delay: 15 samples, Input delay: 15 samples, Beep Generator: yes
2987KERN: hda:   #GPIO: 2, #GPO: 0, #GPI: 0, unsol: yes, wake: no
2988KERN: hda:  Supported formats: 16bits 20bits 24bits
2989KERN: hda:  Supported rates: 32khz 44khz 48khz 88khz 96khz 192khz
2990KERN: hda:   widget start 2, count 37
2991KERN: hda: 2: Audio output
2992KERN: hda:  Supported formats: 16bits 20bits 24bits
2993KERN: hda:  Supported rates: 44khz 48khz 96khz 192khz
2994KERN: hda:  Supported power states: D0 D1 D2 D3
2995KERN: hda:  [Power] [Format override] [Amplifier override] [Out amplifier] [Stereo]
2996KERN: hda:  Out Amp: step size: 1 dB, # steps: 64, offset to 0 dB: 64
2997KERN: hda: 3: Audio output
2998KERN: hda:  Supported formats: 16bits 20bits 24bits
2999KERN: hda:  Supported rates: 44khz 48khz 96khz 192khz
3000KERN: hda:  Supported power states: D0 D1 D2 D3
3001KERN: hda:  [Power] [Format override] [Amplifier override] [Out amplifier] [Stereo]
3002KERN: hda:  Out Amp: step size: 1 dB, # steps: 64, offset to 0 dB: 64
3003KERN: hda: 4: Audio output
3004KERN: hda:  Supported formats: 16bits 20bits 24bits
3005KERN: hda:  Supported rates: 44khz 48khz 96khz 192khz
3006KERN: hda:  Supported power states: D0 D1 D2 D3
3007KERN: hda:  [Power] [Format override] [Amplifier override] [Out amplifier] [Stereo]
3008KERN: hda:  Out Amp: step size: 1 dB, # steps: 64, offset to 0 dB: 64
3009KERN: hda: 5: Audio output
3010KERN: hda:  Supported formats: 16bits 20bits 24bits
3011KERN: hda:  Supported rates: 44khz 48khz 96khz 192khz
3012KERN: hda:  Supported power states: D0 D1 D2 D3
3013KERN: hda:  [Power] [Format override] [Amplifier override] [Out amplifier] [Stereo]
3014KERN: hda:  Out Amp: step size: 1 dB, # steps: 64, offset to 0 dB: 64
3015KERN: hda: 6: Audio output
3016KERN: hda:  Supported formats: 16bits 20bits 24bits
3017KERN: hda:  Supported rates: 32khz 44khz 48khz 88khz 96khz 192khz
3018KERN: hda:  Supported power states: D0 D1 D2 D3
3019KERN: hda:  [Power] [Digital] [Format override] [Stereo]
3020KERN: hda: 7: Vendor defined
3021KERN: hda:  Supported power states: D0
3022KERN: hda: 8: Audio input
3023KERN: hda:  Supported formats: 16bits 20bits 24bits
3024KERN: hda:  Supported rates: 44khz 48khz 96khz 192khz
3025KERN: hda:  Supported power states: D0 D1 D2 D3
3026KERN: hda:  [Power] [Conn. list] [Format override] [Amplifier override] [In amplifier] [Stereo]
3027KERN: hda:  In Amp: supports mute, step size: 1 dB, # steps: 46, offset to 0 dB: 16
3028KERN: hda:  Inputs: <35>
3029KERN: hda: 9: Audio input
3030KERN: hda:  Supported formats: 16bits 20bits 24bits
3031KERN: hda:  Supported rates: 44khz 48khz 96khz 192khz
3032KERN: hda:  Supported power states: D0 D1 D2 D3
3033KERN: hda:  [Power] [Conn. list] [Format override] [Amplifier override] [In amplifier] [Stereo]
3034KERN: hda:  In Amp: supports mute, step size: 1 dB, # steps: 46, offset to 0 dB: 16
3035KERN: hda:  Inputs: <34>
3036KERN: hda: 10: Audio input
3037KERN: hda:  Supported formats: 16bits 20bits 24bits
3038KERN: hda:  Supported rates: 44khz 48khz 96khz 192khz
3039KERN: hda:  Supported power states: D0 D1 D2 D3
3040KERN: hda:  [Power] [Digital] [Conn. list] [Format override] [Stereo]
3041KERN: hda:  Inputs: <31>
3042KERN: hda: 11: Audio mixer
3043KERN: hda:  Supported power states: D0
3044KERN: hda:  [Conn. list] [Amplifier override] [In amplifier] [Stereo]
3045KERN: hda:  In Amp: supports mute, step size: 1.5 dB, # steps: 31, offset to 0 dB: 23
3046KERN: hda:  Inputs: 24 25 26 27 28 29 20 21 22 23
3047KERN: hda: 12: Audio mixer
3048KERN: hda:  Supported power states: D0
3049KERN: hda:  [Conn. list] [Amplifier override] [In amplifier] [Stereo]
3050KERN: hda:  In Amp: supports mute, step size: 0.25 dB, # steps: 0, offset to 0 dB: 0
3051KERN: hda:  Inputs: 2 11
3052KERN: hda: 13: Audio mixer
3053KERN: hda:  Supported power states: D0
3054KERN: hda:  [Conn. list] [Amplifier override] [In amplifier] [Stereo]
3055KERN: hda:  In Amp: supports mute, step size: 0.25 dB, # steps: 0, offset to 0 dB: 0
3056KERN: hda:  Inputs: 3 11
3057KERN: hda: 14: Audio mixer
3058KERN: hda:  Supported power states: D0
3059KERN: hda:  [Conn. list] [Amplifier override] [In amplifier] [Stereo]
3060KERN: hda:  In Amp: supports mute, step size: 0.25 dB, # steps: 0, offset to 0 dB: 0
3061KERN: hda:  Inputs: 4 11
3062KERN: hda: 15: Audio mixer
3063KERN: hda:  Supported power states: D0
3064KERN: hda:  [Conn. list] [Amplifier override] [In amplifier] [Stereo]
3065KERN: hda:  In Amp: supports mute, step size: 0.25 dB, # steps: 0, offset to 0 dB: 0
3066KERN: hda:  Inputs: 5 11
3067KERN: hda: 16: Audio output
3068KERN: hda:  Supported formats: 16bits 20bits 24bits
3069KERN: hda:  Supported rates: 32khz 44khz 48khz 88khz 96khz 192khz
3070KERN: hda:  Supported power states: D0 D1 D2 D3
3071KERN: hda:  [Power] [Digital] [Format override] [Stereo]
3072KERN: hda: 17: Pin complex
3073KERN: hda:  [Output]
3074KERN: hda:  None, Speaker, 1/8", Black, Association:15
3075KERN: hda:  Supported power states: D0 D1 D2 D3
3076KERN: hda:  [Power] [Digital] [Conn. list] [Unsol. responses] [Stereo]
3077KERN: hda:  Inputs: <16>
3078KERN: hda: 18: Pin complex
3079KERN: hda:  [Input]
3080KERN: hda:  None, Speaker, 1/8", Black, Association:15
3081KERN: hda:  Supported power states: D0 D1 D2 D3
3082KERN: hda:  [Power] [Stereo]
3083KERN: hda: 19: Vendor defined
3084KERN: hda:  Supported power states: D0
3085KERN: hda: 20: Pin complex
3086KERN: hda:  [Input] [Output]
3087KERN: hda:  Jack, Line out, 1/8", Green, Association:1
3088KERN: hda:  Supported power states: D0 D1 D2 D3
3089KERN: hda:  [Power] [Conn. list] [Unsol. responses] [Amplifier override] [Out amplifier] [Stereo]
3090KERN: hda:  Out Amp: supports mute, step size: 0.25 dB, # steps: 0, offset to 0 dB: 0
3091KERN: hda:  Inputs: <12>
3092KERN: hda: 21: Pin complex
3093KERN: hda:  [Input] [Output]
3094KERN: hda:  Jack, Line out, 1/8", Black, Association:1
3095KERN: hda:  Supported power states: D0 D1 D2 D3
3096KERN: hda:  [Power] [Conn. list] [Unsol. responses] [Amplifier override] [Out amplifier] [Stereo]
3097KERN: hda:  Out Amp: supports mute, step size: 0.25 dB, # steps: 0, offset to 0 dB: 0
3098KERN: hda:  Inputs: <13>
3099KERN: hda: 22: Pin complex
3100KERN: hda:  [Input] [Output]
3101KERN: hda:  Jack, Line out, 1/8", Orange, Association:1
3102KERN: hda:  Supported power states: D0 D1 D2 D3
3103KERN: hda:  [Power] [Conn. list] [Unsol. responses] [Amplifier override] [Out amplifier] [Stereo]
3104KERN: hda:  Out Amp: supports mute, step size: 0.25 dB, # steps: 0, offset to 0 dB: 0
3105KERN: hda:  Inputs: <14>
3106KERN: hda: 23: Pin complex
3107KERN: hda:  [Input] [Output]
3108KERN: hda:  None, Speaker, 1/8", Black, Association:15
3109KERN: hda:  Supported power states: D0 D1 D2 D3
3110KERN: hda:  [Power] [Conn. list] [Unsol. responses] [Amplifier override] [Out amplifier] [Stereo]
3111KERN: hda:  Out Amp: supports mute, step size: 0.25 dB, # steps: 0, offset to 0 dB: 0
3112KERN: hda:  Inputs: <15>
3113KERN: hda: 24: Pin complex
3114KERN: hda:  [Input] [Output]
3115KERN: hda:  Jack, Mic in, 1/8", Pink, Association:4
3116KERN: hda:  Supported power states: D0 D1 D2 D3
3117KERN: hda:  [Power] [Conn. list] [Unsol. responses] [Amplifier override] [Out amplifier] [In amplifier] [Stereo]
3118KERN: hda:  In Amp: step size: 10 dB, # steps: 3, offset to 0 dB: 0
3119KERN: hda:  Out Amp: supports mute, step size: 0.25 dB, # steps: 0, offset to 0 dB: 0
3120KERN: hda:  Inputs: 12 13 14 15 38
3121KERN: hda: 25: Pin complex
3122KERN: hda:  [Input] [Output]
3123KERN: hda:  Jack, Front Mic in, 1/8", Pink, Association:5
3124KERN: hda:  Supported power states: D0 D1 D2 D3
3125KERN: hda:  [Power] [Conn. list] [Unsol. responses] [Amplifier override] [Out amplifier] [In amplifier] [Stereo]
3126KERN: hda:  In Amp: step size: 10 dB, # steps: 3, offset to 0 dB: 0
3127KERN: hda:  Out Amp: supports mute, step size: 0.25 dB, # steps: 0, offset to 0 dB: 0
3128KERN: hda:  Inputs: 12 13 14 15 38
3129KERN: hda: 26: Pin complex
3130KERN: hda:  [Input] [Output]
3131KERN: hda:  Jack, Line in, 1/8", Blue, Association:4
3132KERN: hda:  Supported power states: D0 D1 D2 D3
3133KERN: hda:  [Power] [Conn. list] [Unsol. responses] [Amplifier override] [Out amplifier] [In amplifier] [Stereo]
3134KERN: hda:  In Amp: step size: 10 dB, # steps: 3, offset to 0 dB: 0
3135KERN: hda:  Out Amp: supports mute, step size: 0.25 dB, # steps: 0, offset to 0 dB: 0
3136KERN: hda:  Inputs: 12 13 14 15 38
3137KERN: hda: 27: Pin complex
3138KERN: hda:  [Input] [Output]
3139KERN: hda:  Jack, Front HP out, 1/8", Green, Association:2
3140KERN: hda:  Supported power states: D0 D1 D2 D3
3141KERN: hda:  [Power] [Conn. list] [Unsol. responses] [Amplifier override] [Out amplifier] [In amplifier] [Stereo]
3142KERN: hda:  In Amp: step size: 10 dB, # steps: 3, offset to 0 dB: 0
3143KERN: hda:  Out Amp: supports mute, step size: 0.25 dB, # steps: 0, offset to 0 dB: 0
3144KERN: hda:  Inputs: 12 13 14 15 38
3145KERN: hda: 28: Pin complex
3146KERN: hda:  [Input]
3147KERN: hda:  None, Speaker, 1/8", Black, Association:15
3148KERN: hda:  Supported power states: D0 D1 D2 D3
3149KERN: hda:  [Power] [Unsol. responses] [Stereo]
3150KERN: hda: 29: Pin complex
3151KERN: hda:  [Input]
3152KERN: hda:  None, Line out, Optical, White, Association:0
3153KERN: hda:  Supported power states: D0 D1 D2 D3
3154KERN: hda:  [Power]
3155KERN: hda: 30: Pin complex
3156KERN: hda:  [Output]
3157KERN: hda:  Jack, SPDIF out, Optical, Grey, Association:3
3158KERN: hda:  Supported power states: D0 D1 D2 D3
3159KERN: hda:  [Power] [Digital] [Conn. list] [Unsol. responses] [Stereo]
3160KERN: hda:  Inputs: <6>
3161KERN: hda: 31: Pin complex
3162KERN: hda:  [Input]
3163KERN: hda:  None, Speaker, 1/8", Black, Association:15
3164KERN: hda:  Supported power states: D0 D1 D2 D3
3165KERN: hda:  [Power] [Digital] [Unsol. responses] [Stereo]
3166KERN: hda: 32: Vendor defined
3167KERN: hda:  Supported power states: D0
3168KERN: hda:  [Proc widget]
3169KERN: hda: 33: Vendor defined
3170KERN: hda:  Supported power states: D0
3171KERN: hda: 34: Audio mixer
3172KERN: hda:  Supported power states: D0
3173KERN: hda:  [Conn. list] [Amplifier override] [In amplifier] [Stereo]
3174KERN: hda:  In Amp: supports mute, step size: 0.25 dB, # steps: 0, offset to 0 dB: 0
3175KERN: hda:  Inputs: 24 25 26 27 28 29 20 21 22 23 11 18
3176KERN: hda: 35: Audio mixer
3177KERN: hda:  Supported power states: D0
3178KERN: hda:  [Conn. list] [Amplifier override] [In amplifier] [Stereo]
3179KERN: hda:  In Amp: supports mute, step size: 0.25 dB, # steps: 0, offset to 0 dB: 0
3180KERN: hda:  Inputs: 24 25 26 27 28 29 20 21 22 23 11
3181KERN: hda: 36: Vendor defined
3182KERN: hda:  Supported power states: D0
3183KERN: hda: 37: Audio output
3184KERN: hda:  Supported formats: 16bits 20bits 24bits
3185KERN: hda:  Supported rates: 44khz 48khz 96khz 192khz
3186KERN: hda:  Supported power states: D0 D1 D2 D3
3187KERN: hda:  [Power] [Format override] [Amplifier override] [Out amplifier] [Stereo]
3188KERN: hda:  Out Amp: step size: 1 dB, # steps: 64, offset to 0 dB: 64
3189KERN: hda: 38: Audio mixer
3190KERN: hda:  Supported power states: D0
3191KERN: hda:  [Conn. list] [Amplifier override] [In amplifier] [Stereo]
3192KERN: hda:  In Amp: supports mute, step size: 0.25 dB, # steps: 0, offset to 0 dB: 0
3193KERN: hda:  Inputs: 37 11
3194KERN: hda: build output tree: use mixer
3195KERN: hda:   look at pin widget 17 (1 inputs)
3196KERN: hda:     try widget 16: 0xffffffff820f3d68
3197KERN: hda:   look at pin widget 20 (1 inputs)
3198KERN: hda:     try widget 12: 0xffffffff820f3ab8
3199KERN: hda:     widget 12 is candidate
3200KERN: hda:         output: added output widget 2
3201KERN: hda:       output: added mixer/selector widget 12
3202KERN: hda:         output: not added mixer/selector widget 11
3203KERN: hda:     add pin widget 20
3204KERN: hda:   look at pin widget 21 (1 inputs)
3205KERN: hda:     try widget 13: 0xffffffff820f3b64
3206KERN: hda:     widget 13 is candidate
3207KERN: hda:         output: added output widget 3
3208KERN: hda:       output: added mixer/selector widget 13
3209KERN: hda:         output: not added mixer/selector widget 11
3210KERN: hda:     add pin widget 21
3211KERN: hda:   look at pin widget 22 (1 inputs)
3212KERN: hda:     try widget 14: 0xffffffff820f3c10
3213KERN: hda:     widget 14 is candidate
3214KERN: hda:         output: added output widget 4
3215KERN: hda:       output: added mixer/selector widget 14
3216KERN: hda:         output: not added mixer/selector widget 11
3217KERN: hda:     add pin widget 22
3218KERN: hda:   look at pin widget 23 (1 inputs)
3219KERN: hda:     try widget 15: 0xffffffff820f3cbc
3220KERN: hda:     widget 15 is candidate
3221KERN: hda:         output: added output widget 5
3222KERN: hda:       output: added mixer/selector widget 15
3223KERN: hda:         output: not added mixer/selector widget 11
3224KERN: hda:     add pin widget 23
3225KERN: hda:   look at pin widget 27 (5 inputs)
3226KERN: hda:     try widget 12: 0xffffffff820f3ab8
3227KERN: hda:     widget 12 is candidate
3228KERN: hda:     add pin widget 27
3229KERN: hda: build input tree
3230KERN: hda:   look at input widget 8 (1 inputs)
3231KERN: hda:     try widget 35: 0xffffffff820f4a2c
3232KERN: hda:     widget 35 is candidate
3233KERN: hda:         input: added input widget 24
3234KERN: hda:       input: added mixer/selector widget 35
3235KERN: hda:         input: added input widget 25
3236KERN: hda:       input: added mixer/selector widget 35
3237KERN: hda:         input: added input widget 26
3238KERN: hda:       input: added mixer/selector widget 35
3239KERN: hda:         input: not added mixer/selector widget 11
3240KERN: hda:     add pin widget 8
3241KERN: hda:   look at input widget 9 (1 inputs)
3242KERN: hda:     try widget 34: 0xffffffff820f4980
3243KERN: hda:     widget 34 is candidate
3244KERN: hda:         input: not added mixer/selector widget 11
3245KERN: hda:       input: not added mixer/selector widget 34
3246KERN: hda:   look at input widget 10 (1 inputs)
3247KERN: hda:     try widget 31: 0xffffffff820f477c
3248KERN: hda:     widget 31 is candidate
3249KERN: hda: build tree!
3250KERN: hda:  Audiogroup:
3251KERN: hda: 2: Audio output
3252KERN: hda:  Supported power states: D0 D1 D2 D3
3253KERN: hda:  [Power] [Format override] [Amplifier override] [Out amplifier] [Stereo]
3254KERN: hda:  Out Amp: step size: 1 dB, # steps: 64, offset to 0 dB: 64
3255KERN: hda: 3: Audio output
3256KERN: hda:  Supported power states: D0 D1 D2 D3
3257KERN: hda:  [Power] [Format override] [Amplifier override] [Out amplifier] [Stereo]
3258KERN: hda:  Out Amp: step size: 1 dB, # steps: 64, offset to 0 dB: 64
3259KERN: hda: 4: Audio output
3260KERN: hda:  Supported power states: D0 D1 D2 D3
3261KERN: hda:  [Power] [Format override] [Amplifier override] [Out amplifier] [Stereo]
3262KERN: hda:  Out Amp: step size: 1 dB, # steps: 64, offset to 0 dB: 64
3263KERN: hda: 5: Audio output
3264KERN: hda:  Supported power states: D0 D1 D2 D3
3265KERN: hda:  [Power] [Format override] [Amplifier override] [Out amplifier] [Stereo]
3266KERN: hda:  Out Amp: step size: 1 dB, # steps: 64, offset to 0 dB: 64
3267KERN: hda: 6: Audio output
3268KERN: hda:  Supported power states: D0 D1 D2 D3
3269KERN: hda:  [Power] [Digital] [Format override] [Stereo]
3270KERN: hda: 7: Vendor defined
3271KERN: hda:  Supported power states: D0
3272KERN: hda: 8: Audio input
3273KERN: hda:  Supported power states: D0 D1 D2 D3
3274KERN: hda:  [Power] [Conn. list] [Format override] [Amplifier override] [In amplifier] [Stereo]
3275KERN: hda:  In Amp: supports mute, step size: 1 dB, # steps: 46, offset to 0 dB: 16
3276KERN: hda:  Inputs: <35>
3277KERN: hda: 9: Audio input
3278KERN: hda:  Supported power states: D0 D1 D2 D3
3279KERN: hda:  [Power] [Conn. list] [Format override] [Amplifier override] [In amplifier] [Stereo]
3280KERN: hda:  In Amp: supports mute, step size: 1 dB, # steps: 46, offset to 0 dB: 16
3281KERN: hda:  Inputs: <34>
3282KERN: hda: 10: Audio input
3283KERN: hda:  Supported power states: D0 D1 D2 D3
3284KERN: hda:  [Power] [Digital] [Conn. list] [Format override] [Stereo]
3285KERN: hda:  Inputs: <31>
3286KERN: hda: 11: Audio mixer
3287KERN: hda:  Supported power states: D0
3288KERN: hda:  [Conn. list] [Amplifier override] [In amplifier] [Stereo]
3289KERN: hda:  In Amp: supports mute, step size: 1.5 dB, # steps: 31, offset to 0 dB: 23
3290KERN: hda:  Inputs: <24> 25 26 27 28 29 20 21 22 23
3291KERN: hda: 12: Audio mixer
3292KERN: hda:  Supported power states: D0
3293KERN: hda:  [Conn. list] [Amplifier override] [In amplifier] [Stereo]
3294KERN: hda:  In Amp: supports mute, step size: 0.25 dB, # steps: 0, offset to 0 dB: 0
3295KERN: hda:  Inputs: <2> 11
3296KERN: hda: 13: Audio mixer
3297KERN: hda:  Supported power states: D0
3298KERN: hda:  [Conn. list] [Amplifier override] [In amplifier] [Stereo]
3299KERN: hda:  In Amp: supports mute, step size: 0.25 dB, # steps: 0, offset to 0 dB: 0
3300KERN: hda:  Inputs: <3> 11
3301KERN: hda: 14: Audio mixer
3302KERN: hda:  Supported power states: D0
3303KERN: hda:  [Conn. list] [Amplifier override] [In amplifier] [Stereo]
3304KERN: hda:  In Amp: supports mute, step size: 0.25 dB, # steps: 0, offset to 0 dB: 0
3305KERN: hda:  Inputs: <4> 11
3306KERN: hda: 15: Audio mixer
3307KERN: hda:  Supported power states: D0
3308KERN: hda:  [Conn. list] [Amplifier override] [In amplifier] [Stereo]
3309KERN: hda:  In Amp: supports mute, step size: 0.25 dB, # steps: 0, offset to 0 dB: 0
3310KERN: hda:  Inputs: <5> 11
3311KERN: hda: 16: Audio output
3312KERN: hda:  Supported power states: D0 D1 D2 D3
3313KERN: hda:  [Power] [Digital] [Format override] [Stereo]
3314KERN: hda: 17: Pin complex
3315KERN: hda:  [Output]
3316KERN: hda:  Supported power states: D0 D1 D2 D3
3317KERN: hda:  [Power] [Digital] [Conn. list] [Unsol. responses] [Stereo]
3318KERN: hda:  Inputs: <16>
3319KERN: hda: 18: Pin complex
3320KERN: hda:  [Input]
3321KERN: hda:  Supported power states: D0 D1 D2 D3
3322KERN: hda:  [Power] [Stereo]
3323KERN: hda: 19: Vendor defined
3324KERN: hda:  Supported power states: D0
3325KERN: hda: 20: Pin complex
3326KERN: hda:  [Trigger Req][Pres Detect][HP Drive][Output][Input][EAPD]
3327KERN: hda:  Supported power states: D0 D1 D2 D3
3328KERN: hda:  [Power] [Conn. list] [Unsol. responses] [Amplifier override] [Out amplifier] [Stereo]
3329KERN: hda:  Out Amp: supports mute, step size: 0.25 dB, # steps: 0, offset to 0 dB: 0
3330KERN: hda:  Inputs: <12>
3331KERN: hda: 21: Pin complex
3332KERN: hda:  [Trigger Req][Pres Detect][Output][Input]
3333KERN: hda:  Supported power states: D0 D1 D2 D3
3334KERN: hda:  [Power] [Conn. list] [Unsol. responses] [Amplifier override] [Out amplifier] [Stereo]
3335KERN: hda:  Out Amp: supports mute, step size: 0.25 dB, # steps: 0, offset to 0 dB: 0
3336KERN: hda:  Inputs: <13>
3337KERN: hda: 22: Pin complex
3338KERN: hda:  [Trigger Req][Pres Detect][Output][Input]
3339KERN: hda:  Supported power states: D0 D1 D2 D3
3340KERN: hda:  [Power] [Conn. list] [Unsol. responses] [Amplifier override] [Out amplifier] [Stereo]
3341KERN: hda:  Out Amp: supports mute, step size: 0.25 dB, # steps: 0, offset to 0 dB: 0
3342KERN: hda:  Inputs: <14>
3343KERN: hda: 23: Pin complex
3344KERN: hda:  [Trigger Req][Pres Detect][Output][Input]
3345KERN: hda:  Supported power states: D0 D1 D2 D3
3346KERN: hda:  [Power] [Conn. list] [Unsol. responses] [Amplifier override] [Out amplifier] [Stereo]
3347KERN: hda:  Out Amp: supports mute, step size: 0.25 dB, # steps: 0, offset to 0 dB: 0
3348KERN: hda:  Inputs: <15>
3349KERN: hda: 24: Pin complex
3350KERN: hda:  [Trigger Req][Pres Detect][Output][Input][VRef HIZ][VRef 50][VRef Gr][VRef 80][VRef 100]
3351KERN: hda:  Supported power states: D0 D1 D2 D3
3352KERN: hda:  [Power] [Conn. list] [Unsol. responses] [Amplifier override] [Out amplifier] [In amplifier] [Stereo]
3353KERN: hda:  In Amp: step size: 10 dB, # steps: 3, offset to 0 dB: 0
3354KERN: hda:  Out Amp: supports mute, step size: 0.25 dB, # steps: 0, offset to 0 dB: 0
3355KERN: hda:  Inputs: <12> 13 14 15 38
3356KERN: hda: 25: Pin complex
3357KERN: hda:  [Trigger Req][Pres Detect][HP Drive][Output][Input][VRef HIZ][VRef 50][VRef Gr][VRef 80][VRef 100]
3358KERN: hda:  Supported power states: D0 D1 D2 D3
3359KERN: hda:  [Power] [Conn. list] [Unsol. responses] [Amplifier override] [Out amplifier] [In amplifier] [Stereo]
3360KERN: hda:  In Amp: step size: 10 dB, # steps: 3, offset to 0 dB: 0
3361KERN: hda:  Out Amp: supports mute, step size: 0.25 dB, # steps: 0, offset to 0 dB: 0
3362KERN: hda:  Inputs: <12> 13 14 15 38
3363KERN: hda: 26: Pin complex
3364KERN: hda:  [Trigger Req][Pres Detect][Output][Input][VRef HIZ][VRef 50][VRef Gr][VRef 80][VRef 100]
3365KERN: hda:  Supported power states: D0 D1 D2 D3
3366KERN: hda:  [Power] [Conn. list] [Unsol. responses] [Amplifier override] [Out amplifier] [In amplifier] [Stereo]
3367KERN: hda:  In Amp: step size: 10 dB, # steps: 3, offset to 0 dB: 0
3368KERN: hda:  Out Amp: supports mute, step size: 0.25 dB, # steps: 0, offset to 0 dB: 0
3369KERN: hda:  Inputs: <12> 13 14 15 38
3370KERN: hda: 27: Pin complex
3371KERN: hda:  [Trigger Req][Pres Detect][HP Drive][Output][Input][VRef HIZ][VRef 50][VRef Gr][VRef 80][VRef 100][EAPD]
3372KERN: hda:  Supported power states: D0 D1 D2 D3
3373KERN: hda:  [Power] [Conn. list] [Unsol. responses] [Amplifier override] [Out amplifier] [In amplifier] [Stereo]
3374KERN: hda:  In Amp: step size: 10 dB, # steps: 3, offset to 0 dB: 0
3375KERN: hda:  Out Amp: supports mute, step size: 0.25 dB, # steps: 0, offset to 0 dB: 0
3376KERN: hda:  Inputs: <12> 13 14 15 38
3377KERN: hda: 28: Pin complex
3378KERN: hda:  [Pres Detect][Input]
3379KERN: hda:  Supported power states: D0 D1 D2 D3
3380KERN: hda:  [Power] [Unsol. responses] [Stereo]
3381KERN: hda: 29: Pin complex
3382KERN: hda:  [Input]
3383KERN: hda:  Supported power states: D0 D1 D2 D3
3384KERN: hda:  [Power]
3385KERN: hda: 30: Pin complex
3386KERN: hda:  [Output]
3387KERN: hda:  Supported power states: D0 D1 D2 D3
3388KERN: hda:  [Power] [Digital] [Conn. list] [Unsol. responses] [Stereo]
3389KERN: hda:  Inputs: <6>
3390KERN: hda: 31: Pin complex
3391KERN: hda:  [Input]
3392KERN: hda:  Supported power states: D0 D1 D2 D3
3393KERN: hda:  [Power] [Digital] [Unsol. responses] [Stereo]
3394KERN: hda: 32: Vendor defined
3395KERN: hda:  Supported power states: D0
3396KERN: hda:  [Proc widget]
3397KERN: hda: 33: Vendor defined
3398KERN: hda:  Supported power states: D0
3399KERN: hda: 34: Audio mixer
3400KERN: hda:  Supported power states: D0
3401KERN: hda:  [Conn. list] [Amplifier override] [In amplifier] [Stereo]
3402KERN: hda:  In Amp: supports mute, step size: 0.25 dB, # steps: 0, offset to 0 dB: 0
3403KERN: hda:  Inputs: <24> 25 26 27 28 29 20 21 22 23 11 18
3404KERN: hda: 35: Audio mixer
3405KERN: hda:  Supported power states: D0
3406KERN: hda:  [Conn. list] [Amplifier override] [In amplifier] [Stereo]
3407KERN: hda:  In Amp: supports mute, step size: 0.25 dB, # steps: 0, offset to 0 dB: 0
3408KERN: hda:  Inputs: <24> 25 26 27 28 29 20 21 22 23 11
3409KERN: hda: 36: Vendor defined
3410KERN: hda:  Supported power states: D0
3411KERN: hda: 37: Audio output
3412KERN: hda:  Supported power states: D0 D1 D2 D3
3413KERN: hda:  [Power] [Format override] [Amplifier override] [Out amplifier] [Stereo]
3414KERN: hda:  Out Amp: step size: 1 dB, # steps: 64, offset to 0 dB: 64
3415KERN: hda: 38: Audio mixer
3416KERN: hda:  Supported power states: D0
3417KERN: hda:  [Conn. list] [Amplifier override] [In amplifier] [Stereo]
3418KERN: hda:  In Amp: supports mute, step size: 0.25 dB, # steps: 0, offset to 0 dB: 0
3419KERN: hda:  Inputs: <37> 11
3420KERN: hda: Enabled unsolicited responses on widget 20
3421KERN: hda: Enabled unsolicited responses on widget 21
3422KERN: hda: Enabled unsolicited responses on widget 22
3423KERN: hda: Enabled unsolicited responses on widget 24
3424KERN: hda: Enabled unsolicited responses on widget 25
3425KERN: hda: Enabled unsolicited responses on widget 26
3426KERN: hda: Enabled unsolicited responses on widget 27
3427KERN: hda: UNMUTE/SET OUTPUT GAIN widget 2 (offset 64)
3428KERN: hda: UNMUTE/SET OUTPUT GAIN widget 3 (offset 64)
3429KERN: hda: UNMUTE/SET OUTPUT GAIN widget 4 (offset 64)
3430KERN: hda: UNMUTE/SET OUTPUT GAIN widget 5 (offset 64)
3431KERN: hda: UNMUTE/SET INPUT GAIN widget 12 (offset 0)
3432KERN: hda: UNMUTE/SET INPUT GAIN widget 13 (offset 0)
3433KERN: hda: UNMUTE/SET INPUT GAIN widget 14 (offset 0)
3434KERN: hda: UNMUTE/SET INPUT GAIN widget 15 (offset 0)
3435KERN: hda: ENABLE pin widget 20
3436KERN: hda: ENABLE EAPD pin widget 20
3437KERN: hda: UNMUTE/SET OUTPUT GAIN widget 20 (offset 0)
3438KERN: hda: ENABLE pin widget 21
3439KERN: hda: UNMUTE/SET OUTPUT GAIN widget 21 (offset 0)
3440KERN: hda: ENABLE pin widget 22
3441KERN: hda: UNMUTE/SET OUTPUT GAIN widget 22 (offset 0)
3442KERN: hda: ENABLE pin widget 23
3443KERN: hda: UNMUTE/SET OUTPUT GAIN widget 23 (offset 0)
3444KERN: hda: ENABLE pin widget 27
3445KERN: hda: ENABLE EAPD pin widget 27
3446KERN: hda: UNMUTE/SET OUTPUT GAIN widget 27 (offset 0)
3447KERN: hda: UNMUTE/SET INPUT GAIN widget 27 (offset 0)
3448KERN: hda: UNMUTE/SET INPUT GAIN widget 8 (offset 16)
3449KERN: hda: input vref 50 enabled
3450KERN: hda: input vref 80 enabled
3451KERN: hda: input vref 100 enabled
3452KERN: hda: ENABLE pin widget 24
3453KERN: hda: UNMUTE/SET OUTPUT GAIN widget 24 (offset 0)
3454KERN: hda: UNMUTE/SET INPUT GAIN widget 24 (offset 0)
3455KERN: hda: input vref 50 enabled
3456KERN: hda: input vref 80 enabled
3457KERN: hda: input vref 100 enabled
3458KERN: hda: ENABLE pin widget 25
3459KERN: hda: UNMUTE/SET OUTPUT GAIN widget 25 (offset 0)
3460KERN: hda: UNMUTE/SET INPUT GAIN widget 25 (offset 0)
3461KERN: hda: input vref 50 enabled
3462KERN: hda: input vref 80 enabled
3463KERN: hda: input vref 100 enabled
3464KERN: hda: ENABLE pin widget 26
3465KERN: hda: UNMUTE/SET OUTPUT GAIN widget 26 (offset 0)
3466KERN: hda: UNMUTE/SET INPUT GAIN widget 26 (offset 0)
3467KERN: hda: UNMUTE/SET INPUT GAIN widget 35 (offset 0)
3468KERN: hda: streams playback 0xffffffffabf078c8, record 0xffffffffabf07788
3469KERN: hda: sensed pin widget 27, 0
3470KERN: hda: sample size 4, num channels 2, buffer length 10240
3471KERN: hda: hda_stream_setup_buffers: setup stream 1: SR=192000, SF=24 F=0x1831 (0x100)
3472KERN: add_memory_type_range(7017, 0x49981000, 0x28000, 0)
3473KERN: set MTRRs to:
3474KERN:   mtrr:  0: base: 0xe0000000, size: 0x20000000, type: 0
3475KERN:   mtrr:  1: base: 0xc0000000, size: 0x40000000, type: 1
3476KERN: update_mtrrs(): Succeeded setting MTRRs after ignoring uncacheable ranges up to size 0x28000.
3477KERN: hda: hda_stream_setup_buffers(Playback): Allocated 163840 bytes for 2 buffers
3478KERN: add_memory_type_range(7018, 0x499b5000, 0x1000, 0)
3479KERN: set MTRRs to:
3480KERN:   mtrr:  0: base: 0xe0000000, size: 0x20000000, type: 0
3481KERN:   mtrr:  1: base: 0xc0000000, size: 0x40000000, type: 1
3482KERN: update_mtrrs(): Succeeded setting MTRRs after ignoring uncacheable ranges up to size 0x28000.
3483KERN: hda: hda_stream_setup_buffers(Playback): Allocated 4096 bytes for 2 BDLEs
3484KERN: hda: stream: 1 fifo size: 1024 num_io_widgets: 4
3485KERN: hda: widgets: KERN: 2 KERN: 3 KERN: 4 KERN: 5
3486KERN: hda: sample size 4, num channels 2, buffer length 10240
3487KERN: hda: hda_stream_setup_buffers: setup stream 2: SR=192000, SF=24 F=0x1831 (0x100)
3488KERN: add_memory_type_range(7019, 0x499e4000, 0x28000, 0)
3489KERN: set MTRRs to:
3490KERN:   mtrr:  0: base: 0xe0000000, size: 0x20000000, type: 0
3491KERN:   mtrr:  1: base: 0xc0000000, size: 0x40000000, type: 1
3492KERN: update_mtrrs(): Succeeded setting MTRRs after ignoring uncacheable ranges up to size 0x28000.
3493KERN: hda: hda_stream_setup_buffers(Recording): Allocated 163840 bytes for 2 buffers
3494KERN: add_memory_type_range(7020, 0x49a1d000, 0x1000, 0)
3495KERN: set MTRRs to:
3496KERN:   mtrr:  0: base: 0xe0000000, size: 0x20000000, type: 0
3497KERN:   mtrr:  1: base: 0xc0000000, size: 0x40000000, type: 1
3498KERN: update_mtrrs(): Succeeded setting MTRRs after ignoring uncacheable ranges up to size 0x28000.
3499KERN: hda: hda_stream_setup_buffers(Recording): Allocated 4096 bytes for 2 BDLEs
3500KERN: hda: stream: 2 fifo size: 256 num_io_widgets: 1
3501KERN: hda: widgets: KERN: 8 KERN:
3502KERN: hda_stream_start() offset 80
3503KERN: hda_stream_start() offset 0
3504KERN: bfs: bfs_create_index:2135: File or Directory already exists
3505KERN: Last message repeated 3 times.
3506KERN: hda: DMA position for stream (id:1) seems to be broken. Switching to using LPIB.
3507KERN: hda: DMA position for stream (id:2) seems to be broken. Switching to using LPIB.
3508KERN: Deskbar refuses to add method replicant: General system error
3509USER: validate_instantiation failed on class BMenu.
3510Last message repeated 3 times
3511KERN: Deskbar refuses to add method replicant: General system error
3512KERN: acquire_advisory_lock(vnode = 0xffffffffac3fab00, flock = 0xffffffff81558eb0, wait = no)
3513Last message repeated 1 time
3514KERN: acquire_advisory_lock(vnode = 0xffffffffac3c5c80, flock = 0xffffffff81558eb0, wait = no)
3515KERN: Last message repeated 14 times.