Ticket #4864: syslog

File syslog, 144.3 KB (added by augiedoggie, 11 years ago)
Line 
1KERN: APM version 1.2 available, flags 7.
2KERN: smp: using ACPI to detect MP configuration
3KERN: smp: local apic address is 0xfee00000
4KERN: smp: found local APIC with id 0
5KERN: smp: found io APIC with id 2 and address 0xfec00000
6KERN: VESA version = 2.0, capabilities 1
7KERN: OEM string: ATI R360
8KERN: 6a: 800 x 600 x 4 (a = 27, mem = 3, phy = 0, p = 4, b = 1)
9KERN: 102: 800 x 600 x 4 (a = 27, mem = 3, phy = 0, p = 4, b = 1)
10KERN: 104: 1024 x 768 x 4 (a = 27, mem = 3, phy = 0, p = 4, b = 1)
11KERN: 182: 320 x 200 x 8 (a = 187, mem = 4, phy = d8000000, p = 1, b = 1)
12KERN: 10d: 320 x 200 x 15 (a = 187, mem = 6, phy = d8000000, p = 1, b = 1)
13KERN: 10e: 320 x 200 x 16 (a = 187, mem = 6, phy = d8000000, p = 1, b = 1)
14KERN: 10f: 320 x 200 x 24 (a = 187, mem = 6, phy = d8000000, p = 1, b = 1)
15KERN: 120: 320 x 200 x 32 (a = 187, mem = 6, phy = d8000000, p = 1, b = 1)
16KERN: 192: 320 x 240 x 8 (a = 187, mem = 4, phy = d8000000, p = 1, b = 1)
17KERN: 193: 320 x 240 x 15 (a = 187, mem = 6, phy = d8000000, p = 1, b = 1)
18KERN: 194: 320 x 240 x 16 (a = 187, mem = 6, phy = d8000000, p = 1, b = 1)
19KERN: 195: 320 x 240 x 24 (a = 187, mem = 6, phy = d8000000, p = 1, b = 1)
20KERN: 196: 320 x 240 x 32 (a = 187, mem = 6, phy = d8000000, p = 1, b = 1)
21KERN: 1a2: 400 x 300 x 8 (a = 187, mem = 4, phy = d8000000, p = 1, b = 1)
22KERN: 1a3: 400 x 300 x 15 (a = 187, mem = 6, phy = d8000000, p = 1, b = 1)
23KERN: 1a4: 400 x 300 x 16 (a = 187, mem = 6, phy = d8000000, p = 1, b = 1)
24KERN: 1a5: 400 x 300 x 24 (a = 187, mem = 6, phy = d8000000, p = 1, b = 1)
25KERN: 1a6: 400 x 300 x 32 (a = 187, mem = 6, phy = d8000000, p = 1, b = 1)
26KERN: 1b2: 512 x 384 x 8 (a = 187, mem = 4, phy = d8000000, p = 1, b = 1)
27KERN: 1b3: 512 x 384 x 15 (a = 187, mem = 6, phy = d8000000, p = 1, b = 1)
28KERN: 1b4: 512 x 384 x 16 (a = 187, mem = 6, phy = d8000000, p = 1, b = 1)
29KERN: 1b5: 512 x 384 x 24 (a = 187, mem = 6, phy = d8000000, p = 1, b = 1)
30KERN: 1b6: 512 x 384 x 32 (a = 187, mem = 6, phy = d8000000, p = 1, b = 1)
31KERN: 1c2: 640 x 350 x 8 (a = 187, mem = 4, phy = d8000000, p = 1, b = 1)
32KERN: 1c3: 640 x 350 x 15 (a = 187, mem = 6, phy = d8000000, p = 1, b = 1)
33KERN: 1c4: 640 x 350 x 16 (a = 187, mem = 6, phy = d8000000, p = 1, b = 1)
34KERN: 1c5: 640 x 350 x 24 (a = 187, mem = 6, phy = d8000000, p = 1, b = 1)
35KERN: 1c6: 640 x 350 x 32 (a = 187, mem = 6, phy = d8000000, p = 1, b = 1)
36KERN: 100: 640 x 400 x 8 (a = 187, mem = 4, phy = d8000000, p = 1, b = 1)
37KERN: 183: 640 x 400 x 15 (a = 187, mem = 6, phy = d8000000, p = 1, b = 1)
38KERN: 184: 640 x 400 x 16 (a = 187, mem = 6, phy = d8000000, p = 1, b = 1)
39KERN: 185: 640 x 400 x 24 (a = 187, mem = 6, phy = d8000000, p = 1, b = 1)
40KERN: 186: 640 x 400 x 32 (a = 187, mem = 6, phy = d8000000, p = 1, b = 1)
41KERN: 101: 640 x 480 x 8 (a = 187, mem = 4, phy = d8000000, p = 1, b = 1)
42KERN: 110: 640 x 480 x 15 (a = 187, mem = 6, phy = d8000000, p = 1, b = 1)
43KERN: 111: 640 x 480 x 16 (a = 187, mem = 6, phy = d8000000, p = 1, b = 1)
44KERN: 112: 640 x 480 x 24 (a = 187, mem = 6, phy = d8000000, p = 1, b = 1)
45KERN: 121: 640 x 480 x 32 (a = 187, mem = 6, phy = d8000000, p = 1, b = 1)
46KERN: 103: 800 x 600 x 8 (a = 187, mem = 4, phy = d8000000, p = 1, b = 1)
47KERN: 113: 800 x 600 x 15 (a = 187, mem = 6, phy = d8000000, p = 1, b = 1)
48KERN: 114: 800 x 600 x 16 (a = 187, mem = 6, phy = d8000000, p = 1, b = 1)
49KERN: 115: 800 x 600 x 24 (a = 187, mem = 6, phy = d8000000, p = 1, b = 1)
50KERN: 122: 800 x 600 x 32 (a = 187, mem = 6, phy = d8000000, p = 1, b = 1)
51KERN: 105: 1024 x 768 x 8 (a = 187, mem = 4, phy = d8000000, p = 1, b = 1)
52KERN: 116: 1024 x 768 x 15 (a = 187, mem = 6, phy = d8000000, p = 1, b = 1)
53KERN: 117: 1024 x 768 x 16 (a = 187, mem = 6, phy = d8000000, p = 1, b = 1)
54KERN: 118: 1024 x 768 x 24 (a = 187, mem = 6, phy = d8000000, p = 1, b = 1)
55KERN: 123: 1024 x 768 x 32 (a = 187, mem = 6, phy = d8000000, p = 1, b = 1)
56KERN: 107: 1280 x 1024 x 8 (a = 187, mem = 4, phy = d8000000, p = 1, b = 1)
57KERN: 119: 1280 x 1024 x 15 (a = 187, mem = 6, phy = d8000000, p = 1, b = 1)
58KERN: 11a: 1280 x 1024 x 16 (a = 187, mem = 6, phy = d8000000, p = 1, b = 1)
59KERN: 11b: 1280 x 1024 x 24 (a = 187, mem = 6, phy = d8000000, p = 1, b = 1)
60KERN: 124: 1280 x 1024 x 32 (a = 187, mem = 6, phy = d8000000, p = 1, b = 1)
61KERN: 109: 132 x 25 x 4 (a = 15, mem = 0, phy = 0, p = 1, b = 1)
62KERN: 10a: 132 x 43 x 4 (a = 15, mem = 0, phy = 0, p = 1, b = 1)
63KERN: 130: 132 x 44 x 4 (a = 15, mem = 0, phy = 0, p = 1, b = 1)
64KERN: VESA compatible graphics!
65KERN: Welcome to the Haiku boot loader!
66KERN: number of drives: 2
67KERN: add_partitions_for(0x00105370, mountFS = no)
68KERN: add_partitions_for(fd = 0, mountFS = no)
69KERN: 0x0010557c Partition::Partition
70KERN: 0x0010557c Partition::Scan()
71KERN: check for partitioning_system: EFI GUID Partition Map
72KERN: check for partitioning_system: Intel Partition Map
73KERN: priority: 810
74KERN: check for partitioning_system: Intel Extended Partition
75KERN: 0x001056e0 Partition::Partition
76KERN: 0x0010557c Partition::AddChild 0x001056e0
77KERN: 0x001056e0 Partition::SetParent 0x0010557c
78KERN: new child partition!
79KERN: 0x001057a8 Partition::Partition
80KERN: 0x0010557c Partition::AddChild 0x001057a8
81KERN: 0x001057a8 Partition::SetParent 0x0010557c
82KERN: new child partition!
83KERN: 0x0010585c Partition::Partition
84KERN: 0x0010557c Partition::AddChild 0x0010585c
85KERN: 0x0010585c Partition::SetParent 0x0010557c
86KERN: new child partition!
87KERN: 0x00105924 Partition::Partition
88KERN: 0x0010557c Partition::AddChild 0x00105924
89KERN: 0x00105924 Partition::SetParent 0x0010557c
90KERN: new child partition!
91KERN: 0x0010557c Partition::Scan(): scan child 0x001056e0 (start = 32256, size = 268431980544, parent = 0x0010557c)!
92KERN: 0x001056e0 Partition::Scan()
93KERN: check for partitioning_system: EFI GUID Partition Map
94KERN: check for partitioning_system: Intel Partition Map
95KERN: check for partitioning_system: Intel Extended Partition
96KERN: 0x0010557c Partition::Scan(): scan child 0x001057a8 (start = 268432012800, size = 214745610240, parent = 0x0010557c)!
97KERN: 0x001057a8 Partition::Scan()
98KERN: check for partitioning_system: EFI GUID Partition Map
99KERN: check for partitioning_system: Intel Partition Map
100KERN: check for partitioning_system: Intel Extended Partition
101KERN: 0x0010557c Partition::Scan(): scan child 0x0010585c (start = 483177623040, size = 429499445760, parent = 0x0010557c)!
102KERN: 0x0010585c Partition::Scan()
103KERN: check for partitioning_system: EFI GUID Partition Map
104KERN: check for partitioning_system: Intel Partition Map
105KERN: check for partitioning_system: Intel Extended Partition
106KERN: 0x0010557c Partition::Scan(): scan child 0x00105924 (start = 912677068800, size = 87525204480, parent = 0x0010557c)!
107KERN: 0x00105924 Partition::Scan()
108KERN: check for partitioning_system: EFI GUID Partition Map
109KERN: check for partitioning_system: Intel Partition Map
110KERN: check for partitioning_system: Intel Extended Partition
111KERN: 0x0010557c Partition::~Partition
112KERN: 0x001056e0 Partition::SetParent 0x00000000
113KERN: 0x001057a8 Partition::SetParent 0x00000000
114KERN: 0x0010585c Partition::SetParent 0x00000000
115KERN: 0x00105924 Partition::SetParent 0x00000000
116KERN: boot partition offset: 912677068800
117KERN: 0x00105924 Partition::_Mount check for file_system: BFS Filesystem
118KERN: load kernel...
119KERN: video mode: 1280x1024x32
120KERN: smp: found 1 cpu
121KERN: smp: apic_phys = 0xfee00000
122KERN: smp: ioapic_phys = 0xfec00000
123KERN: smp: apic = 0x80993000
124KERN: smp: ioapic = 0x80994000
125KERN: APIC ticks/sec = 333162406
126KERN: Welcome to syslog debug output!
127KERN: Haiku revision: 33790
128KERN: arch_init_timer: using APIC timer.
129KERN: allocate_commpage_entry(2, 12) -> 0xffff0100
130KERN: scheduler_init: found 1 logical cpu
131KERN: scheduler_init: using simple scheduler
132KERN: apm_init()
133KERN: code32: 0xf000, 0x7dec, length 0x512
134KERN: code16: 0xf000, length 0x1
135KERN: data: 0xfdf8, length 0x0
136KERN: heap_add_area: area -1 added to grow heap 0x80300000 - usable range 0x80302000 - 0x80400000
137KERN: initialize_commpage_syscall(): sysenter/sysexit supported
138KERN: allocate_commpage_entry(3, 5) -> 0xffff0110
139KERN: heap_add_area: area -1 added to port buffer heap 0x819dcb20 - usable range 0x84077000 - 0x8446a000
140KERN: heap_add_area: area -1 added to VIP I/O heap heap 0x80400000 - usable range 0x80402000 - 0x80500000
141KERN: vip_io_request_allocator_init(): created VIP I/O heap: 0x80400000
142KERN: PCI: pci_module_init
143KERN: PCI: mechanism 1 controller found
144KERN: PCI: dom 0, bus 0, dev 1, func 0, changed PCI bridge control from 0x000c to 0x000c
145KERN: PCI: [dom 0, bus 0] bus 0, device 0, function 0: vendor 1106, device 3189, revision 00
146KERN: PCI: class_base 06, class_function 00, class_api 00
147KERN: PCI: vendor 1106: VIA Technologies, Inc.
148KERN: PCI: device 3189: VT8377 [KT400/KT600 AGP] Host Bridge
149KERN: PCI: info: Bridge (Host bridge)
150KERN: PCI: line_size 00, latency 08, header_type 00, BIST 00
151KERN: PCI: ROM base host 00000000, pci KERN: 00000000, size 00000000
152KERN: PCI: cardbus_CIS 00000000, subsystem_id 3189, subsystem_vendor_id 1106
153KERN: PCI: interrupt_line 00, interrupt_pin 00, min_grant 00, max_latency 00
154KERN: PCI: base reg 0: host d0000000, pci d0000000, size 08000000, flags 08
155KERN: PCI: base reg 1: host 00000000, pci 00000000, size 00000000, flags 00
156KERN: PCI: base reg 2: host 00000000, pci 00000000, size 00000000, flags 00
157KERN: PCI: base reg 3: host 00000000, pci 00000000, size 00000000, flags 00
158KERN: PCI: base reg 4: host 00000000, pci 00000000, size 00000000, flags 00
159KERN: PCI: base reg 5: host 00000000, pci 00000000, size 00000000, flags 00
160KERN: PCI: Capabilities: AGP, PM
161KERN: PCI: [dom 0, bus 0] bus 0, device 1, function 0: vendor 1106, device b168, revision 00
162KERN: PCI: class_base 06, class_function 04, class_api 00
163KERN: PCI: vendor 1106: VIA Technologies, Inc.
164KERN: PCI: device b168: VT8235 PCI Bridge
165KERN: PCI: info: Bridge (PCI bridge, Normal decode)
166KERN: PCI: line_size 00, latency 00, header_type 01, BIST 00
167KERN: PCI: subsystem_id 0000, subsystem_vendor_id 0080
168KERN: PCI: primary_bus 00, secondary_bus 01, subordinate_bus 01, secondary_latency 00
169KERN: PCI: io_base_upper_16 0000, io_base 90
170KERN: PCI: io_limit_upper_16 0000, io_limit 90
171KERN: PCI: memory_base e800, memory_limit e800
172KERN: PCI: prefetchable_memory_base_upper32 00000000, prefetchable_memory_base d800
173KERN: PCI: prefetchable_memory_limit_upper32 00000000, prefetchable_memory_limit e7f0
174KERN: PCI: bridge_control 000c, secondary_status 0000
175KERN: PCI: interrupt_line 00, interrupt_pin 00
176KERN: PCI: ROM base host 00000000, pci 00000000, size ??
177KERN: PCI: base reg 0: host 00000000, pci 00000000, size 00000000, flags 00
178KERN: PCI: base reg 1: host 00000000, pci 00000000, size 00000000, flags 00
179KERN: PCI: Capabilities: PM
180KERN: PCI: [dom 0, bus 1] bus 1, device 0, function 0: vendor 1002, device 4e4a, revision 00
181KERN: PCI: class_base 03, class_function 00, class_api 00
182KERN: PCI: vendor 1002: ATI Technologies Inc
183KERN: PCI: device 4e4a: R360 NJ [Radeon 9800 XT]
184KERN: PCI: info: Display controller (VGA compatible controller, VGA controller)
185KERN: PCI: line_size 08, latency 20, header_type 80, BIST 00
186KERN: PCI: ROM base host 00000000, pci 00000000, size 00020000
187KERN: PCI: cardbus_CIS 00000000, subsystem_id 0002, subsystem_vendor_id 1002
188KERN: PCI: interrupt_line 0b, interrupt_pin 01, min_grant 08, max_latency 00
189KERN: PCI: base reg 0: host d8000000, pci d8000000, size 08000000, flags 08
190KERN: PCI: base reg 1: host 00009000, pci 00009000, size 00000100, flags 01
191KERN: PCI: base reg 2: host e8020000, pci e8020000, size 00010000, flags 00
192KERN: PCI: base reg 3: host 00000000, pci 00000000, size 00000000, flags 00
193KERN: PCI: base reg 4: host 00000000, pci 00000000, size 00000000, flags 00
194KERN: PCI: base reg 5: host 00000000, pci 00000000, size 00000000, flags 00
195KERN: PCI: Capabilities: AGP, PM
196KERN: PCI: [dom 0, bus 1] bus 1, device 0, function 1: vendor 1002, device 4e6a, revision 00
197KERN: PCI: class_base 03, class_function 80, class_api 00
198KERN: PCI: vendor 1002: ATI Technologies Inc
199KERN: PCI: device 4e6a: RV350 NJ [Radeon 9800 XT] (Secondary)
200KERN: PCI: info: Display controller
201KERN: PCI: line_size 08, latency 20, header_type 00, BIST 00
202KERN: PCI: ROM base host 00000000, pci 00000000, size 00000000
203KERN: PCI: cardbus_CIS 00000000, subsystem_id 0003, subsystem_vendor_id 1002
204KERN: PCI: interrupt_line ff, interrupt_pin 00, min_grant 08, max_latency 00
205KERN: PCI: base reg 0: host e0000000, pci e0000000, size 08000000, flags 08
206KERN: PCI: base reg 1: host e8030000, pci e8030000, size 00010000, flags 00
207KERN: PCI: base reg 2: host 00000000, pci 00000000, size 00000000, flags 00
208KERN: PCI: base reg 3: host 00000000, pci 00000000, size 00000000, flags 00
209KERN: PCI: base reg 4: host 00000000, pci 00000000, size 00000000, flags 00
210KERN: PCI: base reg 5: host 00000000, pci 00000000, size 00000000, flags 00
211KERN: PCI: Capabilities: PM
212KERN: PCI: [dom 0, bus 0] bus 0, device 9, function 0: vendor 1095, device 3112, revision 02
213KERN: PCI: class_base 01, class_function 80, class_api 01
214KERN: PCI: vendor 1095: Silicon Image, Inc.
215KERN: PCI: device 3112: SiI 3112 [SATALink/SATARaid] Serial ATA Controller (SATAConnect 1205SA Host Controller)
216KERN: PCI: info: Mass storage controller
217KERN: PCI: line_size 08, latency 20, header_type 00, BIST 00
218KERN: PCI: ROM base host 00000000, pci 00000000, size 00080000
219KERN: PCI: cardbus_CIS 00000000, subsystem_id 0250, subsystem_vendor_id 9005
220KERN: PCI: interrupt_line 0a, interrupt_pin 01, min_grant 00, max_latency 00
221KERN: PCI: base reg 0: host 0000a000, pci 0000a000, size 00000010, flags 09
222KERN: PCI: base reg 1: host 0000a400, pci 0000a400, size 00000010, flags 0d
223KERN: PCI: base reg 2: host 0000a800, pci 0000a800, size 00000010, flags 09
224KERN: PCI: base reg 3: host 0000ac00, pci 0000ac00, size 00000010, flags 0d
225KERN: PCI: base reg 4: host 0000b000, pci 0000b000, size 00000010, flags 01
226KERN: PCI: base reg 5: host e8185000, pci e8185000, size 00000200, flags 00
227KERN: PCI: Capabilities: PM
228KERN: PCI: [dom 0, bus 0] bus 0, device 10, function 0: vendor 1102, device 0002, revision 07
229KERN: PCI: class_base 04, class_function 01, class_api 00
230KERN: PCI: vendor 1102: Creative Labs
231KERN: PCI: device 0002: SB Live! EMU10k1 (SBLive! Player 5.1)
232KERN: PCI: info: Multimedia controller (Multimedia audio controller)
233KERN: PCI: line_size 00, latency 20, header_type 80, BIST 00
234KERN: PCI: ROM base host 00000000, pci 00000000, size 00000000
235KERN: PCI: cardbus_CIS 00000000, subsystem_id 8061, subsystem_vendor_id 1102
236KERN: PCI: interrupt_line 05, interrupt_pin 01, min_grant 02, max_latency 14
237KERN: PCI: base reg 0: host 0000b400, pci 0000b400, size 00000020, flags 01
238KERN: PCI: base reg 1: host 00000000, pci 00000000, size 00000000, flags 00
239KERN: PCI: base reg 2: host 00000000, pci 00000000, size 00000000, flags 00
240KERN: PCI: base reg 3: host 00000000, pci 00000000, size 00000000, flags 00
241KERN: PCI: base reg 4: host 00000000, pci 00000000, size 00000000, flags 00
242KERN: PCI: base reg 5: host 00000000, pci 00000000, size 00000000, flags 00
243KERN: PCI: Capabilities: PM
244KERN: PCI: [dom 0, bus 0] bus 0, device 10, function 1: vendor 1102, device 7002, revision 07
245KERN: PCI: class_base 09, class_function 80, class_api 00
246KERN: PCI: vendor 1102: Creative Labs
247KERN: PCI: device 7002: SB Live! Game Port (Gameport Joystick)
248KERN: PCI: info: Input device controller
249KERN: PCI: line_size 00, latency 20, header_type 80, BIST 00
250KERN: PCI: ROM base host 00000000, pci 00000000, size 00000000
251KERN: PCI: cardbus_CIS 00000000, subsystem_id 0020, subsystem_vendor_id 1102
252KERN: PCI: interrupt_line 00, interrupt_pin 00, min_grant 00, max_latency 00
253KERN: PCI: base reg 0: host 0000b800, pci 0000b800, size 00000010, flags 09
254KERN: PCI: base reg 1: host 00000000, pci 00000000, size 00000000, flags 00
255KERN: PCI: base reg 2: host 00000000, pci 00000000, size 00000000, flags 00
256KERN: PCI: base reg 3: host 00000000, pci 00000000, size 00000000, flags 00
257KERN: PCI: base reg 4: host 00000000, pci 00000000, size 00000000, flags 00
258KERN: PCI: base reg 5: host 00000000, pci 00000000, size 00000000, flags 00
259KERN: PCI: Capabilities: PM
260KERN: PCI: [dom 0, bus 0] bus 0, device 11, function 0: vendor 104c, device 8020, revision 00
261KERN: PCI: class_base 0c, class_function 00, class_api 10
262KERN: PCI: vendor 104c: Texas Instruments
263KERN: PCI: device 8020: TSB12LV26 IEEE-1394 Controller (Link)
264KERN: PCI: info: Serial bus controller (FireWire (IEEE 1394), OHCI)
265KERN: PCI: line_size 08, latency 20, header_type 00, BIST 00
266KERN: PCI: ROM base host 00000000, pci 00000000, size 00000000
267KERN: PCI: cardbus_CIS 00000000, subsystem_id 8010, subsystem_vendor_id 15c5
268KERN: PCI: interrupt_line 07, interrupt_pin 01, min_grant 03, max_latency 04
269KERN: PCI: base reg 0: host e8184000, pci e8184000, size 00000800, flags 00
270KERN: PCI: base reg 1: host e8180000, pci e8180000, size 00004000, flags 00
271KERN: PCI: base reg 2: host 00000000, pci 00000000, size 00000000, flags 00
272KERN: PCI: base reg 3: host 00000000, pci 00000000, size 00000000, flags 00
273KERN: PCI: base reg 4: host 00000000, pci 00000000, size 00000000, flags 00
274KERN: PCI: base reg 5: host 00000000, pci 00000000, size 00000000, flags 00
275KERN: PCI: Capabilities: PM
276KERN: PCI: [dom 0, bus 0] bus 0, device 12, function 0: vendor 10b7, device 9200, revision 74
277KERN: PCI: class_base 02, class_function 00, class_api 00
278KERN: PCI: vendor 10b7: 3Com Corporation
279KERN: PCI: device 9200: 3c905C-TX/TX-M [Tornado] (3C905CX-TX/TX-M Fast Etherlink for PC Management NIC)
280KERN: PCI: info: Network controller (Ethernet coKERN: ntroller)
281KERN: PCI: line_size 08, latency 20, header_type 00, BIST 00
282KERN: PCI: ROM base host 00000000, pci 00000000, size 00020000
283KERN: PCI: cardbus_CIS 00000000, subsystem_id 1000, subsystem_vendor_id 10b7
284KERN: PCI: interrupt_line 0b, interrupt_pin 01, min_grant 0a, max_latency 0a
285KERN: PCI: base reg 0: host 0000bc00, pci 0000bc00, size 00000080, flags 01
286KERN: PCI: base reg 1: host e8186000, pci e8186000, size 00000080, flags 00
287KERN: PCI: base reg 2: host 00000000, pci 00000000, size 00000000, flags 00
288KERN: PCI: base reg 3: host 00000000, pci 00000000, size 00000000, flags 00
289KERN: PCI: base reg 4: host 00000000, pci 00000000, size 00000000, flags 00
290KERN: PCI: base reg 5: host 00000000, pci 00000000, size 00000000, flags 00
291KERN: PCI: Capabilities: PM
292KERN: PCI: [dom 0, bus 0] bus 0, device 16, function 0: vendor 1106, device 3038, revision 80
293KERN: PCI: class_base 0c, class_function 03, class_api 00
294KERN: PCI: vendor 1106: VIA Technologies, Inc.
295KERN: PCI: device 3038: VT82xxxxx UHCI USB 1.1 Controller
296KERN: PCI: info: Serial bus controller (USB Controller, UHCI)
297KERN: PCI: line_size 08, latency 20, header_type 80, BIST 00
298KERN: PCI: ROM base host 00000000, pci 00000000, size 00000000
299KERN: PCI: cardbus_CIS 00000000, subsystem_id 3038, subsystem_vendor_id 1106
300KERN: PCI: interrupt_line 0b, interrupt_pin 01, min_grant 00, max_latency 00
301KERN: PCI: base reg 0: host 00000000, pci 00000000, size 00000000, flags 00
302KERN: PCI: base reg 1: host 00000000, pci 00000000, size 00000000, flags 00
303KERN: PCI: base reg 2: host 00000000, pci 00000000, size 00000000, flags 00
304KERN: PCI: base reg 3: host 00000000, pci 00000000, size 00000000, flags 00
305KERN: PCI: base reg 4: host 0000c000, pci 0000c000, size 00000020, flags 01
306KERN: PCI: base reg 5: host 00000000, pci 00000000, size 00000000, flags 00
307KERN: PCI: Capabilities: PM
308KERN: PCI: [dom 0, bus 0] bus 0, device 16, function 1: vendor 1106, device 3038, revision 80
309KERN: PCI: class_base 0c, class_function 03, class_api 00
310KERN: PCI: vendor 1106: VIA Technologies, Inc.
311KERN: PCI: device 3038: VT82xxxxx UHCI USB 1.1 Controller
312KERN: PCI: info: Serial bus controller (USB Controller, UHCI)
313KERN: PCI: line_size 08, latency 20, header_type 80, BIST 00
314KERN: PCI: ROM base host 00000000, pci 00000000, size 00000000
315KERN: PCI: cardbus_CIS 00000000, subsystem_id 3038, subsystem_vendor_id 1106
316KERN: PCI: interrupt_line 0a, interrupt_pin 02, min_grant 00, max_latency 00
317KERN: PCI: base reg 0: host 00000000, pci 00000000, size 00000000, flags 00
318KERN: PCI: base reg 1: host 00000000, pci 00000000, size 00000000, flags 00
319KERN: PCI: base reg 2: host 00000000, pci 00000000, size 00000000, flags 00
320KERN: PCI: base reg 3: host 00000000, pci 00000000, size 00000000, flags 00
321KERN: PCI: base reg 4: host 0000c400, pci 0000c400, size 00000020, flags 01
322KERN: PCI: base reg 5: host 00000000, pci 00000000, size 00000000, flags 00
323KERN: PCI: Capabilities: PM
324KERN: PCI: [dom 0, bus 0] bus 0, device 16, function 2: vendor 1106, device 3038, revision 80
325KERN: PCI: class_base 0c, class_function 03, class_api 00
326KERN: PCI: vendor 1106: VIA Technologies, Inc.
327KERN: PCI: device 3038: VT82xxxxx UHCI USB 1.1 Controller
328KERN: PCI: info: Serial bus controller (USB Controller, UHCI)
329KERN: PCI: line_size 08, latency 20, header_type 80, BIST 00
330KERN: PCI: ROM base host 00000000, pci 00000000, size 00000000
331KERN: PCI: cardbus_CIS 00000000, subsystem_id 3038, subsystem_vendor_id 1106
332KERN: PCI: interrupt_line 05, interrupt_pin 03, min_grant 00, max_latency 00
333KERN: PCI: base reg 0: host 00000000, pci 00000000, size 00000000, flags 00
334KERN: PCI: base reg 1: host 00000000, pci 00000000, size 00000000, flags 00
335KERN: PCI: base reg 2: host 00000000, pci 00000000, size 00000000, flags 00
336KERN: PCI: base reg 3: host 00000000, pci 00000000, size 00000000, flags 00
337KERN: PCI: base reg 4: host 0000c800, pci 0000c800, size 00000020, flags 01
338KERN: PCI: base reg 5: host 00000000, pci 00000000, size 00000000, flags 00
339KERN: PCI: Capabilities: PM
340KERN: PCI: [dom 0, bus 0] bus 0, device 16, function 3: vendor 1106, device 3104, revision 82
341KERN: PCI: class_base 0c, class_function 03, class_api 20
342KERN: PCI: vendor 1106: VIA Technologies, Inc.
343KERN: PCI: device 3104: USB 2.0
344KERN: PCI: info: Serial bus controller (USB Controller, EHCI)
345KERN: PCI: line_size 08, latency 20, header_type 00, BIST 00
346KERN: PCI: ROM base host 00000000, pci 00000000, size 00000000
347KERN: PCI: cardbus_CIS 00000000, subsystem_id 3104, subsystem_vendor_id 1106
348KERN: PCI: interrupt_line 07, interrupt_pin 04, min_grant 00, max_latency 00
349KERN: PCI: base reg 0: host e8187000, pci e8187000, size 00000100, flags 00
350KERN: PCI: base reg 1: host 00000000, pci 00000000, size 00000000, flags 00
351KERN: PCI: base reg 2: host 00000000, pci 00000000, size 00000000, flags 00
352KERN: PCI: base reg 3: host 00000000, pci 00000000, size 00000000, flags 00
353KERN: PCI: base reg 4: host 00000000, pci 00000000, size 00000000, flags 00
354KERN: PCI: base reg 5: host 00000000, pci 00000000, size 00000000, flags 00
355KERN: PCI: Capabilities: PM
356KERN: PCI: [dom 0, bus 0] bus 0, device 17, function 0: vendor 1106, device 3177, revision 00
357KERN: PCI: class_base 06, class_function 01, class_api 00
358KERN: PCI: vendor 1106: VIA Technologies, Inc.
359KERN: PCI: device 3177: VT8235 ISA Bridge
360KERN: PCI: info: Bridge (ISA bridge)
361KERN: PCI: line_size 00, latency 00, header_type 80, BIST 00
362KERN: PCI: ROM base host 00000000, pci 00000000, size 00000000
363KERN: PCI: cardbus_CIS 00000000, subsystem_id 3177, subsystem_vendor_id 1106
364KERN: PCI: interrupt_line 00, interrupt_pin 00, min_grant 00, max_latency 00
365KERN: PCI: base reg 0: host 00000000, pci 00000000, size 00000000, flags 00
366KERN: PCI: base reg 1: host 00000000, pci 00000000, size 00000000, flags 00
367KERN: PCI: base reg 2: host 00000000, pci 00000000, size 00000000, flags 00
368KERN: PCI: base reg 3: host 00000000, pci 00000000, size 00000000, flags 00
369KERN: PCI: base reg 4: host 00000000, pci 00000000, size 00000000, flags 00
370KERN: PCI: base reg 5: host 00000000, pci 00000000, size 00000000, flags 00
371KERN: PCI: Capabilities: PM
372KERN: PCI: [dom 0, bus 0] bus 0, device 17, function 1: vendor 1106, device 0571, revision 06
373KERN: PCI: class_base 01, class_function 01, class_api 8a
374KERN: PCI: vendor 1106: VIA Technologies, Inc.
375KERN: PCI: device 0571: VT82C586A/B/VT82C686/A/B/VT823x/A/C PIPC Bus Master IDE (VT82C586/B/VT82C686/A/B/VT8233/A/C/VT8235 PIPC Bus Master IDE)
376KERN: PCI: info: Mass storage controller (IDE interface)
377KERN: PCI: line_size 00, latency 20, header_type 00, BIST 00
378KERN: PCI: ROM base host 00000000, pci 00000000, size 00000000
379KERN: PCI: cardbus_CIS 00000000, subsystem_id 0571, subsystem_vendor_id 1106
380KERN: PCI: interrupt_line ff, interrupt_pin 01, min_grant 00, max_latency 00
381KERN: PCI: base reg 0: host 00000000, pci 00000000, size 00000000, flags 00
382KERN: PCI: base reg 1: host 00000000, pci 00000000, size 00000000, flags 00
383KERN: PCI: base reg 2: host 00000000, pci 00000000, size 00000000, flags 00
384KERN: PCI: base reg 3: host 00000000, pci 00000000, size 00000000, flags 00
385KERN: PCI: base reg 4: host 0000cc00, pci 0000cc00, size 00000010, flags 01
386KERN: PCI: base reg 5: host 00000000, pci 00000000, size 00000000, flags 00
387KERN: PCI: Capabilities: PM
388KERN: acpi: ACPI disabled
389KERN: usb uhci -1: successfully started the controller
390Last message repeated 2 times
391KERN: usb ohci: no devices found
392KERN: usb ehci -1: claiming ownership of the host controller
393KERN: usb ehci -1: successfully took ownership of the host controller
394KERN: usb ehci -1: successfully started the controller
395KERN: usb hub 2: port 0: device removed
396KERN: usb hub 2: port 0 disabled
397KERN: usb hub 2: port 1: device removed
398KERN: usb hub 2: port 1 disabled
399KERN: usb hub 7: port 0: device removed
400KERN: usb hub 7: port 0 disabled
401KERN: usb hub 7: port 1: device removed
402KERN: usb hub 7: port 1 disabled
403KERN: usb hub 12: port 0: device removed
404KERN: usb hub 12: port 0 disabled
405KERN: usb hub 12: port 1: device removed
406KERN: usb hub 12: port 1 disabled
407KERN: get_boot_partitions(): boot volume message:
408KERN: KMessage: buffer: 0x8097e3d0 (size/capacity: 316/316), flags: 0x0lx
409KERN: field: "booted from image" (BOOL): false
410KERN: field: "partition offset" (LLNG): 912677068800 (0xd47fcae000)
411KERN: field: "boot method" (LONG): 0 (0x0)
412KERN: field: "boot drive number" (LLNG): 128 (0x80)
413KERN: field: "disk identifier" (RAWT): data at 0x8097e4bc, 80 bytes
414KERN: get_boot_partitions(): boot method type: 0
415KERN: partitioning system: partitioning_systems/intel/extended/v1
416KERN: KDiskDeviceManager::_AddDiskSystem(partitioning_systems/intel/extended/v1)KERN:
417KERN: intel: ep_std_ops(0x1)
418KERN: intel: ep_std_ops(0x2)
419KERN: KDiskDeviceManager::_AddDiskSystem() done: No error
420KERN: partitioning system: partitioning_systems/intel/map/v1
421KERN: KDiskDeviceManager::_AddDiskSystem(partitioning_systems/intel/map/v1)
422KERN: intel: pm_std_ops(0x1)
423KERN: intel: pm_std_ops(0x2)
424KERN: KDiskDeviceManager::_AddDiskSystem() done: No error
425KERN: file system: file_systems/bfs/v1
426KERN: KDiskDeviceManager::_AddDiskSystem(file_systems/bfs/v1)
427KERN: KDiskDeviceManager::_AddDiskSystem() done: No error
428KERN: file system: file_systems/devfs/v1
429KERN: KDiskDeviceManager::_AddDiskSystem(file_systems/devfs/v1)
430KERN: KDiskDeviceManager::_AddDiskSystem() done: No error
431KERN: file system: file_systems/rootfs/v1
432KERN: KDiskDeviceManager::_AddDiskSystem(file_systems/rootfs/v1)
433KERN: KDiskDeviceManager::_AddDiskSystem() done: No error
434KERN: number of disk systems: 5
435KERN: KDiskDeviceManager::_Scan(/dev/disk)
436KERN: PCI-ATA: Controller in legacy mode: cmd 0x1f0, ctrl 0x3f6, irq 14
437KERN: PCI-ATA: init channel...
438KERN: PCI-ATA: channel index 0
439KERN: PCI-ATA: bus master base 0xcc00
440KERN: PCI-ATA: init channel done
441KERN: ata 0: _DevicePresent: device 0, presence 0
442KERN: ata 0: _DevicePresent: device 1, presence 0
443KERN: ata 0: deviceMask 0
444KERN: ata 0: ignoring device 0
445KERN: ata 0: ignoring device 1
446KERN: ata 0 error: target device not present
447Last message repeated 1 time
448KERN: ata 0 error: invalid target device
449KERN: Last message repeated 12 times.
450KERN: PCI-ATA: Controller in legacy mode: cmd 0x170, ctrl 0x376, irq 15
451KERN: PCI-ATA: init channel...
452KERN: PCI-ATA: channel index 1
453KERN: PCI-ATA: bus master base 0xcc08
454KERN: PCI-ATA: init channel done
455KERN: ata 1: _DevicePresent: device 0, presence 1
456KERN: ata 1: _DevicePresent: device selection failed for device 1
457KERN: ata 1: deviceMask 1
458KERN: ata 1: probing device 0
459KERN: ata 1: signature of device 0: 0xeb14
460KERN: atapi 1-0: model number: DVD RW DRU-820A
461KERN: atapi 1-0: serial number:
462KERN: atapi 1-0: firmware rev.: 1.0c
463KERN: atapi 1-0: using DMA mode 0x14
464KERN: ata 1: identified ATAPI device 0
465KERN: ata 1: ignoring device 1
466KERN: publish device: node 0x811da500, path disk/atapi/1/master/raw, module drivers/disk/scsi/scsi_cd/device_v1
467KERN: ata 1 error: target device not present
468KERN: ata 1 error: invalid target device
469KERN: Last message repeated 12 times.
470KERN: si-3112: controller found! vendor 0x1095, device 0x3112
471KERN: ahci: ahci_supports_device
472KERN: si-3112: controller_probe
473KERN: si-3112: publishing controller
474KERN: si-3112: controller_init
475KERN: si-3112: asic index 0
476KERN: si-3112: asic name si3112
477KERN: si-3112: int num 10
478KERN: si-3112: mmio addr 0x8060d000
479KERN: si-3112: controller_init success
480KERN: si-3112: publishing Primary Channel
481KERN: si-3112: channel_init enter
482KERN: si-3112: channel_index 0
483KERN: si-3112: channel name: Primary Channel
484KERN: si-3112: channel 0x811c2154
485KERN: si-3112: controller 0x811d90a8
486KERN: si-3112: mmio_addr 0x8060d000
487KERN: si-3112: channel_init leave
488KERN: ata 2: _DevicePresent: device 0, presence 1
489KERN: ata 2: _DevicePresent: device 1, presence 1
490KERN: ata 2: deviceMask 3
491KERN: ata 2: probing device 0
492KERN: ata 2: signature of device 0: 0x0000
493KERN: ata 2-0: model number: WDC WD1001FALS-55J7B0
494KERN: ata 2-0: serial number: WD-WMATV1659995
495KERN: ata 2-0: firmware rev.: 05.00K05
496KERN: ata 2-0: using DMA mode 0x16
497KERN: ata 2: identified ATA device 0
498KERN: ata 2: probing device 1
499KERN: ata 2 error: device 1 failed, error code is 0x00
500KERN: ata 2: signature of device 1: 0x0000
501KERN: ata 2 error: device ready not set
502KERN: ata 2-1 error: sending identify request failed
503KERN: ata 2 error: command failed, error bit is set. status 0x51, error 0x04
504KERN: publish device: node 0x811da870, path disk/ata/2/master/raw, module drivers/disk/scsi/scsi_disk/device_v1
505KERN: ata 2 error: target device not present
506KERN: ata 2 error: invalid target device
507KERN: Last message repeated 12 times.
508KERN: si-3112: publishing Secondary Channel
509KERN: si-3112: channel_init enter
510KERN: si-3112: channel_index 1
511KERN: si-3112: channel name: Secondary Channel
512KERN: si-3112: channel 0x811c2198
513KERN: si-3112: controller 0x811d90a8
514KERN: si-3112: mmio_addr 0x8060d000
515KERN: si-3112: channel_init leave
516KERN: ata 3: _DevicePresent: device 0, presence 1
517KERN: ata 3: _DevicePresent: device 1, presence 1
518KERN: ata 3: deviceMask 3
519KERN: ata 3: probing device 0
520KERN: ata 3: signature of device 0: 0x0000
521KERN: ata 3-0: model number: ST3120026AS
522KERN: ata 3-0: serial number: 3JT0N30C
523KERN: ata 3-0: firmware rev.: 3.05
524KERN: ata 3-0: using DMA mode 0x16
525KERN: ata 3: identified ATA device 0
526KERN: ata 3: probing device 1
527KERN: ata 3: signature of device 1: 0x0000
528KERN: ata 3 error: device ready not set
529KERN: ata 3-1 error: sending identify request failed
530KERN: ata 3 error: command failed, error bit is set. status 0x51, error 0x04
531KERN: publish device: node 0x811dab40, path disk/ata/3/master/raw, module drivers/disk/scsi/scsi_disk/device_v1
532KERN: ata 3 error: target device not present
533KERN: ata 3 error: invalid target device
534KERN: Last message repeated 12 times.
535KERN: ahci: ahci_supports_device
536Last message repeated 1 time
537KERN: KDiskDeviceManager::_Scan(/dev/disk/ata)
538KERN: KDiskDeviceManager::_Scan(/dev/disk/ata/2)
539KERN: KDiskDeviceManager::_Scan(/dev/disk/ata/2/master)
540KERN: KDiskDeviceManager::_Scan(/dev/disk/ata/2/master/raw)
541KERN: found device: /dev/disk/ata/2/master/raw
542KERN: DMAResource@0x811dc000: low/high 0/ffffffff, max segment count 512, align 2, boundary 65536, max transfer 33553920, max segment size 33554432
543KERN: heap_add_area: area 299 added to medium heap 0x819a2000 - usable range 0x84801000 - 0x84c00000
544KERN: dma buffer restrictions not yet implemented: boundary 65536
545KERN: Last message repeated 31 times.
546KERN: KDiskDeviceManager::_Scan(/dev/disk/ata/3)
547KERN: KDiskDeviceManager::_Scan(/dev/disk/ata/3/master)
548KERN: KDiskDeviceManager::_Scan(/dev/disk/ata/3/master/raw)
549KERN: found device: /dev/disk/ata/3/master/raw
550KERN: DMAResource@0x811dc5a0: low/high 0/ffffffff, max segment count 512, align 2, boundary 65536, max transfer 33553920, max segment size 33554432
551KERN: heap_add_area: area 334 added to medium heap 0x819a2000 - usable range 0x84c01000 - 0x85000000
552KERN: dma buffer restrictions not yet implemented: boundary 65536
553KERN: Last message repeated 31 times.
554KERN: KDiskDeviceManager::_Scan(/dev/disk/atapi)
555KERN: KDiskDeviceManager::_Scan(/dev/disk/atapi/1)
556KERN: KDiskDeviceManager::_Scan(/dev/disk/atapi/1/master)
557KERN: KDiskDeviceManager::_Scan(/dev/disk/atapi/1/master/raw)
558KERN: found device: /dev/disk/atapi/1/master/raw
559KERN: KDiskDeviceManager::_ScanPartition(/dev/disk/ata/2/master/raw)
560KERN: intel: ep_std_ops(0x1)
561KERN: trying: partitioning_systems/intel/extended/v1
562KERN: returned: -1
563KERN: intel: ep_std_ops(0x2)
564KERN: intel: pm_std_ops(0x1)
565KERN: trying: partitioning_systems/intel/map/v1
566KERN: intel: pm_identify_partition(0, 0: 0, 1000204886016, 512)
567KERN: returned: 0.81
568KERN: trying: file_systems/bfs/v1
569KERN: returned: -1
570KERN: trying: file_systems/devfs/v1
571KERN: returned: -1
572KERN: trying: file_systems/rootfs/v1
573KERN: returned: -1
574KERN: scanning with: partitioning_systems/intel/map/v1
575KERN: intel: pm_scan_partition(0, 0: 0, 1000204886016, 512)
576KERN: KDiskDeviceManager::_ScanPartition(/dev/disk/ata/2/master/0)
577KERN: intel: ep_std_ops(0x1)
578KERN: trying: partitioning_systems/intel/extended/v1
579KERN: intel: ep_identify_partition(0, 32256, 268431980544, 512)
580KERN: returned: -1
581KERN: intel: ep_std_ops(0x2)
582KERN: trying: partitioning_systems/intel/map/v1
583KERN: intel: pm_identify_partition(0, 3: 32256, 268431980544, 512)
584KERN: returned: -1
585KERN: trying: file_systems/bfs/v1
586KERN: returned: -1
587KERN: trying: file_systems/devfs/v1
588KERN: returned: -1
589KERN: trying: file_systems/rootfs/v1
590KERN: returned: -1
591KERN: KDiskDeviceManager::_ScanPartition(/dev/disk/ata/2/master/1)
592KERN: intel: ep_std_ops(0x1)
593KERN: trying: partitioning_systems/intel/extended/v1
594KERN: intel: ep_identify_partition(0, 268432012800, 214745610240, 512)
595KERN: returned: -1
596KERN: intel: ep_std_ops(0x2)
597KERN: trying: partitioning_systems/intel/map/v1
598KERN: intel: pm_identify_partition(0, 4: 268432012800, 214745610240, 512)
599KERN: returned: -1
600KERN: trying: file_systems/bfs/v1
601KERN: returned: -1
602KERN: trying: file_systems/devfs/v1
603KERN: returned: -1
604KERN: trying: file_systems/rootfs/v1
605KERN: returned: -1
606KERN: KDiskDeviceManager::_ScanPartition(/dev/disk/ata/2/master/2)
607KERN: intel: ep_std_ops(0x1)
608KERN: trying: partitioning_systems/intel/extended/v1
609KERN: intel: ep_identify_partition(0, 483177623040, 429499445760, 512)
610KERN: returned: -1
611KERN: intel: ep_std_ops(0x2)
612KERN: trying: partitioning_systems/intel/map/v1
613KERN: intel: pm_identify_partition(0, 5: 483177623040, 429499445760, 512)
614KERN: returned: -1
615KERN: trying: file_systems/bfs/v1
616KERN: returned: -1
617KERN: trying: file_systems/devfs/v1
618KERN: returned: -1
619KERN: trying: file_systems/rootfs/v1
620KERN: returned: -1
621KERN: KDiskDeviceManager::_ScanPartition(/dev/disk/ata/2/master/3)
622KERN: intel: ep_std_ops(0x1)
623KERN: trying: partitioning_systems/intel/extended/v1
624KERN: intel: ep_identify_partition(0, 912677068800, KERN: 87525204480, 512)
625KERN: returned: -1
626KERN: intel: ep_std_ops(0x2)
627KERN: trying: partitioning_systems/intel/map/v1
628KERN: intel: pm_identify_partition(0, 6: 912677068800, 87525204480, 512)
629KERN: returned: -1
630KERN: trying: file_systems/bfs/v1
631KERN: returned: 0.8
632KERN: trying: file_systems/devfs/v1
633KERN: returned: -1
634KERN: trying: file_systems/rootfs/v1
635KERN: returned: -1
636KERN: scanning with: file_systems/bfs/v1
637KERN: KDiskDeviceManager::_ScanPartition(/dev/disk/ata/3/master/raw)
638KERN: intel: ep_std_ops(0x1)
639KERN: trying: partitioning_systems/intel/extended/v1
640KERN: returned: -1
641KERN: intel: ep_std_ops(0x2)
642KERN: trying: partitioning_systems/intel/map/v1
643KERN: intel: pm_identify_partition(0, 1: 0, 120034123776, 512)
644KERN: returned: 0.81
645KERN: trying: file_systems/bfs/v1
646KERN: returned: -1
647KERN: trying: file_systems/devfs/v1
648KERN: returned: -1
649KERN: trying: file_systems/rootfs/v1
650KERN: returned: -1
651KERN: scanning with: partitioning_systems/intel/map/v1
652KERN: intel: pm_scan_partition(0, 1: 0, 120034123776, 512)
653KERN: KDiskDeviceManager::_ScanPartition(/dev/disk/ata/3/master/0)
654KERN: intel: ep_std_ops(0x1)
655KERN: trying: partitioning_systems/intel/extended/v1
656KERN: intel: ep_identify_partition(0, 32256, 42960605184, 512)
657KERN: returned: -1
658KERN: intel: ep_std_ops(0x2)
659KERN: trying: partitioning_systems/intel/map/v1
660KERN: intel: pm_identify_partition(0, 7: 32256, 42960605184, 512)
661KERN: returned: -1
662KERN: trying: file_systems/bfs/v1
663KERN: returned: -1
664KERN: trying: file_systems/devfs/v1
665KERN: returned: -1
666KERN: trying: file_systems/rootfs/v1
667KERN: returned: -1
668KERN: KDiskDeviceManager::_ScanPartition(/dev/disk/ata/3/master/1)
669KERN: intel: ep_std_ops(0x1)
670KERN: trying: partitioning_systems/intel/extended/v1
671KERN: intel: ep_identify_partition(0, 42960637440, 42960637440, 512)
672KERN: returned: -1
673KERN: intel: ep_std_ops(0x2)
674KERN: trying: partitioning_systems/intel/map/v1
675KERN: intel: pm_identify_partition(0, 8: 42960637440, 42960637440, 512)
676KERN: returned: -1
677KERN: trying: file_systems/bfs/v1
678KERN: returned: 0.8
679KERN: trying: file_systems/devfs/v1
680KERN: returned: -1
681KERN: trying: file_systems/rootfs/v1
682KERN: returned: -1
683KERN: scanning with: file_systems/bfs/v1
684KERN: KDiskDeviceManager::_ScanPartition(/dev/disk/ata/3/master/2)
685KERN: intel: ep_std_ops(0x1)
686KERN: trying: partitioning_systems/intel/extended/v1
687KERN: intel: ep_identify_partition(0, 85921274880, 34110236160, 512)
688KERN: returned: -1
689KERN: intel: ep_std_ops(0x2)
690KERN: trying: partitioning_systems/intel/map/v1
691KERN: intel: pm_identify_partition(0, 9: 85921274880, 34110236160, 512)
692KERN: returned: -1
693KERN: trying: file_systems/bfs/v1
694KERN: returned: 0.8
695KERN: trying: file_systems/devfs/v1
696KERN: returned: -1
697KERN: trying: file_systems/rootfs/v1
698KERN: returned: -1
699KERN: scanning with: file_systems/bfs/v1
700KERN: device 0: /dev/disk/ata/2/master/raw
701KERN: media status: No error
702KERN: device flags: 2
703KERN: offset: 0
704KERN: size: 1000204886016 (953869.71 MB)
705KERN: content size: 1000204886016
706KERN: block size: 512
707KERN: child count: 4
708KERN: index: -1
709KERN: status: 0
710KERN: flags: 5
711KERN: volume: -1
712KERN: disk system: partitioning_systems/intel/map/v1
713KERN: name: <NULL>
714KERN: content name: <NULL>
715KERN: type: <NULL>
716KERN: content type: Intel Partition Map
717KERN: params: <NULL>
718KERN: content params: <NULL>
719KERN: partition 3: /dev/disk/ata/2/master/0
720KERN: offset: 32256
721KERN: size: 268431980544 (255996.685 MB)
722KERN: content size: 0
723KERN: block size: 512
724KERN: child count: 0
725KERN: index: 0
726KERN: status: 2
727KERN: flags: 0
728KERN: volume: -1
729KERN: disk system: <NULL>
730KERN: name: <NULL>
731KERN: content name: <NULL>
732KERN: type: OS/2 IFS, Windows NT, Advanced Unix
733KERN: content type: <NULL>
734KERN: params: type = 7 ; active = 1
735KERN: content params: <NULL>
736KERN: partition 4: /dev/disk/ata/2/master/1
737KERN: offset: 268432012800
738KERN: size: 214745610240 (204797.373 MB)
739KERN: content size: 0
740KERN: block size: 512
741KERN: child count: 0
742KERN: index: 1
743KERN: status: 2
744KERN: flags: 0
745KERN: volume: -1
746KERN: disk system: <NULL>
747KERN: name: <NULL>
748KERN: content name: <NULL>
749KERN: type: Linux native
750KERN: content type: <NULL>
751KERN: params: type = 131 ; active = 0
752KERN: content params: <NULL>
753KERN: partition 5: /dev/disk/ata/2/master/2
754KERN: offset: 483177623040
755KERN: size: 429499445760 (409602.59 MB)
756KERN: content size: 0
757KERN: block size: 512
758KERN: child count: 0
759KERN: index: 2
760KERN: status: 2
761KERN: flags: 0
762KERN: volume: -1
763KERN: disk system: <NULL>
764KERN: name: <NULL>
765KERN: content name: <NULL>
766KERN: type: OS/2 IFS, Windows NT, Advanced Unix
767KERN: content type: <NULL>
768KERN: params: type = 7 ; active = 0
769KERN: content params: <NULL>
770KERN: partition 6: /dev/disk/ata/2/master/3
771KERN: offset: 912677068800
772KERN: size: 87525204480 (83470.539 MB)
773KERN: content size: 87525203968
774KERN: block size: 2048
775KERN: child count: 0
776KERN: index: 3
777KERN: status: 0
778KERN: flags: 2
779KERN: volume: -1
780KERN: disk system: file_systems/bfs/v1
781KERN: name: <NULL>
782KERN: content name: Haiku
783KERN: type: Be File System
784KERN: content type: Be File System
785KERN: params: type = 235 ; active = 0
786KERN: content params: <NULL>
787KERN: device 1: /dev/disk/ata/3/master/raw
788KERN: media status: No error
789KERN: device flags: 2
790KERN: offset: 0
791KERN: size: 120034123776 (114473.46 MB)
792KERN: content size: 120034123776
793KERN: block size: 512
794KERN: child count: 3
795KERN: index: -1
796KERN: status: 0
797KERN: flags: 5
798KERN: volume: -1
799KERN: disk system: partitioning_systems/intel/map/v1
800KERN: name: <NULL>
801KERN: content name: <NULL>
802KERN: type: <NULL>
803KERN: content type: Intel Partition Map
804KERN: params: <NULL>
805KERN: content params: <NULL>
806KERN: partition 7: /dev/disk/ata/3/master/0
807KERN: offset: 32256
808KERN: size: 42960605184 (40970.425 MB)
809KERN: content size: 0
810KERN: block size: 512
811KERN: child count: 0
812KERN: index: 0
813KERN: status: 2
814KERN: flags: 0
815KERN: volume: -1
816KERN: disk system: <NULL>
817KERN: name: <NULL>
818KERN: content name: <NULL>
819KERN: type: Unrecognized Type 0xbf
820KERN: content type: <NULL>
821KERN: params: type = 191 ; active = 1
822KERN: content params: <NULL>
823KERN: partition 8: /dev/disk/ata/3/master/1
824KERN: offset: 42960637440
825KERN: size: 42960637440 (40970.456 MB)
826KERN: content size: 42960635904
827KERN: block size: 2048
828KERN: child count: 0
829KERN: index: 1
830KERN: status: 0
831KERN: flags: 2
832KERN: volume: -1
833KERN: disk system: file_systems/bfs/v1
834KERN: name: <NULL>
835KERN: content name: BeStorage
836KERN: type: Be File System
837KERN: content type: Be File System
838KERN: params: type = 235 ; active = 0
839KERN: content params: <NULL>
840KERN: partition 9: /dev/disk/ata/3/master/2
841KERN: offset: 85921274880
842KERN: size: 34110236160 (32530.56 MB)
843KERN: content size: 34110234624
844KERN: block size: 2048
845KERN: child count: 0
846KERN: index: 2
847KERN: status: 0
848KERN: flags: 2
849KERN: volume: -1
850KERN: disk system: file_systems/bfs/v1
851KERN: name: <NULL>
852KERN: content name: Haiku4
853KERN: type: Be File System
854KERN: content type: Be File System
855KERN: params: type = 235 ; active = 0
856KERN: content params: <NULL>
857KERN: device 2: /dev/disk/atapi/1/master/raw
858KERN: media status: No media present
859KERN: device flags: 5
860KERN: bfs: mounted "Haiku" (root node at 524288, device = /dev/disk/ata/2/master/3)
861KERN: module: Search for file_cache/launch_speedup/v1 failed.
862KERN: partitioning system: partitioning_systems/amiga_rdb/v1
863KERN: KDiskDeviceManager::_AddDiskSystem(partitioning_systems/amiga_rdb/v1)
864KERN: KDiskDeviceManager::_AddDiskSystem() done: No error
865KERN: partitioning system: partitioning_systems/apple/v1
866KERN: KDiskDeviceManager::_AddDiskSystem(partitioning_systems/apple/v1)
867KERN: KDiskDeviceManager::_AddDiskSystem() done: No error
868KERN: partitioning system: partitioning_systems/efi_gpt/v1
869KERN: KDKERN: iskDeviceManager::_AddDiskSystem(partitioning_systems/efi_gpt/v1)
870KERN: KDiskDeviceManager::_AddDiskSystem() done: No error
871KERN: partitioning system: partitioning_systems/session/v1
872KERN: KDiskDeviceManager::_AddDiskSystem(partitioning_systems/session/v1)
873KERN: KDiskDeviceManager::_AddDiskSystem() done: No error
874KERN: file system: file_systems/attribute_overlay/v1
875KERN: KDiskDeviceManager::_AddDiskSystem(file_systems/attribute_overlay/v1)
876KERN: KDiskDeviceManager::_AddDiskSystem() done: No error
877KERN: file system: file_systems/cdda/v1
878KERN: KDiskDeviceManager::_AddDiskSystem(file_systems/cdda/v1)
879KERN: KDiskDeviceManager::_AddDiskSystem() done: No error
880KERN: file system: file_systems/ext2/v1
881KERN: KDiskDeviceManager::_AddDiskSystem(file_systems/ext2/v1)
882KERN: KDiskDeviceManager::_AddDiskSystem() done: No error
883KERN: file system: file_systems/fat/v1
884KERN: KDiskDeviceManager::_AddDiskSystem(file_systems/fat/v1)
885KERN: KDiskDeviceManager::_AddDiskSystem() done: No error
886KERN: file system: file_systems/iso9660/v1
887KERN: KDiskDeviceManager::_AddDiskSystem(file_systems/iso9660/v1)
888KERN: KDiskDeviceManager::_AddDiskSystem() done: No error
889KERN: file system: file_systems/nfs/v1
890KERN: KDiskDeviceManager::_AddDiskSystem(file_systems/nfs/v1)
891KERN: KDiskDeviceManager::_AddDiskSystem() done: No error
892KERN: file system: file_systems/ntfs/v1
893KERN: KDiskDeviceManager::_AddDiskSystem(file_systems/ntfs/v1)
894KERN: KDiskDeviceManager::_AddDiskSystem() done: No error
895KERN: file system: file_systems/reiserfs/v1
896KERN: KDiskDeviceManager::_AddDiskSystem(file_systems/reiserfs/v1)
897KERN: KDiskDeviceManager::_AddDiskSystem() done: No error
898KERN: file system: file_systems/userlandfs/v1
899KERN: KDiskDeviceManager::_AddDiskSystem(file_systems/userlandfs/v1)
900KERN: KDiskDeviceManager::_AddDiskSystem() done: No error
901KERN: file system: file_systems/write_overlay/v1
902KERN: KDiskDeviceManager::_AddDiskSystem(file_systems/write_overlay/v1)
903KERN: KDiskDeviceManager::_AddDiskSystem() done: No error
904KERN: KDiskDeviceManager::_ScanPartition(/dev/disk/ata/2/master/0)
905KERN: trying: partitioning_systems/amiga_rdb/v1
906KERN: con_init: trying module console/frame_buffer/v1
907KERN: loaded driver /boot/system/add-ons/kernel/drivers/dev/console
908KERN: loaded driver /boot/system/add-ons/kernel/drivers/dev/dprintf
909KERN: loaded driver /boot/system/add-ons/kernel/drivers/dev/keyboard
910KERN: loaded driver /boot/system/add-ons/kernel/drivers/dev/null
911KERN: loaded driver /boot/system/add-ons/kernel/drivers/dev/random
912KERN: loaded driver /boot/system/add-ons/kernel/drivers/dev/tty
913KERN: loaded driver /boot/system/add-ons/kernel/drivers/dev/zero
914KERN: ahci: ahci_supports_device
915KERN: Last message repeated 2 times.
916KERN: returned: -1
917KERN: trying: partitioning_systems/apple/v1
918KERN: returned: -1
919KERN: trying: partitioning_systems/efi_gpt/v1
920KERN: returned: -1
921KERN: trying: partitioning_systems/session/v1
922KERN: returned: -1
923KERN: trying: file_systems/attribute_overlay/v1
924KERN: returned: -1
925KERN: trying: file_systems/cdda/v1
926KERN: raw_command:
927KERN: returned: -1
928KERN: trying: file_systems/ext2/v1
929KERN: returned: -1
930KERN: trying: file_systems/fat/v1
931KERN: returned: -1
932KERN: trying: file_systems/iso9660/v1
933KERN: identify(1, 0x811b4bc0)
934KERN: returned: -1
935KERN: trying: file_systems/nfs/v1
936KERN: returned: -1
937KERN: trying: file_systems/ntfs/v1
938KERN: returned: 0.8
939KERN: trying: file_systems/reiserfs/v1
940KERN: returned: -1
941KERN: trying: file_systems/userlandfs/v1
942KERN: returned: -1
943KERN: trying: file_systems/write_overlay/v1
944KERN: returned: -1
945KERN: scanning with: file_systems/ntfs/v1
946KERN: KDiskDeviceManager::_ScanPartition(/dev/disk/ata/2/master/1)
947KERN: trying: partitioning_systems/amiga_rdb/v1
948KERN: returned: -1
949KERN: trying: partitioning_systems/apple/v1
950KERN: returned: -1
951KERN: trying: partitioning_systems/efi_gpt/v1
952KERN: returned: -1
953KERN: trying: partitioning_systems/session/v1
954KERN: returned: -1
955KERN: trying: file_systems/attribute_overlay/v1
956KERN: returned: -1
957KERN: trying: file_systems/cdda/v1
958KERN: raw_command:
959KERN: returned: -1
960KERN: trying: file_systems/ext2/v1
961KERN: returned: 0.8
962KERN: trying: file_systems/fat/v1
963KERN: returned: -1
964KERN: trying: file_systems/iso9660/v1
965KERN: identify(1, 0x811b4bc0)
966KERN: returned: -1
967KERN: trying: file_systems/nfs/v1
968KERN: returned: -1
969KERN: trying: file_systems/ntfs/v1
970KERN: returned: -1
971KERN: trying: file_systems/reiserfs/v1
972KERN: returned: -1
973KERN: trying: file_systems/userlandfs/v1
974KERN: returned: -1
975KERN: trying: file_systems/write_overlay/v1
976KERN: returned: -1
977KERN: scanning with: file_systems/ext2/v1
978KERN: KDiskDeviceManager::_ScanPartition(/dev/disk/ata/2/master/2)
979KERN: trying: partitioning_systems/amiga_rdb/v1
980KERN: returned: -1
981KERN: trying: partitioning_systems/apple/v1
982KERN: returned: -1
983KERN: trying: partitioning_systems/efi_gpt/v1
984KERN: returned: -1
985KERN: trying: partitioning_systems/session/v1
986KERN: returned: -1
987KERN: trying: file_systems/attribute_overlay/v1
988KERN: returned: -1
989KERN: trying: file_systems/cdda/v1
990KERN: raw_command:
991KERN: returned: -1
992KERN: trying: file_systems/ext2/v1
993KERN: returned: -1
994KERN: trying: file_systems/fat/v1
995KERN: returned: -1
996KERN: trying: file_systems/iso9660/v1
997KERN: identify(1, 0x811b4bc0)
998KERN: returned: -1
999KERN: trying: file_systems/nfs/v1
1000KERN: returned: -1
1001KERN: trying: file_systems/ntfs/v1
1002KERN: returned: 0.8
1003KERN: trying: file_systems/reiserfs/v1
1004KERN: returned: -1
1005KERN: trying: file_systems/userlandfs/v1
1006KERN: returned: -1
1007KERN: trying: file_systems/write_overlay/v1
1008KERN: returned: -1
1009KERN: scanning with: file_systems/ntfs/v1
1010KERN: KDiskDeviceManager::_ScanPartition(/dev/disk/ata/3/master/0)
1011KERN: trying: partitioning_systems/amiga_rdb/v1
1012KERN: returned: -1
1013KERN: trying: partitioning_systems/apple/v1
1014KERN: returned: -1
1015KERN: trying: partitioning_systems/efi_gpt/v1
1016KERN: returned: -1
1017KERN: trying: partitioning_systems/session/v1
1018KERN: returned: -1
1019KERN: trying: file_systems/attribute_overlay/v1
1020KERN: returned: -1
1021KERN: trying: file_systems/cdda/v1
1022KERN: raw_command:
1023KERN: returned: -1
1024KERN: trying: file_systems/ext2/v1
1025KERN: returned: 0.8
1026KERN: trying: file_systems/fat/v1
1027KERN: returned: -1
1028KERN: trying: file_systems/iso9660/v1
1029KERN: identify(1, 0x811b4bc0)
1030KERN: returned: -1
1031KERN: trying: file_systems/nfs/v1
1032KERN: returned: -1
1033KERN: trying: file_systems/ntfs/v1
1034KERN: returned: -1
1035KERN: trying: file_systems/reiserfs/v1
1036KERN: returned: -1
1037KERN: trying: file_systems/userlandfs/v1
1038KERN: returned: -1
1039KERN: trying: file_systems/write_overlay/v1
1040KERN: returned: -1
1041KERN: scanning with: file_systems/ext2/v1
1042KERN: KDiskDeviceManager::_ScanPartition(/dev/disk/ata/3/master/1)
1043KERN: trying: partitioning_systems/amiga_rdb/v1
1044KERN: returned: -1
1045KERN: trying: partitioning_systems/apple/v1
1046KERN: returned: -1
1047KERN: trying: partitioning_systems/efi_gpt/v1
1048KERN: returned: -1
1049KERN: trying: partitioning_systems/session/v1
1050KERN: returned: -1
1051KERN: trying: file_systems/attribute_overlay/v1
1052KERN: returned: -1
1053KERN: trying: file_systems/cdda/v1
1054KERN: raw_command:
1055KERN: returned: -1
1056KERN: trying: file_systems/ext2/v1
1057KERN: returned: -1
1058KERN: trying: file_systems/fat/v1
1059KERN: returned: -1
1060KERN: trying: file_systems/iso9660/v1
1061KERN: identify(1, 0x811b4bc0)
1062KERN: returned: -1
1063KERN: trying: file_systems/nfs/v1
1064KERN: returned: -1
1065KERN: trying: file_systems/ntfs/v1
1066KERN: returned: -1
1067KERN: trying: file_systems/reiserfs/v1
1068KERN: returned: -1
1069KERN: trying: file_systems/userlandfs/v1
1070KERN: returned: -1
1071KERN: trying: file_systems/write_overlay/v1
1072KERN: returned: -1
1073KERN: KDiskDeviceManager::_ScanPartition(/dev/disk/ata/3/master/2)
1074KERN: trying: partitioning_systems/amiga_rdb/v1
1075KERN: returned: -1
1076KERN: trying: partitioning_systems/apple/v1
1077KERN: returned: -1
1078KERN: trying: partitioning_systems/efi_gpt/v1
1079KERN: returned: -1
1080KERN: trying: partitioning_systems/session/v1
1081KERN: returned: -1
1082KERN: trying: file_systems/attribute_overlay/v1
1083KERN: returned: -1
1084KERN: trying: file_systems/cdda/v1
1085KERN: raw_command:
1086KERN: returned: -1
1087KERN: trying: file_systems/ext2/v1
1088KERN: returned: -1
1089KERN: trying: file_systems/fat/v1
1090KERN: returned: -1
1091KERN: trying: file_systems/iso9660/v1
1092KERN: identify(1, 0x811b4bc0)
1093KERN: returned: -1
1094KERN: trying: file_systems/nfs/v1
1095KERN: returned: -1
1096KERN: trying: file_systems/ntfs/v1
1097KERN: returned: -1
1098KERN: trying: file_systems/reiserfs/v1
1099KERN: returned: -1
1100KERN: trying: file_systems/userlandfs/v1
1101KERN: returned: -1
1102KERN: trying: file_systems/write_overlay/v1
1103KERN: returned: -1
1104KERN: KDiskDeviceManager::_Scan(/dev/disk)
1105KERN: KDiskDeviceManager::_Scan(/dev/disk/ata)
1106KERN: KDiskDeviceManager::_Scan(/dev/disk/ata/2)
1107KERN: KDiskDeviceManager::_Scan(/dev/disk/ata/2/master)
1108KERN: KDiskDeviceManager::_Scan(/dev/disk/ata/2/master/0)
1109KERN: KDiskDeviceManager::_Scan(/dev/disk/ata/2/master/1)
1110KERN: KDiskDeviceManager::_Scan(/dev/disk/ata/2/master/2)
1111KERN: KDiskDeviceManager::_Scan(/dev/disk/ata/2/master/3)
1112KERN: KDiskDeviceManager::_Scan(/dev/disk/ata/2/master/raw)
1113KERN: KDiskDeviceManager::_Scan(/dev/disk/ata/3)
1114KERN: KDiskDeviceManager::_Scan(/dev/disk/ata/3/master)
1115KERN: KDiskDeviceManager::_Scan(/dev/disk/ata/3/master/0)
1116KERN: KDiskDeviceManager::_Scan(/dev/disk/ata/3/master/1)
1117KERN: KDiskDeviceManager::_Scan(/dev/disk/ata/3/master/2)
1118KERN: KDiskDeviceManager::_Scan(/dev/disk/ata/3/master/raw)
1119KERN: KDiskDeviceManaKERN: ger::_Scan(/dev/disk/atapi)
1120KERN: KDiskDeviceManager::_Scan(/dev/disk/atapi/1)
1121KERN: KDiskDeviceManager::_Scan(/dev/disk/atapi/1/master)
1122KERN: KDiskDeviceManager::_Scan(/dev/disk/atapi/1/master/raw)
1123KERN: KDiskDeviceManager::_Scan(/dev/disk/floppy)
1124KERN: config_manager: driver module: init
1125KERN: driver_get_next_device_info(bus = 0, cookie = 0)
1126KERN: loaded driver /boot/system/add-ons/kernel/drivers/dev/disk/floppy/pc_floppy
1127KERN: KDiskDeviceManager::_Scan(/dev/disk/usb)
1128KERN: loaded driver /boot/system/add-ons/kernel/drivers/dev/disk/usb/usb_disk
1129KERN: KDiskDeviceManager::_Scan(/dev/disk/virtual)
1130KERN: nbd:>init_hardware()
1131KERN: nbd:>init_driver()
1132KERN: KDiskDeviceManager::_ScanPartition(/dev/disk/ata/2/master/0)
1133KERN: intel: ep_std_ops(0x1)
1134KERN: trying: partitioning_systems/intel/extended/v1
1135KERN: intel: ep_identify_partition(1, 32256, 268431980544, 512)
1136KERN: returned: -1
1137KERN: intel: ep_std_ops(0x2)
1138KERN: trying: partitioning_systems/intel/map/v1
1139KERN: intel: pm_identify_partition(1, 3: 32256, 268431980544, 512)
1140KERN: returned: -1
1141KERN: trying: file_systems/bfs/v1
1142KERN: returned: -1
1143KERN: trying: file_systems/devfs/v1
1144KERN: returned: -1
1145KERN: trying: file_systems/rootfs/v1
1146KERN: returned: -1
1147KERN: trying: partitioning_systems/amiga_rdb/v1
1148KERN: returned: -1
1149KERN: trying: partitioning_systems/apple/v1
1150KERN: returned: -1
1151KERN: trying: partitioning_systems/efi_gpt/v1
1152KERN: returned: -1
1153KERN: trying: partitioning_systems/session/v1
1154KERN: returned: -1
1155KERN: trying: file_systems/attribute_overlay/v1
1156KERN: returned: -1
1157KERN: trying: file_systems/cdda/v1
1158KERN: raw_command:
1159KERN: returned: -1
1160KERN: trying: file_systems/ext2/v1
1161KERN: returned: -1
1162KERN: trying: file_systems/fat/v1
1163KERN: returned: -1
1164KERN: trying: file_systems/iso9660/v1
1165KERN: identify(1, 0x811b4bc0)
1166KERN: returned: -1
1167KERN: trying: file_systems/nfs/v1
1168KERN: returned: -1
1169KERN: trying: file_systems/ntfs/v1
1170KERN: returned: 0.8
1171KERN: trying: file_systems/reiserfs/v1
1172KERN: returned: -1
1173KERN: trying: file_systems/userlandfs/v1
1174KERN: returned: -1
1175KERN: trying: file_systems/write_overlay/v1
1176KERN: returned: -1
1177KERN: KDiskDeviceManager::_ScanPartition(/dev/disk/ata/2/master/1)
1178KERN: intel: ep_std_ops(0x1)
1179KERN: trying: partitioning_systems/intel/extended/v1
1180KERN: intel: ep_identify_partition(1, 268432012800, 214745610240, 4096)
1181KERN: returned: -1
1182KERN: intel: ep_std_ops(0x2)
1183KERN: trying: partitioning_systems/intel/map/v1
1184KERN: intel: pm_identify_partition(1, 4: 268432012800, 214745610240, 4096)
1185KERN: returned: -1
1186KERN: trying: file_systems/bfs/v1
1187KERN: returned: -1
1188KERN: trying: file_systems/devfs/v1
1189KERN: returned: -1
1190KERN: trying: file_systems/rootfs/v1
1191KERN: returned: -1
1192KERN: trying: partitioning_systems/amiga_rdb/v1
1193KERN: returned: -1
1194KERN: trying: partitioning_systems/apple/v1
1195KERN: returned: -1
1196KERN: trying: partitioning_systems/efi_gpt/v1
1197KERN: returned: -1
1198KERN: trying: partitioning_systems/session/v1
1199KERN: returned: -1
1200KERN: trying: file_systems/attribute_overlay/v1
1201KERN: returned: -1
1202KERN: trying: file_systems/cdda/v1
1203KERN: raw_command:
1204KERN: returned: -1
1205KERN: trying: file_systems/ext2/v1
1206KERN: returned: 0.8
1207KERN: trying: file_systems/fat/v1
1208KERN: returned: -1
1209KERN: trying: file_systems/iso9660/v1
1210KERN: identify(1, 0x811b4bc0)
1211KERN: returned: -1
1212KERN: trying: file_systems/nfs/v1
1213KERN: returned: -1
1214KERN: trying: file_systems/ntfs/v1
1215KERN: returned: -1
1216KERN: trying: file_systems/reiserfs/v1
1217KERN: returned: -1
1218KERN: trying: file_systems/userlandfs/v1
1219KERN: returned: -1
1220KERN: trying: file_systems/write_overlay/v1
1221KERN: returned: -1
1222KERN: KDiskDeviceManager::_ScanPartition(/dev/disk/ata/2/master/2)
1223KERN: intel: ep_std_ops(0x1)
1224KERN: trying: partitioning_systems/intel/extended/v1
1225KERN: intel: ep_identify_partition(1, 483177623040, 429499445760, 512)
1226KERN: returned: -1
1227KERN: intel: ep_std_ops(0x2)
1228KERN: trying: partitioning_systems/intel/map/v1
1229KERN: intel: pm_identify_partition(1, 5: 483177623040, 429499445760, 512)
1230KERN: returned: -1
1231KERN: trying: file_systems/bfs/v1
1232KERN: returned: -1
1233KERN: trying: file_systems/devfs/v1
1234KERN: returned: -1
1235KERN: trying: file_systems/rootfs/v1
1236KERN: returned: -1
1237KERN: trying: partitioning_systems/amiga_rdb/v1
1238KERN: returned: -1
1239KERN: trying: partitioning_systems/apple/v1
1240KERN: returned: -1
1241KERN: trying: partitioning_systems/efi_gpt/v1
1242KERN: returned: -1
1243KERN: trying: partitioning_systems/session/v1
1244KERN: returned: -1
1245KERN: trying: file_systems/attribute_overlay/v1
1246KERN: returned: -1
1247KERN: trying: file_systems/cdda/v1
1248KERN: raw_command:
1249KERN: returned: -1
1250KERN: trying: file_systems/ext2/v1
1251KERN: returned: -1
1252KERN: trying: file_systems/fat/v1
1253KERN: returned: -1
1254KERN: trying: file_systems/iso9660/v1
1255KERN: identify(1, 0x811b4bc0)
1256KERN: returned: -1
1257KERN: trying: file_systems/nfs/v1
1258KERN: returned: -1
1259KERN: trying: file_systems/ntfs/v1
1260KERN: returned: 0.8
1261KERN: trying: file_systems/reiserfs/v1
1262KERN: returned: -1
1263KERN: trying: file_systems/userlandfs/v1
1264KERN: returned: -1
1265KERN: trying: file_systems/write_overlay/v1
1266KERN: returned: -1
1267KERN: KDiskDeviceManager::_ScanPartition(/dev/disk/ata/3/master/0)
1268KERN: intel: ep_std_ops(0x1)
1269KERN: trying: partitioning_systems/intel/extended/v1
1270KERN: intel: ep_identify_partition(1, 32256, 42960605184, 4096)
1271KERN: returned: -1
1272KERN: intel: ep_std_ops(0x2)
1273KERN: trying: partitioning_systems/intel/map/v1
1274KERN: intel: pm_identify_partition(1, 7: 32256, 42960605184, 4096)
1275KERN: returned: -1
1276KERN: trying: file_systems/bfs/v1
1277KERN: returned: -1
1278KERN: trying: file_systems/devfs/v1
1279KERN: returned: -1
1280KERN: trying: file_systems/rootfs/v1
1281KERN: returned: -1
1282KERN: trying: partitioning_systems/amiga_rdb/v1
1283KERN: returned: -1
1284KERN: trying: partitioning_systems/apple/v1
1285KERN: returned: -1
1286KERN: trying: partitioning_systems/efi_gpt/v1
1287KERN: returned: -1
1288KERN: trying: partitioning_systems/session/v1
1289KERN: returned: -1
1290KERN: trying: file_systems/attribute_overlay/v1
1291KERN: returned: -1
1292KERN: trying: file_systems/cdda/v1
1293KERN: raw_command:
1294KERN: returned: -1
1295KERN: trying: file_systems/ext2/v1
1296KERN: returned: 0.8
1297KERN: trying: file_systems/fat/v1
1298KERN: returned: -1
1299KERN: trying: file_systems/iso9660/v1
1300KERN: identify(1, 0x811b4bc0)
1301KERN: returned: -1
1302KERN: trying: file_systems/nfs/v1
1303KERN: returned: -1
1304KERN: trying: file_systems/ntfs/v1
1305KERN: returned: -1
1306KERN: trying: file_systems/reiserfs/v1
1307KERN: returned: -1
1308KERN: trying: file_systems/userlandfs/v1
1309KERN: returned: -1
1310KERN: trying: file_systems/write_overlay/v1
1311KERN: returned: -1
1312KERN: KDiskDeviceManager::_ScanPartition(/dev/disk/ata/3/master/1)
1313KERN: intel: ep_std_ops(0x1)
1314KERN: trying: partitioning_systems/intel/extended/v1
1315KERN: intel: ep_identify_partition(1, 42960637440, 42960637440, 2048)
1316KERN: returned: -1
1317KERN: intel: ep_std_ops(0x2)
1318KERN: trying: partitioning_systems/intel/map/v1
1319KERN: intel: pm_identify_partition(1, 8: 42960637440, 42960637440, 2048)
1320KERN: returned: -1
1321KERN: trying: file_systems/bfs/v1
1322KERN: returned: 0.8
1323KERN: trying: file_systems/devfs/v1
1324KERN: returned: -1
1325KERN: trying: file_systems/rootfs/v1
1326KERN: returned: -1
1327KERN: trying: partitioning_systems/amiga_rdb/v1
1328KERN: returned: -1
1329KERN: trying: partitioning_systems/apple/v1
1330KERN: returned: -1
1331KERN: trying: partitioning_systems/efi_gpt/v1
1332KERN: returned: -1
1333KERN: trying: partitioning_systems/session/v1
1334KERN: returned: -1
1335KERN: trying: file_systems/attribute_overlay/v1
1336KERN: returned: -1
1337KERN: trying: file_systems/cdda/v1
1338KERN: raw_command:
1339KERN: returned: -1
1340KERN: trying: file_systems/ext2/v1
1341KERN: returned: -1
1342KERN: trying: file_systems/fat/v1
1343KERN: returned: -1
1344KERN: trying: file_systems/iso9660/v1
1345KERN: identify(1, 0x811b4bc0)
1346KERN: returned: -1
1347KERN: trying: file_systems/nfs/v1
1348KERN: returned: -1
1349KERN: trying: file_systems/ntfs/v1
1350KERN: returned: -1
1351KERN: trying: file_systems/reiserfs/v1
1352KERN: returned: -1
1353KERN: trying: file_systems/userlandfs/v1
1354KERN: returned: -1
1355KERN: trying: file_systems/write_overlay/v1
1356KERN: returned: -1
1357KERN: KDiskDeviceManager::_ScanPartition(/dev/disk/ata/3/master/2)
1358KERN: intel: ep_std_ops(0x1)
1359KERN: trying: partitioning_systems/intel/extended/v1
1360KERN: intel: ep_identify_partition(1, 85921274880, 34110236160, 2048)
1361KERN: returned: -1
1362KERN: intel: ep_std_ops(0x2)
1363KERN: trying: partitioning_systems/intel/map/v1
1364KERN: intel: pm_identify_partition(1, 9: 85921274880, 34110236160, 2048)
1365KERN: returned: -1
1366KERN: trying: file_systems/bfs/v1
1367KERN: returned: 0.8
1368KERN: trying: file_systems/devfs/v1
1369KERN: returned: -1
1370KERN: trying: file_systems/rootfs/v1
1371KERN: returned: -1
1372KERN: trying: partitioning_systems/amiga_rdb/v1
1373KERN: returned: -1
1374KERN: trying: partitioning_systems/apple/v1
1375KERN: returned: -1
1376KERN: trying: partitioning_systems/efi_gpt/v1
1377KERN: returned: -1
1378KERN: trying: partitioning_systems/session/v1
1379KERN: returned: -1
1380KERN: trying: file_systems/attribute_overlay/v1
1381KERN: returned: -1
1382KERN: trying: file_systems/cdda/v1
1383KERN: raw_command:
1384KERN: returned: -1
1385KERN: trying: file_systems/ext2/v1
1386KERN: returned: -1
1387KERN: trying: file_systems/fat/v1
1388KERN: returned: -1
1389KERN: trying: file_systems/iso9660/v1
1390KERN: identify(1, 0x811b4bc0)
1391KERN: returned: -1
1392KERN: trying: file_systems/nfs/v1
1393KERN: returned: -1
1394KERN: trying: file_systems/ntfs/v1
1395KERN: returned: -1
1396KERN: trying: file_systems/reiserfs/v1
1397KERN: returned: -1
1398KERN: trying: file_systems/userlandfs/v1
1399KERN: returned: -1
1400KERN: trying: file_systems/write_overlay/v1
1401KERN: returned: -1
1402KERN: allocate_comKERN: mpage_entry(4, 34) -> 0xffff0118
1403KERN: allocate_commpage_entry(5, 74) -> 0xffff0140
1404KERN: set_memory_write_back base 0 length 7fff0000
1405KERN: find_nearest 7fff0000 0
1406KERN: find_nearest 3fff0000 1
1407KERN: find_nearest 1fff0000 2
1408KERN: find_nearest fff0000 3
1409KERN: find_nearest 7ff0000 4
1410KERN: find_nearest 3ff0000 5
1411KERN: solutions: 0xffffffff80000000
1412KERN: allocate MTRR slot 0, base = 0, length = 80000000, type=0x6
1413KERN: kernel debugger extension "debugger/disasm/v1": loaded
1414KERN: kernel debugger extension "debugger/hangman/v1": loaded
1415KERN: kernel debugger extension "debugger/invalidate_on_exit/v1": loaded
1416KERN: kernel debugger extension "debugger/run_on_exit/v1": loaded
1417KERN: kernel debugger extension "debugger/usb_keyboard/v1": loaded
1418KERN: allocate MTRR slot 1, base = d8000000, length = 800000, type=0x1
1419KERN: acpi: ACPI disabled
1420KERN: ahci: ahci_supports_device
1421KERN: bfs: bfs_open_dir:1589: Not a directory
1422KERN: register_domain(1, internet)
1423KERN: unregister_domain(0x8124cfa0, 1, internet)
1424KERN: [32mBT L2cap l2cap_std_ops[0m:
1425KERN: register_domain(10, l2cap)
1426KERN: [36mBT lower InitializeConnectionPurgeThread[0m: Connection purge port created 28695
1427KERN: register_domain(9, unix)
1428KERN: unregister_domain(0x812642d0, 9, unix)
1429KERN: register_domain(1, internet)
1430KERN: get_device_interface: ask "network/devices/bluetooth/v1" for loop
1431KERN: [34mBT bluetooth_device bluetooth_std_ops[0m:
1432KERN: [34mBT bluetooth_device bluetooth_std_ops[0m: Connection Thread error=0
1433KERN: [34mBT bluetooth_device bluetooth_init[0m: Initializing bluetooth device loop
1434KERN: get_device_interface: ask "network/devices/ethernet/v1" for loop
1435KERN: get_device_interface: ask "network/devices/loopback/v1" for loop
1436KERN: 3com: init_driver(0x81018060)
1437KERN: [3com] (xl) bus_alloc_resource(3, [20], 0x0, 0xffffffff, 0x1, 0x2)
1438KERN: [3com] (xl) using memory mapped I/O
1439KERN: [3com] (xl) bus_alloc_resource(1, [0], 0x0, 0xffffffff, 0x1, 0x6)
1440KERN: if_initname(0x819dfd80, xl, 3)
1441KERN: [3com] 3com: /dev/net/3com/0
1442KERN: [3com] (xl) media options word: a
1443KERN: [3com] (xl) found MII/AUTO
1444KERN: [3com] () Found MII: bmtphy
1445KERN: [3com] () Adding entry for Ethernet none
1446KERN: Adding entry for Ethernet 10baseT/UTP
1447KERN: 10baseTAdding entry for Ethernet 10baseT/UTP <full-duplex>
1448KERN: , 10baseT-FDXAdding entry for Ethernet 100baseTX
1449KERN: , 100baseTXAdding entry for Ethernet 100baseTX <full-duplex>
1450KERN: , 100baseTX-FDXAdding entry for Ethernet autoselect
1451KERN: , auto
1452KERN: ifmedia_set: target Ethernet autoselect
1453KERN: ifmedia_set: setting to Ethernet autoselect
1454KERN: loaded driver /boot/system/add-ons/kernel/drivers/dev/net/3com
1455KERN: ati: init_hardware() - no supported devices
1456KERN: intel_extreme: init_hardware()
1457KERN: Radeon - init_hardware: Version: 5.1.6.0
1458KERN: Radeon - Radeon_FindRom: found ROM @0xc0000
1459KERN: Radeon - Radeon_CardDetect: found supported device pci index 2, device 0x1002/0x4e4a
1460KERN: Radeon - init_driver:
1461KERN: [36mAGP:[0m bus manager init
1462KERN: [36mAGP:[0m found 2 AGP devices
1463KERN: Radeon - GetDriverSettings:
1464KERN: Radeon - Radeon_FindRom: found ROM @0xc0000
1465KERN: Radeon - Radeon_MapDevice: device: 010000
1466KERN: Radeon - Radeon_MapDevice: old PCI command state: 0x00000087
1467KERN: Radeon - Radeon_MapDevice: physical address of memory-mapped I/O: 0xe8020000-0xe802ffff
1468KERN: Radeon - Radeon_GetPLLInfo: ref_clk=2700, ref_div=12, xclk=36500, min_freq=20000, max_freq=40000 from Legacy BIOS
1469KERN: Radeon - Radeon_GetConnectorInfoFromBIOS: Port0: DDCType-2, DACType-1, TMDSType-0, ConnectorType-3
1470KERN: Radeon - Radeon_GetConnectorInfoFromBIOS: Port1: DDCType-3, DACType-0, TMDSType--1, ConnectorType-2
1471KERN: Radeon - Radeon_GetTMDSInfoFromBios: DFP table revision: 4
1472KERN: Radeon - RADEON_GetAccessibleVRAM: Generation 1 PCI interface in multifunction mode, accessible memory limited to one aperture
1473KERN:
1474KERN: Radeon - Radeon_DetectRAM: Detected total video RAM=262144K, accessible=131072K (PCI BAR=131072K)
1475KERN: Radeon - Radeon_DetectRAM: 128 MB SDR SGRAM found on 256 wide bus
1476KERN: Radeon - Radeon_UnmapDevice:
1477KERN: Radeon - probeDevice: found Radeon 9800 XT; ASIC: r350
1478KERN: Radeon - probeDevice: making /dev/graphics/1002_4E4A_010000
1479KERN: Radeon - Radeon_ProbeDevices: 1 supported devices
1480KERN: loaded driver /boot/system/add-ons/kernel/drivers/dev/graphics/radeon
1481KERN: etherpci: init_driver init_driver: etherpci not found
1482KERN: S3: init_hardware() - no supported devices
1483KERN: vesa: init_hardware()
1484KERN: vesa: init_driver()
1485KERN: vesa: publish_devices()
1486KERN: vesa: find_device()
1487KERN: loaded driver /boot/system/add-ons/kernel/drivers/dev/graphics/vesa
1488KERN: Radeon - open_hook: name=graphics/1002_4E4A_010000, flags=2, cookie=0x812204e0
1489KERN: Radeon - Radeon_MapDevice: device: 010000
1490KERN: Radeon - Radeon_MapDevice: old PCI command state: 0x00000086
1491KERN: Radeon - Radeon_MapDevice: physical address of memory-mapped I/O: 0xe8020000-0xe802ffff
1492KERN: Radeon - Radeon_MapDevice: physical address of framebuffer: 0xd8000000-0xdfffffff
1493KERN: allocate MTRR slot 2, base = d8000000, length = 8000000, type=0x1
1494KERN: Radeon - Radeon_MapDevice: mapped frame buffer @0x88000000
1495KERN: Radeon - Radeon_FirstOpen: Copy of Laptop Display Regs for Reference:
1496KERN: Radeon - Radeon_FirstOpen: LVDS GEN = 8000008
1497KERN: Radeon - Radeon_FirstOpen: LVDS PLL = 128c
1498KERN: Radeon - Radeon_FirstOpen: TMDS PLL = b01cb
1499KERN: Radeon - Radeon_FirstOpen: TMDS TRANS = 10000040
1500KERN: Radeon - Radeon_FirstOpen: FP1 GEN = 0
1501KERN: Radeon - Radeon_FirstOpen: FP2 GEN = 1000008
1502KERN: Radeon - Radeon_FirstOpen: TV DAC = 7760142
1503KERN: Radeon - createGARTBuffer:
1504KERN: Radeon - initGATT:
1505KERN: Radeon - initGATT: GATT_ptr=0x85000000, GATT_phys=0x04452000
1506KERN: pci_gart_map_area: 1508
1507KERN: Radeon - Radeon_InitMemController: Graphics card address mapping:
1508KERN: Radeon - Radeon_InitMemController: local memory 0x8000000@0xd8000000
1509KERN: Radeon - Radeon_InitMemController: PCI GART 0x2000000@0x7fff0000
1510KERN: Radeon - Radeon_InitMemController: disabled AGP GART 0x400000@0x82000000
1511KERN: Radeon - Radeon_SetupIRQ: installed IRQ @ 11
1512KERN: [36mAGP:[0m get_nth_agp_info(index 0)
1513KERN: [36mAGP:[0m get_nth_agp_info(index 1)
1514KERN: Radeon - Radeon_Set_AGP: Found AGP capable device
1515KERN: Radeon - agp_list_info: Device is a graphics card, subclass ID is $00
1516KERN: Radeon - agp_list_info: Vendor ID $1002
1517KERN: Radeon - agp_list_info: Device ID $4e4a
1518KERN: Radeon - agp_list_info: Bus 1, device 0, function 0
1519KERN: Radeon - agp_list_info: This device supports AGP specification 3.0;
1520KERN: Radeon - agp_list_info: AGP 3.0 4x mode is available
1521KERN: Radeon - agp_list_info: AGP 3.0 8x mode is available
1522KERN: Radeon - agp_list_info: Fast write transfers are supported
1523KERN: Radeon - agp_list_info: Sideband adressing is supported
1524KERN: Radeon - agp_list_info: 256 queued AGP requests can be handled.
1525KERN: Radeon - agp_list_active: listing settings now in use:
1526KERN: Radeon - agp_list_active: Fast write transfers are disabled
1527KERN: Radeon - agp_list_active: Sideband adressing is enabled
1528KERN: Radeon - agp_list_active: Max. AGP queued request depth is set to 1
1529KERN: Radeon - agp_list_active: The AGP interface is disabled.
1530KERN: Radeon - Radeon_Set_AGP: Disabling AGP mode...
1531KERN: [36mAGP:[0m set_agp_mode(command 0)
1532KERN: [36mAGP:[0m set PCI mode on all AGP capable devices.
1533KERN: Radeon - agp_list_active: listing settings now in use:
1534KERN: Radeon - agp_list_active: Fast write transfers are disabled
1535KERN: Radeon - agp_list_active: Max. AGP queued request depth is set to 1
1536KERN: Radeon - agp_list_active: The AGP interface is disabled.
1537KERN: Radeon - Radeon_InitCP:
1538KERN: Radeon - loadMicroEngineRAMData:
1539KERN: Radeon - Radeon_ResetEngine:
1540Last message repeated 1 time
1541KERN: Radeon - initRingBuffer: CP buffer address=7fff0000
1542KERN: Radeon - initRingBuffer: CP buffer size mask=10
1543KERN: Radeon - initCPFeedback: CP read pointer buffer==7fff2000
1544KERN: Radeon - Radeon_InitCP: bus_cntl=5133a2a0
1545KERN: Radeon - Radeon_InitCP: Done
1546KERN: Radeon - open_hook: returning 0x00000000
1547KERN: loaded driver /boot/system/add-ons/kernel/drivers/dev/net/pegasus
1548KERN: Radeon - Radeon_DetectTVOut:
1549KERN: DDC: ddc2_read(): DDC information read failure
1550KERN: Last message repeated 3 times.
1551KERN: DDC: verify_checksum() Checksum error in DDC information
1552KERN: DDC checksum incorrect!
1553KERN: DDC: verify_checksum() Checksum error in DDC information
1554KERN: DDC checksum incorrect!
1555KERN: DDC: verify_checksum() Checksum error in DDC information
1556KERN: DDC checksum incorrect!
1557KERN: DDC: verify_checksum() Checksum error in DDC information
1558KERN: DDC checksum incorrect!
1559KERN: Radeon - Radeon_DetectDisplays: Searching port 0
1560KERN: Radeon - Radeon_DetectCRTInt: Found colour CRT connected to CRT-DAC
1561KERN: Radeon - Radeon_DetectDisplays: Detected monitors: 0x2
1562KERN: Radeon - Radeon_ConnectorInfo: Port 0:-
1563KERN: Monitor: CRT
1564KERN: Conn Type: DVI-I
1565KERN: DDC Port: DVI DDC
1566KERN: TMDS Type: Internal
1567KERN: DAC Type: TV / External
1568KERN: Radeon - Radeon_ConnectorInfo: Port 1:-
1569KERN: Monitor: None
1570KERN: Conn Type: VGA
1571KERN: DDC Port: VGA DDC
1572KERN: TMDS Type: None
1573KERN: DAC Type: Primary
1574KERN: [33musb_asix:[0m00.43.KERN: 415:init_driver::ver.0.8.3
1575KERN: loaded driver /boot/system/add-ons/kernel/drivers/dev/net/usb_asix
1576KERN: loaded driver /boot/system/add-ons/kernel/drivers/dev/net/usb_ecm
1577KERN: bfs: bfs_open_dir:1589: Not a directory
1578KERN: get_device_interface: ask "network/devices/bluetooth/v1" for /dev/net/3com/0
1579KERN: [34mBT bluetooth_device bluetooth_init[0m: Initializing bluetooth device /dev/net/3com/0
1580KERN: get_devi<TRUNC>i<DROP>mpu401: B_MODULE_INIT
1581KERN: emuxki: setup_emuxki(0x845a3cc0)
1582KERN: emuxki: audio/hmulti/emuxki/1 deviceid = 0x02 chiprev = 7 model = 8061 enhanced at b400
1583KERN: emuxki: PCI command before: 5
1584KERN: emuxki: PCI command after: 5
1585KERN: emuxki: codec reset
1586KERN: emuxki: codec vendor id = 0x83847608
1587KERN: emuxki: codec description = SigmaTel STAC9708/9711
1588KERN: emuxki: codec 3d enhancement = SigmaTel
1589KERN: emuxki: writing codec registers
1590KERN: emuxki: codec master output = 0x00
1591KERN: emuxki: codec aux output = 0x00
1592KERN: emuxki: codec mono output = 0x8000
1593KERN: emuxki: codec pcm output = 0x808
1594KERN: emuxki: codec line in = 0x8808
1595KERN: emuxki: codec record line in= 0x404
1596KERN: emuxki: codec record gain = 0x8000
1597KERN: emuxki: installing interrupt : 5
1598KERN: emuxki: setup_emuxki done
1599KERN: emuxki: publish_devices()
1600KERN: emuxki: publish midi/emuxki/1
1601KERN: emuxki: publish audio/hmulti/emuxki/1
1602KERN: emuxki: emuxki: find_device(midi/emuxki/1)
1603KERN: emuxki: emuxki: find_device(audio/hmulti/emuxki/1)
1604KERN: loaded driver /boot/system/add-ons/kernel/drivers/dev/midi/emuxki
1605KERN: loaded driver /boot/system/add-ons/kernel/drivers/dev/midi/usb_midi
1606KERN: bfs: bfs_open_dir:1589: Not a directory
1607KERN: mpu401: reset MPU401
1608KERN: mpu401: enable UART mode
1609KERN: mpu401: port cmd ack is 0xff
1610KERN: mpu401: midi_open() done (count = 0)
1611KERN: ps2_hid: init_hardware
1612KERN: ps2_hid: init_driver
1613KERN: ps2_hid: publish_devices
1614KERN: ps2_hid: uninit_driver
1615KERN: loaded driver /boot/system/add-ons/kernel/drivers/dev/input/ps2_hid
1616KERN: loaded driver /boot/system/add-ons/kernel/drivers/dev/input/usb_hid
1617KERN: loaded driver /boot/system/add-ons/kernel/drivers/dev/input/wacom
1618KERN: cx23882: init_hardware()
1619KERN: bfs: bfs_open_dir:1589: Not a directory
1620KERN: /dev/net/3com/0: media change, media 0x900026 quality 1000 speed 10000
1621DAEMON 'DHCP': DHCP timeout shift: 4 secs (try 0)
1622KERN: ahci: ahci_supports_device
1623Last message repeated 1 time
1624KERN: firewire: fw_module_init
1625KERN: Texas Instruments TSB12LV26
1626KERN: vendor=104c, device=8020, revision = 0
1627KERN: firewire: found 1 cards
1628KERN: firewire: latency timer 20 -> 20.
1629KERN: firewire: cache size 8 -> 8.
1630KERN: firewire: IRQ 7
1631KERN: firewire: hardware register address e8184000
1632KERN: firewire: mapping physical address 0xe8184000 with 2048 bytes for fw ohci register
1633KERN: firewire: physical = 0xe8184000, virtual = 0x8456d000, offset = 0, phyadr = 0xe8184000, mapadr = 0x8456d000, size = 4096, area = 0x000009be
1634KERN: firewire: mapped registers to 0x8456d000
1635KERN: firewire:OHCI version 1.0 (ROM=1)
1636KERN: firewire:No. of Isochronous channels is 4.
1637KERN: firewire: allocating 3076 bytes for fwohci config etc. buf
1638KERN: firewire: area = 2495, size = 4096, virt = 0x845d6000, phy = 0x0012a000
1639KERN: firewire: allocating 4096 bytes for fw multi dma buf
1640KERN: firewire: area = 2496, size = 4096, virt = 0x845ff000, phy = 0x0012b000
1641KERN: firewire: allocating 4096 bytes for fw multi dma buf
1642KERN: firewire: area = 2497, size = 4096, virt = 0x84725000, phy = 0x0012c000
1643KERN: firewire: allocating 16384 bytes for fw multi dma buf
1644KERN: firewire: area = 2498, size = 16384, virt = 0x84726000, phy = 0x0028f000
1645KERN: firewire: allocating 4096 bytes for fw multi dma buf
1646KERN: firewire: area = 2499, size = 4096, virt = 0x8472a000, phy = 0x00293000
1647KERN: firewire:EUI64 00:30:95:26:b0:07:99:08
1648KERN: firewire:resetting OHCI...done (loop=0)
1649KERN: firewire:fwphy_rddata: failed(1).
1650KERN: firewire:Phy 1394a available S400, 3 ports.
1651KERN: firewire:Enable 1394a Enhancements
1652KERN: firewire:Link S400, max_rec 2048 bytes.
1653KERN: firewire:BUS_OPT 0xa002 -> 0xf800a002
1654KERN: firewire: allocating 524288 bytes for fw rx Area
1655KERN: firewire: area = 2501, size = 524288, virt = 0x8472f000, phy = 0x00294000
1656KERN: firewire: allocating 262144 bytes for fw rx Area
1657KERN: firewire: area = 2502, size = 262144, virt = 0x847af000, phy = 0x03e0b000
1658KERN: firewire:fwohci_set_intr: 1
1659KERN: firewire:Initiate bus reset
1660KERN: firewire:fwohci_intr_core: BUS reset
1661KERN: firewire:fwohci_intr_core: node_id=0x00000000, SelfID Count=1, CYCLEMASTER mode
1662KERN: loaded driver /boot/system/add-ons/kernel/drivers/dev/bus/fw_raw
1663KERN: node:0 link:1 gap:5 spd:2 con:1 pwr:4 p0:1 p1:1 p2:1 i:1 m:0
1664KERN: firewire:1 nodes, maxhop <= 0 cable IRM irm(0) (me)
1665KERN: firewire:fwohci_set_bus_manager: 0->0 (loop=0)
1666KERN: firewire:bus manager 0
1667KERN: firewire:fw_phy_config: root_node=-1 gap_count=5
1668KERN: fwohci_start: maxdesc 2
1669KERN: firewire:start AT DMA status=0
1670KERN: loaded driver /boot/system/add-ons/kernel/drivers/dev/bus/usb_raw
1671KERN: bfs: bfs_create_index:2050: File or Directory already exists
1672Last message repeated 1 time
1673KERN: auich: init_hardware()
1674KERN: auvia: init_hardware()
1675KERN: echo3g: init_hardware()
1676KERN: echo3g: no card found
1677KERN: loaded driver /boot/system/add-ons/kernel/drivers/dev/audio/hmulti/emuxki
1678KERN: bfs: bfs_open_dir:1589: Not a directory
1679KERN: emuxki: emuxki_pmem_alloc : numblocks : 1
1680KERN: emuxki: emuxki_pmem_alloc : 0
1681KERN: emuxki: emuxki_pmem_alloc : j == numblocks 1
1682KERN: emuxki: emuxki_pmem_alloc : j == numblocks emuxki_mem_new ok
1683KERN: emuxki: emuxki_pmem_alloc : j == numblocks returning
1684KERN: emuxki: emuxki_pmem_alloc : numblocks : 1
1685KERN: emuxki: emuxki_pmem_alloc : 0
1686KERN: emuxki: emuxki_pmem_alloc : 1
1687KERN: emuxki: emuxki_pmem_alloc : j == numblocks 1
1688KERN: emuxki: emuxki_pmem_alloc : j == numblocks emuxki_mem_new ok
1689KERN: emuxki: emuxki_pmem_alloc : j == numblocks returning
1690KERN: emuxki: emuxki_pmem_alloc : numblocks : 1
1691KERN: emuxki: emuxki_pmem_alloc : 0
1692KERN: emuxki: emuxki_pmem_alloc : 1
1693KERN: emuxki: emuxki_pmem_alloc : 2
1694KERN: emuxki: emuxki_pmem_alloc : j == numblocks 1
1695KERN: emuxki: emuxki_pmem_alloc : j == numblocks emuxki_mem_new ok
1696KERN: emuxki: emuxki_pmem_alloc : j == numblocks returning
1697KERN: emuxki: emuxki_pmem_alloc : numblocks : 1
1698KERN: emuxki: emuxki_pmem_alloc : 0
1699KERN: emuxki: emuxki_pmem_alloc : 1
1700KERN: emuxki: emuxki_pmem_alloc : 2
1701KERN: emuxki: emuxki_pmem_alloc : 3
1702KERN: emuxki: emuxki_pmem_alloc : j == numblocks 1
1703KERN: emuxki: emuxki_pmem_alloc : j == numblocks emuxki_mem_new ok
1704KERN: emuxki: emuxki_pmem_alloc : j == numblocks returning
1705KERN: emuxki: emuxki_pmem_alloc : numblocks : 1
1706KERN: emuxki: emuxki_pmem_alloc : 0
1707KERN: emuxki: emuxki_pmem_alloc : 1
1708KERN: emuxki: emuxki_pmem_alloc : 2
1709KERN: emuxki: emuxki_pmem_alloc : 3
1710KERN: emuxki: emuxki_pmem_alloc : 4
1711KERN: emuxki: emuxki_pmem_alloc : j == numblocks 1
1712KERN: emuxki: emuxki_pmem_alloc : j == numblocks emuxki_mem_new ok
1713KERN: emuxki: emuxki_pmem_alloc : j == numblocks returning
1714KERN: emuxki: set_enabled_channels 0 : enabled
1715KERN: emuxki: set_enabled_channels 1 : enabled
1716KERN: emuxki: set_enabled_channels 2 : enabled
1717KERN: emuxki: set_enabled_channels 3 : enabled
1718KERN: emuxki: name : Record
1719KERN: emuxki: name : Master
1720KERN: emuxki: name : PCM Out
1721KERN: emuxki: name : CD
1722KERN: emuxki: name : Aux In
1723KERN: emuxki: name : TAD
1724KERN: emuxki: name : Mic
1725KERN: emuxki: name : Line In
1726KERN: emuxki: name : Center/Lfe
1727KERN: emuxki: multi->control_count 97
1728KERN: firewire:fw_bus_probe:iterate and invalidate all nodes
1729KERN: firewire:fw_explore: found myself node(0) fc->nodeid(0) fc->max_node(0)
1730KERN: bus_explore done
1731KERN: bfs: bfs_create_index:2050: File or Directory already exists
1732KERN: ps2: probe_mouse Extended PS/2 mouse found
1733KERN: ps2: devfs_publish_device input/mouse/ps2/intelli_0, status = 0x00000000
1734KERN: void AddOnManager::MessageReceived(BMessage *) what: NMP_
1735KERN: ps2: devfs_publish_device input/keyboard/at/0, status = 0x00000000
1736KERN: void AddOnManager::MessageReceived(BMessage *) what: NMP_
1737KERN: ps2: keyboard found
1738DAEMON 'DHCP': DHCP timeout shift: 8 secs (try 0)
1739DAEMON 'DHCP': lease time of 172800 seconds
1740DAEMON 'DHCP': DNS: 192.168.11.1
1741DAEMON 'DHCP': lease time of 172800 seconds
1742DAEMON 'DHCP': DNS: 192.168.11.1
1743DAEMON 'DHCP': DHCP for /dev/net/3com/0, status: No error
1744DAEMON 'DHCP': lease time of 172800 seconds
1745DAEMON 'DHCP': DNS: 192.168.11.1
1746DAEMON 'DHCP': lease time of 172800 seconds
1747DAEMON 'DHCP': DNS: 192.168.11.1
1748DAEMON 'DHCP': DHCP for /dev/net/3com/0, status: No error
1749KERN: bfs: mounted "BeStorage" (root node at 524288, device = /dev/disk/ata/3/master/1)
1750KERN: heap_add_area: area 3274 added to small heap 0x811a2000 - usable range 0x90407000 - 0x90800000
1751KERN: heap_add_area: area 3395 added to small heap 0x811a2000 - usable range 0x92407000 - 0x92800000
1752KERN: heap_add_area: area 3504 added to small heap 0x811a2000 - usable range 0x94407000 - 0x94800000
1753KERN: heap_add_area: area 3541 added to large heap 0x81e6eccc - usable range 0x95001000 - 0x95400000
1754KERN: heap_add_area: area 3625 added to small heap 0x811a2000 - usable range 0x96807000 - 0x96c00000
1755KERN: heap_add_area: area 3742 added to small heap 0x811a2000 - usable range 0x98807000 - 0x98c00000
1756KERN: heap_add_area: area 3860 added to small heap 0x811a2000 - usable range 0x9a807000 - 0x9ac00000
1757KERN: heap_add_area: area 3977 added to small heap 0x811a2000 - usable range 0x9c807000 - 0x9cc00000
1758KERN: heap_add_area: area 4089 added to small heap 0x811a2000 - usable range 0x9e407000 - 0x9e800000
1759KERN: heap_add_area: area 4214 added to small heap 0x811a2000 - usable range 0xa0807000 - 0xa0c00000
1760KERN: heap_add_area: area 4323 added to small heap 0x811a2000 - usable range 0xa2407000 - 0xa2800000
1761KERN: heap_add_area: area 4431 added to small heap 0x811a2000 - usable range 0xa4407000 - 0xa4800000
1762KERN: heap_add_area: area 4540 added to small heap 0x811a2000 - usable range 0xa6007000 - 0xa6400000
1763KERN: heap_add_area: area 4704 added to small heap 0x811a2000 - usable range 0xa8007000 - 0xa8400000
1764KERN: heap_add_area: area 4851 added to small heap 0x811a2000 - usable range 0xaa807000 - 0xaac00000
1765KERN: heap_add_area: area 4989 added to small heap 0x811a2000 - usable range 0xacc07000 - 0xad000000
1766KERN: heap_add_area: area 5114 added to small heap 0x811a2000 - usable range 0xaec07000 - 0xaf000000
1767KERN: heap_add_area: area 5240 added to small heap 0x811a2000 - usable range 0xb1007000 - 0xb1400000
1768KERN: heap_add_area: area 5366 added to small heap 0x811a2000 - usable range 0xb3007000 - 0xb3400000
1769KERN: heap_add_area: area 5478 added to small heap 0x811a2000 - usable range 0xb5007000 - 0xb5400000
1770KERN: heap_add_area: area 5604 added to small heap 0x811a2000 - usable range 0xb7007000 - 0xb7400000
1771KERN: heap_add_area: area 5720 added to small heap 0x811a2000 - usable range 0xb9007000 - 0xb9400000
1772KERN: heap_add_area: area 5837 added to small heap 0x811a2000 - usable range 0xbb007000 - 0xbb400000
1773KERN: heap_add_area: area 5958 added to small heap 0x811a2000 - usable range 0xbd007000 - 0xbd400000
1774KERN: heap_add_area: area 6076 added to small heap 0x811a2000 - usable range 0xbf007000 - 0xbf400000
1775KERN: heap_add_area: area 6193 added to small heap 0x811a2000 - usable range 0xc1007000 - 0xc1400000
1776KERN: heap_add_area: area 6326 added to small heap 0x811a2000 - usable range 0xc3407000 - 0xc3800000
1777KERN: heap_add_area: area 6458 added to small heap 0x811a2000 - usable range 0xc5c07000 - 0xc6000000
1778KERN: heap_add_area: area 6604 added to small heap 0x811a2000 - usable range 0xc8007000 - 0xc8400000
1779KERN: heap_add_area: area 6737 added to small heap 0x811a2000 - usable range 0xca407000 - 0xca800000
1780KERN: heap_add_area: area 6872 added to small heap 0x811a2000 - usable range 0xcc807000 - 0xccc00000
1781KERN: heap_add_area: area 6980 added to small heap 0x811a2000 - usable range 0xce807000 - 0xcec00000
1782KERN: heap_add_area: area 7097 added to small heap 0x811a2000 - usable range 0xd0807000 - 0xd0c00000
1783KERN: heap_add_area: area 7206 added to small heap 0x811a2000 - usable range 0xd2407000 - 0xd2800000
1784KERN: heap_add_area: area 7322 added to small heap 0x811a2000 - usable range 0xd4407000 - 0xd4800000
1785KERN: heap_add_area: area 7456 added to small heap 0x811a2000 - usable range 0xd6807000 - 0xd6c00000
1786KERN: heap_add_area: area 7582 added to small heap 0x811a2000 - usable range 0xd8807000 - 0xd8c00000
1787KERN: heap_add_area: area 7703 added to small heap 0x811a2000 - usable range 0xdac07000 - 0xdb000000
1788KERN: heap_add_area: area 7824 added to small heap 0x811a2000 - usable range 0xdcc07000 - 0xdd000000
1789KERN: heap_add_area: area 7946 added to small heap 0x811a2000 - usable range 0xdec07000 - 0xdf000000
1790KERN: heap_add_area: area 8081 added to small heap 0x811a2000 - usable range 0xe1807000 - 0xe1c00000
1791KERN: heap_add_area: area 8196 added to small heap 0x811a2000 - usable range 0xe3407000 - 0xe3800000
1792KERN: heap_add_area: area 8323 added to small heap 0x811a2000 - usable range 0xe5407000 - 0xe5800000
1793KERN: heap_add_area: area 8444 added to small heap 0x811a2000 - usable range 0xe7407000 - 0xe7800000
1794KERN: heap_add_area: area 8565 added to small heap 0x811a2000 - usable range 0xe9407000 - 0xe9800000
1795KERN: register_domain(9, unix)
1796KERN: heap_add_area: area 11087 added to small heap 0x811a2000 - usable range 0xeb407000 - 0xeb800000
1797KERN: bfs: bfs_open_dir:1589: Not a directory
1798KERN: Last message repeated 21 times.
1799KERN: bfs: bfs_read_link:1476: Invalid Argument
1800USER: Throwing: "Extension `OptionalPackageDescription' is too long" at Sources/CLanguageInterface.cpp:79
1801AUTH 'sshd'[1187]: Did not receive identification string from 123.232.43.68
1802AUTH 'sshd'[1394]: Invalid user test from 123.232.43.68
1803AUTH 'sshd'[1395]: input_userauth_request: invalid user test
1804AUTH 'sshd'[1394]: error: Could not get shadow information for NOUSER
1805AUTH 'sshd'[1394]: Failed password for invalid user test from 123.232.43.68 port 51573 ssh2
1806AUTH 'sshd'[1395]: Received disconnect from 123.232.43.68: 11: Bye Bye
1807AUTH 'sshd'[1396]: Invalid user test1 from 123.232.43.68
1808AUTH 'sshd'[1397]: input_userauth_request: invalid user test1
1809AUTH 'sshd'[1396]: error: Could not get shadow information for NOUSER
1810AUTH 'sshd'[1396]: Failed password for invalid user test1 from 123.232.43.68 port 51839 ssh2
1811AUTH 'sshd'[1397]: Received disconnect from 123.232.43.68: 11: Bye Bye
1812AUTH 'sshd'[1398]: Invalid user test2 from 123.232.43.68
1813AUTH 'sshd'[1399]: input_userauth_request: invalid user test2
1814AUTH 'sshd'[1398]: error: Could not get shadow information for NOUSER
1815AUTH 'sshd'[1398]: Failed password for invalid user test2 from 123.232.43.68 port 52050 ssh2
1816AUTH 'sshd'[1399]: Received disconnect from 123.232.43.68: 11: Bye Bye
1817AUTH 'sshd'[1400]: Invalid user test3 from 123.232.43.68
1818AUTH 'sshd'[1401]: input_userauth_request: invalid user test3
1819AUTH 'sshd'[1400]: error: Could not get shadow information for NOUSER
1820AUTH 'sshd'[1400]: Failed password for invalid user test3 from 123.232.43.68 port 52261 ssh2
1821AUTH 'sshd'[1401]: Received disconnect from 123.232.43.68: 11: Bye Bye
1822AUTH 'sshd'[1402]: Invalid user test4 from 123.232.43.68
1823AUTH 'sshd'[1403]: input_userauth_request: invalid user test4
1824AUTH 'sshd'[1402]: error: Could not get shadow information for NOUSER
1825AUTH 'sshd'[1402]: Failed password for invalid user test4 from 123.232.43.68 port 52496 ssh2
1826AUTH 'sshd'[1403]: Received disconnect from 123.232.43.68: 11: Bye Bye
1827AUTH 'sshd'[1404]: Invalid user test5 from 123.232.43.68
1828AUTH 'sshd'[1405]: input_userauth_request: invalid user test5
1829AUTH 'sshd'[1404]: error: Could not get shadow information for NOUSER
1830AUTH 'sshd'[1404]: Failed password for invalid user test5 from 123.232.43.68 port 52721 ssh2
1831AUTH 'sshd'[1405]: Received disconnect from 123.232.43.68: 11: Bye Bye
1832AUTH 'sshd'[1406]: Invalid user test6 from 123.232.43.68
1833AUTH 'sshd'[1407]: input_userauth_request: invalid user test6
1834AUTH 'sshd'[1406]: error: Could not get shadow information for NOUSER
1835AUTH 'sshd'[1406]: Failed password for invalid user test6 from 123.232.43.68 port 52955 ssh2
1836AUTH 'sshd'[1407]: Received disconnect from 123.232.43.68: 11: Bye Bye
1837AUTH 'sshd'[1408]: Invalid user test7 from 123.232.43.68
1838AUTH 'sshd'[1409]: input_userauth_request: invalid user test7
1839AUTH 'sshd'[1408]: error: Could not get shadow information for NOUSER
1840AUTH 'sshd'[1408]: Failed password for invalid user test7 from 123.232.43.68 port 53785 ssh2
1841AUTH 'sshd'[1409]: Received disconnect from 123.232.43.68: 11: Bye Bye
1842AUTH 'sshd'[1410]: Invalid user test8 from 123.232.43.68
1843AUTH 'sshd'[1411]: input_userauth_request: invalid user test8
1844AUTH 'sshd'[1410]: error: Could not get shadow information for NOUSER
1845AUTH 'sshd'[1410]: Failed password for invalid user test8 from 123.232.43.68 port 54040 ssh2
1846AUTH 'sshd'[1411]: Received disconnect from 123.232.43.68: 11: Bye Bye
1847AUTH 'sshd'[1412]: Invalid user test9 from 123.232.43.68
1848AUTH 'sshd'[1413]: input_userauth_request: invalid user test9
1849AUTH 'sshd'[1412]: error: Could not get shadow information for NOUSER
1850AUTH 'sshd'[1412]: Failed password for invalid user test9 from 123.232.43.68 port 54922 ssh2
1851AUTH 'sshd'[1413]: Received disconnect from 123.232.43.68: 11: Bye Bye
1852AUTH 'sshd'[1414]: Invalid user test10 from 123.232.43.68
1853AUTH 'sshd'[1415]: input_userauth_request: invalid user test10
1854AUTH 'sshd'[1414]: error: Could not get shadow information for NOUSER
1855AUTH 'sshd'[1414]: Failed password for invalid user test10 from 123.232.43.68 port 55198 ssh2
1856AUTH 'sshd'[1415]: Received disconnect from 123.232.43.68: 11: Bye Bye
1857AUTH 'sshd'[1416]: Invalid user admin1 from 123.232.43.68
1858AUTH 'sshd'[1417]: input_userauth_request: invalid user admin1
1859AUTH 'sshd'[1416]: error: Could not get shadow information for NOUSER
1860AUTH 'sshd'[1416]: Failed password for invalid user admin1 from 123.232.43.68 port 56003 ssh2
1861AUTH 'sshd'[1417]: Received disconnect from 123.232.43.68: 11: Bye Bye
1862AUTH 'sshd'[1418]: Invalid user admin2 from 123.232.43.68
1863AUTH 'sshd'[1419]: input_userauth_request: invalid user admin2
1864AUTH 'sshd'[1418]: error: Could not get shadow information for NOUSER
1865AUTH 'sshd'[1418]: Failed password for invalid user admin2 from 123.232.43.68 port 56270 ssh2
1866AUTH 'sshd'[1419]: Received disconnect from 123.232.43.68: 11: Bye Bye
1867AUTH 'sshd'[1420]: Invalid user admin3 from 123.232.43.68
1868AUTH 'sshd'[1421]: input_userauth_request: invalid user admin3
1869AUTH 'sshd'[1420]: error: Could not get shadow information for NOUSER
1870AUTH 'sshd'[1420]: Failed password for invalid user admin3 from 123.232.43.68 port 57069 ssh2
1871AUTH 'sshd'[1421]: Received disconnect from 123.232.43.68: 11: Bye Bye
1872AUTH 'sshd'[1422]: Invalid user admin4 from 123.232.43.68
1873AUTH 'sshd'[1423]: input_userauth_request: invalid user admin4
1874AUTH 'sshd'[1422]: error: Could not get shadow information for NOUSER
1875AUTH 'sshd'[1422]: Failed password for invalid user admin4 from 123.232.43.68 port 57336 ssh2
1876AUTH 'sshd'[1423]: Received disconnect from 123.232.43.68: 11: Bye Bye
1877AUTH 'sshd'[1424]: Invalid user admin5 from 123.232.43.68
1878AUTH 'sshd'[1425]: input_userauth_request: invalid user admin5
1879AUTH 'sshd'[1424]: error: Could not get shadow information for NOUSER
1880AUTH 'sshd'[1424]: Failed password for invalid user admin5 from 123.232.43.68 port 58129 ssh2
1881AUTH 'sshd'[1425]: Received disconnect from 123.232.43.68: 11: Bye Bye
1882AUTH 'sshd'[1426]: Invalid user admin6 from 123.232.43.68
1883AUTH 'sshd'[1427]: input_userauth_request: invalid user admin6
1884AUTH 'sshd'[1426]: error: Could not get shadow information for NOUSER
1885AUTH 'sshd'[1426]: Failed password for invalid user admin6 from 123.232.43.68 port 58399 ssh2
1886AUTH 'sshd'[1427]: Received disconnect from 123.232.43.68: 11: Bye Bye
1887AUTH 'sshd'[1429]: Invalid user admin7 from 123.232.43.68
1888AUTH 'sshd'[1430]: input_userauth_request: invalid user admin7
1889AUTH 'sshd'[1429]: error: Could not get shadow information for NOUSER
1890AUTH 'sshd'[1429]: Failed password for invalid user admin7 from 123.232.43.68 port 59211 ssh2
1891AUTH 'sshd'[1430]: Received disconnect from 123.232.43.68: 11: Bye Bye
1892AUTH 'sshd'[1433]: Invalid user admin8 from 123.232.43.68
1893AUTH 'sshd'[1434]: input_userauth_request: invalid user admin8
1894AUTH 'sshd'[1433]: error: Could not get shadow information for NOUSER
1895AUTH 'sshd'[1433]: Failed password for invalid user admin8 from 123.232.43.68 port 59439 ssh2
1896AUTH 'sshd'[1434]: Received disconnect from 123.232.43.68: 11: Bye Bye
1897AUTH 'sshd'[1437]: Invalid user admin9 from 123.232.43.68
1898AUTH 'sshd'[1438]: input_userauth_request: invalid user admin9
1899AUTH 'sshd'[1437]: error: Could not get shadow information for NOUSER
1900AUTH 'sshd'[1437]: Failed password for invalid user admin9 from 123.232.43.68 port 60257 ssh2
1901AUTH 'sshd'[1438]: Received disconnect from 123.232.43.68: 11: Bye Bye
1902AUTH 'sshd'[1442]: Invalid user admin10 from 123.232.43.68
1903AUTH 'sshd'[1443]: input_userauth_request: invalid user admin10
1904AUTH 'sshd'[1442]: error: Could not get shadow information for NOUSER
1905AUTH 'sshd'[1442]: Failed password for invalid user admin10 from 123.232.43.68 port 60545 ssh2
1906AUTH 'sshd'[1443]: Received disconnect from 123.232.43.68: 11: Bye Bye
1907AUTH 'sshd'[1444]: Invalid user disk from 123.232.43.68
1908AUTH 'sshd'[1445]: input_userauth_request: invalid user disk
1909AUTH 'sshd'[1444]: error: Could not get shadow information for NOUSER
1910AUTH 'sshd'[1444]: Failed password for invalid user disk from 123.232.43.68 port 60894 ssh2
1911AUTH 'sshd'[1445]: Received disconnect from 123.232.43.68: 11: Bye Bye
1912AUTH 'sshd'[1446]: Invalid user disk1 from 123.232.43.68
1913AUTH 'sshd'[1447]: input_userauth_request: invalid user disk1
1914AUTH 'sshd'[1446]: error: Could not get shadow information for NOUSER
1915AUTH 'sshd'[1446]: Failed password for invalid user disk1 from 123.232.43.68 port 33400 ssh2
1916AUTH 'sshd'[1447]: Received disconnect from 123.232.43.68: 11: Bye Bye
1917AUTH 'sshd'[1448]: Invalid user disk2 from 123.232.43.68
1918AUTH 'sshd'[1449]: input_userauth_request: invalid user disk2
1919AUTH 'sshd'[1448]: error: Could not get shadow information for NOUSER
1920AUTH 'sshd'[1448]: Failed password for invalid user disk2 from 123.232.43.68 port 33783 ssh2
1921AUTH 'sshd'[1449]: Received disconnect from 123.232.43.68: 11: Bye Bye
1922AUTH 'sshd'[1450]: Invalid user disk3 from 123.232.43.68
1923AUTH 'sshd'[1451]: input_userauth_request: invalid user disk3
1924AUTH 'sshd'[1450]: error: Could not get shadow information for NOUSER
1925AUTH 'sshd'[1450]: Failed password for invalid user disk3 from 123.232.43.68 port 34493 ssh2
1926AUTH 'sshd'[1451]: Received disconnect from 123.232.43.68: 11: Bye Bye
1927AUTH 'sshd'[1452]: Invalid user testftp from 123.232.43.68
1928AUTH 'sshd'[1453]: input_userauth_request: invalid user testftp
1929AUTH 'sshd'[1452]: error: Could not get shadow information for NOUSER
1930AUTH 'sshd'[1452]: Failed password for invalid user testftp from 123.232.43.68 port 34867 ssh2
1931AUTH 'sshd'[1453]: Received disconnect from 123.232.43.68: 11: Bye Bye
1932AUTH 'sshd'[1454]: Invalid user testftp2 from 123.232.43.68
1933AUTH 'sshd'[1455]: input_userauth_request: invalid user testftp2
1934AUTH 'sshd'[1454]: error: Could not get shadow information for NOUSER
1935AUTH 'sshd'[1454]: Failed password for invalid user testftp2 from 123.232.43.68 port 35591 ssh2
1936AUTH 'sshd'[1455]: Received disconnect from 123.232.43.68: 11: Bye Bye
1937AUTH 'sshd'[1456]: Invalid user testftp3 from 123.232.43.68
1938AUTH 'sshd'[1457]: input_userauth_request: invalid user testftp3
1939AUTH 'sshd'[1456]: error: Could not get shadow information for NOUSER
1940AUTH 'sshd'[1456]: Failed password for invalid user testftp3 from 123.232.43.68 port 35954 ssh2
1941AUTH 'sshd'[1457]: Received disconnect from 123.232.43.68: 11: Bye Bye
1942AUTH 'sshd'[1459]: Invalid user testftp4 from 123.232.43.68
1943AUTH 'sshd'[1460]: input_userauth_request: invalid user testftp4
1944AUTH 'sshd'[1459]: error: Could not get shadow information for NOUSER
1945AUTH 'sshd'[1459]: Failed password for invalid user testftp4 from 123.232.43.68 port 36674 ssh2
1946AUTH 'sshd'[1460]: Received disconnect from 123.232.43.68: 11: Bye Bye
1947AUTH 'sshd'[1463]: Invalid user testftp5 from 123.232.43.68
1948AUTH 'sshd'[1464]: input_userauth_request: invalid user testftp5
1949AUTH 'sshd'[1463]: error: Could not get shadow information for NOUSER
1950AUTH 'sshd'[1463]: Failed password for invalid user testftp5 from 123.232.43.68 port 37032 ssh2
1951AUTH 'sshd'[1464]: Received disconnect from 123.232.43.68: 11: Bye Bye
1952AUTH 'sshd'[1465]: Invalid user testftp6 from 123.232.43.68
1953AUTH 'sshd'[1466]: input_userauth_request: invalid user testftp6
1954AUTH 'sshd'[1465]: error: Could not get shadow information for NOUSER
1955AUTH 'sshd'[1465]: Failed password for invalid user testftp6 from 123.232.43.68 port 37762 ssh2
1956AUTH 'sshd'[1466]: Received disconnect from 123.232.43.68: 11: Bye Bye
1957AUTH 'sshd'[1467]: Invalid user testftp7 from 123.232.43.68
1958AUTH 'sshd'[1468]: input_userauth_request: invalid user testftp7
1959AUTH 'sshd'[1467]: error: Could not get shadow information for NOUSER
1960AUTH 'sshd'[1467]: Failed password for invalid user testftp7 from 123.232.43.68 port 38148 ssh2
1961AUTH 'sshd'[1468]: Received disconnect from 123.232.43.68: 11: Bye Bye
1962AUTH 'sshd'[1470]: Invalid user testftp8 from 123.232.43.68
1963AUTH 'sshd'[1471]: input_userauth_request: invalid user testftp8
1964AUTH 'sshd'[1470]: error: Could not get shadow information for NOUSER
1965AUTH 'sshd'[1470]: Failed password for invalid user testftp8 from 123.232.43.68 port 38863 ssh2
1966AUTH 'sshd'[1471]: Received disconnect from 123.232.43.68: 11: Bye Bye
1967AUTH 'sshd'[1474]: Invalid user testftp9 from 123.232.43.68
1968AUTH 'sshd'[1476]: input_userauth_request: invalid user testftp9
1969AUTH 'sshd'[1474]: error: Could not get shadow information for NOUSER
1970AUTH 'sshd'[1474]: Failed password for invalid user testftp9 from 123.232.43.68 port 39264 ssh2
1971AUTH 'sshd'[1476]: Received disconnect from 123.232.43.68: 11: Bye Bye
1972AUTH 'sshd'[1478]: Invalid user testftp10 from 123.232.43.68
1973AUTH 'sshd'[1479]: input_userauth_request: invalid user testftp10
1974AUTH 'sshd'[1478]: error: Could not get shadow information for NOUSER
1975AUTH 'sshd'[1478]: Failed password for invalid user testftp10 from 123.232.43.68 port 39955 ssh2
1976AUTH 'sshd'[1479]: Received disconnect from 123.232.43.68: 11: Bye Bye
1977AUTH 'sshd'[1480]: Invalid user favorito from 123.232.43.68
1978AUTH 'sshd'[1481]: input_userauth_request: invalid user favorito
1979AUTH 'sshd'[1480]: error: Could not get shadow information for NOUSER
1980AUTH 'sshd'[1480]: Failed password for invalid user favorito from 123.232.43.68 port 40379 ssh2
1981AUTH 'sshd'[1481]: Received disconnect from 123.232.43.68: 11: Bye Bye
1982AUTH 'sshd'[1482]: Invalid user favorito1 from 123.232.43.68
1983AUTH 'sshd'[1483]: input_userauth_request: invalid user favorito1
1984AUTH 'sshd'[1482]: error: Could not get shadow information for NOUSER
1985AUTH 'sshd'[1482]: Failed password for invalid user favorito1 from 123.232.43.68 port 41051 ssh2
1986AUTH 'sshd'[1483]: Received disconnect from 123.232.43.68: 11: Bye Bye
1987AUTH 'sshd'[1485]: Invalid user favorito2 from 123.232.43.68
1988AUTH 'sshd'[1486]: input_userauth_request: invalid user favorito2
1989AUTH 'sshd'[1485]: error: Could not get shadow information for NOUSER
1990AUTH 'sshd'[1485]: Failed password for invalid user favorito2 from 123.232.43.68 port 41444 ssh2
1991AUTH 'sshd'[1486]: Received disconnect from 123.232.43.68: 11: Bye Bye
1992AUTH 'sshd'[1487]: Invalid user favorito3 from 123.232.43.68
1993AUTH 'sshd'[1488]: input_userauth_request: invalid user favorito3
1994AUTH 'sshd'[1487]: error: Could not get shadow information for NOUSER
1995AUTH 'sshd'[1487]: Failed password for invalid user favorito3 from 123.232.43.68 port 42111 ssh2
1996AUTH 'sshd'[1488]: Received disconnect from 123.232.43.68: 11: Bye Bye
1997AUTH 'sshd'[1489]: Invalid user favorito4 from 123.232.43.68
1998AUTH 'sshd'[1490]: input_userauth_request: invalid user favorito4
1999AUTH 'sshd'[1489]: error: Could not get shadow information for NOUSER
2000AUTH 'sshd'[1489]: Failed password for invalid user favorito4 from 123.232.43.68 port 42383 ssh2
2001AUTH 'sshd'[1490]: Received disconnect from 123.232.43.68: 11: Bye Bye
2002AUTH 'sshd'[1491]: Invalid user favorito5 from 123.232.43.68
2003AUTH 'sshd'[1492]: input_userauth_request: invalid user favorito5
2004AUTH 'sshd'[1491]: error: Could not get shadow information for NOUSER
2005AUTH 'sshd'[1491]: Failed password for invalid user favorito5 from 123.232.43.68 port 43180 ssh2
2006AUTH 'sshd'[1492]: Received disconnect from 123.232.43.68: 11: Bye Bye
2007AUTH 'sshd'[1493]: Invalid user favorito6 from 123.232.43.68
2008AUTH 'sshd'[1494]: input_userauth_request: invalid user favorito6
2009AUTH 'sshd'[1493]: error: Could not get shadow information for NOUSER
2010AUTH 'sshd'[1493]: Failed password for invalid user favorito6 from 123.232.43.68 port 43461 ssh2
2011AUTH 'sshd'[1494]: Received disconnect from 123.232.43.68: 11: Bye Bye
2012AUTH 'sshd'[1495]: Invalid user favoriti7 from 123.232.43.68
2013AUTH 'sshd'[1496]: input_userauth_request: invalid user favoriti7
2014AUTH 'sshd'[1495]: error: Could not get shadow information for NOUSER
2015AUTH 'sshd'[1495]: Failed password for invalid user favoriti7 from 123.232.43.68 port 43844 ssh2
2016AUTH 'sshd'[1496]: Received disconnect from 123.232.43.68: 11: Bye Bye
2017AUTH 'sshd'[1497]: Invalid user favorito8 from 123.232.43.68
2018AUTH 'sshd'[1498]: input_userauth_request: invalid user favorito8
2019AUTH 'sshd'[1497]: error: Could not get shadow information for NOUSER
2020AUTH 'sshd'[1497]: Failed password for invalid user favorito8 from 123.232.43.68 port 44567 ssh2
2021AUTH 'sshd'[1498]: Received disconnect from 123.232.43.68: 11: Bye Bye
2022AUTH 'sshd'[1499]: Invalid user favorito9 from 123.232.43.68
2023AUTH 'sshd'[1500]: input_userauth_request: invalid user favorito9
2024AUTH 'sshd'[1499]: error: Could not get shadow information for NOUSER
2025AUTH 'sshd'[1499]: Failed password for invalid user favorito9 from 123.232.43.68 port 44980 ssh2
2026AUTH 'sshd'[1500]: Received disconnect from 123.232.43.68: 11: Bye Bye
2027AUTH 'sshd'[1501]: Invalid user favorito10 from 123.232.43.68
2028AUTH 'sshd'[1502]: input_userauth_request: invalid user favorito10
2029AUTH 'sshd'[1501]: error: Could not get shadow information for NOUSER
2030AUTH 'sshd'[1501]: Failed password for invalid user favorito10 from 123.232.43.68 port 45633 ssh2
2031AUTH 'sshd'[1502]: Received disconnect from 123.232.43.68: 11: Bye Bye
2032AUTH 'sshd'[1503]: Invalid user site from 123.232.43.68
2033AUTH 'sshd'[1504]: input_userauth_request: invalid user site
2034AUTH 'sshd'[1503]: error: Could not get shadow information for NOUSER
2035AUTH 'sshd'[1503]: Failed password for invalid user site from 123.232.43.68 port 46089 ssh2
2036AUTH 'sshd'[1504]: Received disconnect from 123.232.43.68: 11: Bye Bye
2037AUTH 'sshd'[1505]: Invalid user site1 from 123.232.43.68
2038AUTH 'sshd'[1506]: input_userauth_request: invalid user site1
2039AUTH 'sshd'[1505]: error: Could not get shadow information for NOUSER
2040AUTH 'sshd'[1505]: Failed password for invalid user site1 from 123.232.43.68 port 46724 ssh2
2041AUTH 'sshd'[1506]: Received disconnect from 123.232.43.68: 11: Bye Bye
2042AUTH 'sshd'[1507]: Invalid user site2 from 123.232.43.68
2043AUTH 'sshd'[1508]: input_userauth_request: invalid user site2
2044AUTH 'sshd'[1507]: error: Could not get shadow information for NOUSER
2045AUTH 'sshd'[1507]: Failed password for invalid user site2 from 123.232.43.68 port 47173 ssh2
2046AUTH 'sshd'[1508]: Received disconnect from 123.232.43.68: 11: Bye Bye
2047AUTH 'sshd'[1509]: Invalid user site3 from 123.232.43.68
2048AUTH 'sshd'[1510]: input_userauth_request: invalid user site3
2049AUTH 'sshd'[1509]: error: Could not get shadow information for NOUSER
2050AUTH 'sshd'[1509]: Failed password for invalid user site3 from 123.232.43.68 port 47847 ssh2
2051AUTH 'sshd'[1510]: Received disconnect from 123.232.43.68: 11: Bye Bye
2052AUTH 'sshd'[1511]: Invalid user site4 from 123.232.43.68
2053AUTH 'sshd'[1512]: input_userauth_request: invalid user site4
2054AUTH 'sshd'[1511]: error: Could not get shadow information for NOUSER
2055AUTH 'sshd'[1511]: Failed password for invalid user site4 from 123.232.43.68 port 48283 ssh2
2056AUTH 'sshd'[1512]: Received disconnect from 123.232.43.68: 11: Bye Bye
2057AUTH 'sshd'[1514]: Invalid user site5 from 123.232.43.68
2058AUTH 'sshd'[1515]: input_userauth_request: invalid user site5
2059AUTH 'sshd'[1514]: error: Could not get shadow information for NOUSER
2060AUTH 'sshd'[1514]: Failed password for invalid user site5 from 123.232.43.68 port 48949 ssh2
2061AUTH 'sshd'[1515]: Received disconnect from 123.232.43.68: 11: Bye Bye
2062AUTH 'sshd'[1517]: Invalid user site6 from 123.232.43.68
2063AUTH 'sshd'[1518]: input_userauth_request: invalid user site6
2064AUTH 'sshd'[1517]: error: Could not get shadow information for NOUSER
2065AUTH 'sshd'[1517]: Failed password for invalid user site6 from 123.232.43.68 port 49386 ssh2
2066AUTH 'sshd'[1518]: Received disconnect from 123.232.43.68: 11: Bye Bye
2067AUTH 'sshd'[1519]: Invalid user site7 from 123.232.43.68
2068AUTH 'sshd'[1520]: input_userauth_request: invalid user site7
2069AUTH 'sshd'[1519]: error: Could not get shadow information for NOUSER
2070AUTH 'sshd'[1519]: Failed password for invalid user site7 from 123.232.43.68 port 50022 ssh2
2071AUTH 'sshd'[1520]: Received disconnect from 123.232.43.68: 11: Bye Bye
2072AUTH 'sshd'[1529]: Invalid user site8 from 123.232.43.68
2073AUTH 'sshd'[1530]: input_userauth_request: invalid user site8
2074AUTH 'sshd'[1529]: error: Could not get shadow information for NOUSER
2075AUTH 'sshd'[1529]: Failed password for invalid user site8 from 123.232.43.68 port 50470 ssh2
2076AUTH 'sshd'[1530]: Received disconnect from 123.232.43.68: 11: Bye Bye
2077AUTH 'sshd'[1531]: Invalid user site9 from 123.232.43.68
2078AUTH 'sshd'[1532]: input_userauth_request: invalid user site9
2079AUTH 'sshd'[1531]: error: Could not get shadow information for NOUSER
2080AUTH 'sshd'[1531]: Failed password for invalid user site9 from 123.232.43.68 port 51044 ssh2
2081AUTH 'sshd'[1532]: Received disconnect from 123.232.43.68: 11: Bye Bye
2082AUTH 'sshd'[1539]: Invalid user site10 from 123.232.43.68
2083AUTH 'sshd'[1540]: input_userauth_request: invalid user site10
2084AUTH 'sshd'[1539]: error: Could not get shadow information for NOUSER
2085AUTH 'sshd'[1539]: Failed password for invalid user site10 from 123.232.43.68 port 51524 ssh2
2086AUTH 'sshd'[1540]: Received disconnect from 123.232.43.68: 11: Bye Bye
2087AUTH 'sshd'[1571]: Invalid user sites from 123.232.43.68
2088AUTH 'sshd'[1572]: input_userauth_request: invalid user sites
2089AUTH 'sshd'[1571]: error: Could not get shadow information for NOUSER
2090AUTH 'sshd'[1571]: Failed password for invalid user sites from 123.232.43.68 port 52090 ssh2
2091AUTH 'sshd'[1572]: Received disconnect from 123.232.43.68: 11: Bye Bye
2092AUTH 'sshd'[1591]: Invalid user sites1 from 123.232.43.68
2093AUTH 'sshd'[1592]: input_userauth_request: invalid user sites1
2094AUTH 'sshd'[1591]: error: Could not get shadow information for NOUSER
2095AUTH 'sshd'[1591]: Failed password for invalid user sites1 from 123.232.43.68 port 52567 ssh2
2096AUTH 'sshd'[1592]: Received disconnect from 123.232.43.68: 11: Bye Bye
2097AUTH 'sshd'[1603]: Invalid user sites2 from 123.232.43.68
2098AUTH 'sshd'[1604]: input_userauth_request: invalid user sites2
2099AUTH 'sshd'[1603]: error: Could not get shadow information for NOUSER
2100AUTH 'sshd'[1603]: Failed password for invalid user sites2 from 123.232.43.68 port 53213 ssh2
2101AUTH 'sshd'[1604]: Received disconnect from 123.232.43.68: 11: Bye Bye
2102AUTH 'sshd'[1605]: Invalid user sites3 from 123.232.43.68
2103AUTH 'sshd'[1608]: input_userauth_request: invalid user sites3
2104AUTH 'sshd'[1605]: error: Could not get shadow information for NOUSER
2105AUTH 'sshd'[1605]: Failed password for invalid user sites3 from 123.232.43.68 port 53713 ssh2
2106AUTH 'sshd'[1608]: Received disconnect from 123.232.43.68: 11: Bye Bye
2107AUTH 'sshd'[1609]: Invalid user sites4 from 123.232.43.68
2108AUTH 'sshd'[1610]: input_userauth_request: invalid user sites4
2109AUTH 'sshd'[1609]: error: Could not get shadow information for NOUSER
2110AUTH 'sshd'[1609]: Failed password for invalid user sites4 from 123.232.43.68 port 54575 ssh2
2111AUTH 'sshd'[1610]: Received disconnect from 123.232.43.68: 11: Bye Bye
2112AUTH 'sshd'[1611]: Invalid user sites5 from 123.232.43.68
2113AUTH 'sshd'[1612]: input_userauth_request: invalid user sites5
2114AUTH 'sshd'[1611]: error: Could not get shadow information for NOUSER
2115AUTH 'sshd'[1611]: Failed password for invalid user sites5 from 123.232.43.68 port 54969 ssh2
2116AUTH 'sshd'[1612]: Received disconnect from 123.232.43.68: 11: Bye Bye
2117AUTH 'sshd'[1614]: Invalid user sites6 from 123.232.43.68
2118AUTH 'sshd'[1615]: input_userauth_request: invalid user sites6
2119AUTH 'sshd'[1614]: error: Could not get shadow information for NOUSER
2120AUTH 'sshd'[1614]: Failed password for invalid user sites6 from 123.232.43.68 port 55647 ssh2
2121AUTH 'sshd'[1615]: Received disconnect from 123.232.43.68: 11: Bye Bye
2122AUTH 'sshd'[1616]: Invalid user sites7 from 123.232.43.68
2123AUTH 'sshd'[1617]: input_userauth_request: invalid user sites7
2124AUTH 'sshd'[1616]: error: Could not get shadow information for NOUSER
2125AUTH 'sshd'[1616]: Failed password for invalid user sites7 from 123.232.43.68 port 56059 ssh2
2126AUTH 'sshd'[1617]: Received disconnect from 123.232.43.68: 11: Bye Bye
2127AUTH 'sshd'[1618]: Invalid user sites8 from 123.232.43.68
2128AUTH 'sshd'[1619]: input_userauth_request: invalid user sites8
2129AUTH 'sshd'[1618]: error: Could not get shadow information for NOUSER
2130AUTH 'sshd'[1618]: Failed password for invalid user sites8 from 123.232.43.68 port 56793 ssh2
2131AUTH 'sshd'[1619]: Received disconnect from 123.232.43.68: 11: Bye Bye
2132AUTH 'sshd'[1620]: Invalid user sites9 from 123.232.43.68
2133AUTH 'sshd'[1621]: input_userauth_request: invalid user sites9
2134AUTH 'sshd'[1620]: error: Could not get shadow information for NOUSER
2135AUTH 'sshd'[1620]: Failed password for invalid user sites9 from 123.232.43.68 port 57209 ssh2
2136AUTH 'sshd'[1621]: Received disconnect from 123.232.43.68: 11: Bye Bye
2137AUTH 'sshd'[1622]: Invalid user sites10 from 123.232.43.68
2138AUTH 'sshd'[1625]: input_userauth_request: invalid user sites10
2139AUTH 'sshd'[1622]: error: Could not get shadow information for NOUSER
2140AUTH 'sshd'[1622]: Failed password for invalid user sites10 from 123.232.43.68 port 57896 ssh2
2141AUTH 'sshd'[1625]: Received disconnect from 123.232.43.68: 11: Bye Bye
2142AUTH 'sshd'[1650]: Invalid user website1 from 123.232.43.68
2143AUTH 'sshd'[1651]: input_userauth_request: invalid user website1
2144AUTH 'sshd'[1650]: error: Could not get shadow information for NOUSER
2145AUTH 'sshd'[1650]: Failed password for invalid user website1 from 123.232.43.68 port 58328 ssh2
2146AUTH 'sshd'[1651]: Received disconnect from 123.232.43.68: 11: Bye Bye
2147AUTH 'sshd'[1654]: Invalid user website2 from 123.232.43.68
2148AUTH 'sshd'[1655]: input_userauth_request: invalid user website2
2149AUTH 'sshd'[1654]: error: Could not get shadow information for NOUSER
2150AUTH 'sshd'[1654]: Failed password for invalid user website2 from 123.232.43.68 port 58968 ssh2
2151AUTH 'sshd'[1655]: Received disconnect from 123.232.43.68: 11: Bye Bye
2152AUTH 'sshd'[1686]: Invalid user website3 from 123.232.43.68
2153AUTH 'sshd'[1693]: input_userauth_request: invalid user website3
2154AUTH 'sshd'[1686]: error: Could not get shadow information for NOUSER
2155AUTH 'sshd'[1686]: Failed password for invalid user website3 from 123.232.43.68 port 59401 ssh2
2156AUTH 'sshd'[1693]: Received disconnect from 123.232.43.68: 11: Bye Bye
2157AUTH 'sshd'[1694]: Invalid user website4 from 123.232.43.68
2158AUTH 'sshd'[1699]: input_userauth_request: invalid user website4
2159AUTH 'sshd'[1694]: error: Could not get shadow information for NOUSER
2160AUTH 'sshd'[1694]: Failed password for invalid user website4 from 123.232.43.68 port 60050 ssh2
2161AUTH 'sshd'[1699]: Received disconnect from 123.232.43.68: 11: Bye Bye
2162AUTH 'sshd'[1702]: Invalid user website5 from 123.232.43.68
2163AUTH 'sshd'[1703]: input_userauth_request: invalid user website5
2164AUTH 'sshd'[1702]: error: Could not get shadow information for NOUSER
2165AUTH 'sshd'[1702]: Failed password for invalid user website5 from 123.232.43.68 port 60493 ssh2
2166AUTH 'sshd'[1703]: Received disconnect from 123.232.43.68: 11: Bye Bye
2167AUTH 'sshd'[1704]: Invalid user website6 from 123.232.43.68
2168AUTH 'sshd'[1705]: input_userauth_request: invalid user website6
2169AUTH 'sshd'[1704]: error: Could not get shadow information for NOUSER
2170AUTH 'sshd'[1704]: Failed password for invalid user website6 from 123.232.43.68 port 32906 ssh2
2171AUTH 'sshd'[1705]: Received disconnect from 123.232.43.68: 11: Bye Bye
2172AUTH 'sshd'[1722]: Invalid user website7 from 123.232.43.68
2173AUTH 'sshd'[1725]: input_userauth_request: invalid user website7
2174AUTH 'sshd'[1722]: error: Could not get shadow information for NOUSER
2175AUTH 'sshd'[1722]: Failed password for invalid user website7 from 123.232.43.68 port 33358 ssh2
2176AUTH 'sshd'[1725]: Received disconnect from 123.232.43.68: 11: Bye Bye
2177AUTH 'sshd'[1742]: Invalid user website8 from 123.232.43.68
2178AUTH 'sshd'[1743]: input_userauth_request: invalid user website8
2179AUTH 'sshd'[1742]: error: Could not get shadow information for NOUSER
2180AUTH 'sshd'[1742]: Failed password for invalid user website8 from 123.232.43.68 port 34023 ssh2
2181AUTH 'sshd'[1743]: Received disconnect from 123.232.43.68: 11: Bye Bye
2182AUTH 'sshd'[1745]: Invalid user website9 from 123.232.43.68
2183AUTH 'sshd'[1747]: input_userauth_request: invalid user website9
2184AUTH 'sshd'[1745]: error: Could not get shadow information for NOUSER
2185AUTH 'sshd'[1745]: Failed password for invalid user website9 from 123.232.43.68 port 34437 ssh2
2186AUTH 'sshd'[1747]: Received disconnect from 123.232.43.68: 11: Bye Bye
2187AUTH 'sshd'[1766]: Invalid user website10 from 123.232.43.68
2188AUTH 'sshd'[1767]: input_userauth_request: invalid user website10
2189AUTH 'sshd'[1766]: error: Could not get shadow information for NOUSER
2190AUTH 'sshd'[1766]: Failed password for invalid user website10 from 123.232.43.68 port 35120 ssh2
2191AUTH 'sshd'[1767]: Received disconnect from 123.232.43.68: 11: Bye Bye
2192AUTH 'sshd'[1770]: Invalid user websites1 from 123.232.43.68
2193AUTH 'sshd'[1771]: input_userauth_request: invalid user websites1
2194AUTH 'sshd'[1770]: error: Could not get shadow information for NOUSER
2195AUTH 'sshd'[1770]: Failed password for invalid user websites1 from 123.232.43.68 port 35554 ssh2
2196AUTH 'sshd'[1771]: Received disconnect from 123.232.43.68: 11: Bye Bye
2197AUTH 'sshd'[1788]: Invalid user websites2 from 123.232.43.68
2198AUTH 'sshd'[1807]: input_userauth_request: invalid user websites2
2199AUTH 'sshd'[1788]: error: Could not get shadow information for NOUSER
2200AUTH 'sshd'[1788]: Failed password for invalid user websites2 from 123.232.43.68 port 36196 ssh2
2201AUTH 'sshd'[1807]: Received disconnect from 123.232.43.68: 11: Bye Bye
2202AUTH 'sshd'[1808]: Invalid user websites3 from 123.232.43.68
2203AUTH 'sshd'[1825]: input_userauth_request: invalid user websites3
2204AUTH 'sshd'[1808]: error: Could not get shadow information for NOUSER
2205AUTH 'sshd'[1808]: Failed password for invalid user websites3 from 123.232.43.68 port 37064 ssh2
2206AUTH 'sshd'[1825]: Received disconnect from 123.232.43.68: 11: Bye Bye
2207AUTH 'sshd'[1830]: Invalid user websites4 from 123.232.43.68
2208AUTH 'sshd'[1831]: input_userauth_request: invalid user websites4
2209AUTH 'sshd'[1830]: error: Could not get shadow information for NOUSER
2210AUTH 'sshd'[1830]: Failed password for invalid user websites4 from 123.232.43.68 port 37606 ssh2
2211AUTH 'sshd'[1831]: Received disconnect from 123.232.43.68: 11: Bye Bye
2212AUTH 'sshd'[1832]: Invalid user websites5 from 123.232.43.68
2213AUTH 'sshd'[1833]: input_userauth_request: invalid user websites5
2214AUTH 'sshd'[1832]: error: Could not get shadow information for NOUSER
2215AUTH 'sshd'[1832]: Failed password for invalid user websites5 from 123.232.43.68 port 38197 ssh2
2216AUTH 'sshd'[1833]: Received disconnect from 123.232.43.68: 11: Bye Bye
2217AUTH 'sshd'[1834]: Invalid user websites6 from 123.232.43.68
2218AUTH 'sshd'[1835]: input_userauth_request: invalid user websites6
2219AUTH 'sshd'[1834]: error: Could not get shadow information for NOUSER
2220AUTH 'sshd'[1834]: Failed password for invalid user websites6 from 123.232.43.68 port 38529 ssh2
2221AUTH 'sshd'[1835]: Received disconnect from 123.232.43.68: 11: Bye Bye
2222AUTH 'sshd'[1836]: Invalid user websites7 from 123.232.43.68
2223AUTH 'sshd'[1837]: input_userauth_request: invalid user websites7
2224AUTH 'sshd'[1836]: error: Could not get shadow information for NOUSER
2225AUTH 'sshd'[1836]: Failed password for invalid user websites7 from 123.232.43.68 port 39253 ssh2
2226AUTH 'sshd'[1837]: Received disconnect from 123.232.43.68: 11: Bye Bye
2227AUTH 'sshd'[1840]: Invalid user websites8 from 123.232.43.68
2228AUTH 'sshd'[1841]: input_userauth_request: invalid user websites8
2229AUTH 'sshd'[1840]: error: Could not get shadow information for NOUSER
2230AUTH 'sshd'[1840]: Failed password for invalid user websites8 from 123.232.43.68 port 39827 ssh2
2231AUTH 'sshd'[1841]: Received disconnect from 123.232.43.68: 11: Bye Bye
2232AUTH 'sshd'[1842]: Invalid user websites9 from 123.232.43.68
2233AUTH 'sshd'[1843]: input_userauth_request: invalid user websites9
2234AUTH 'sshd'[1842]: error: Could not get shadow information for NOUSER
2235AUTH 'sshd'[1842]: Failed password for invalid user websites9 from 123.232.43.68 port 40410 ssh2
2236AUTH 'sshd'[1843]: Received disconnect from 123.232.43.68: 11: Bye Bye
2237AUTH 'sshd'[1846]: Invalid user websites10 from 123.232.43.68
2238AUTH 'sshd'[1847]: input_userauth_request: invalid user websites10
2239AUTH 'sshd'[1846]: error: Could not get shadow information for NOUSER
2240AUTH 'sshd'[1846]: Failed password for invalid user websites10 from 123.232.43.68 port 40935 ssh2
2241AUTH 'sshd'[1847]: Received disconnect from 123.232.43.68: 11: Bye Bye
2242AUTH 'sshd'[1848]: Invalid user guest from 123.232.43.68
2243AUTH 'sshd'[1849]: input_userauth_request: invalid user guest
2244AUTH 'sshd'[1848]: error: Could not get shadow information for NOUSER
2245AUTH 'sshd'[1848]: Failed password for invalid user guest from 123.232.43.68 port 41523 ssh2
2246AUTH 'sshd'[1849]: Received disconnect from 123.232.43.68: 11: Bye Bye
2247AUTH 'sshd'[1850]: Invalid user guest1 from 123.232.43.68
2248AUTH 'sshd'[1851]: input_userauth_request: invalid user guest1
2249AUTH 'sshd'[1850]: error: Could not get shadow information for NOUSER
2250AUTH 'sshd'[1850]: Failed password for invalid user guest1 from 123.232.43.68 port 41876 ssh2
2251AUTH 'sshd'[1851]: Received disconnect from 123.232.43.68: 11: Bye Bye
2252AUTH 'sshd'[1852]: Invalid user guest2 from 123.232.43.68
2253AUTH 'sshd'[1853]: input_userauth_request: invalid user guest2
2254AUTH 'sshd'[1852]: error: Could not get shadow information for NOUSER
2255AUTH 'sshd'[1852]: Failed password for invalid user guest2 from 123.232.43.68 port 42587 ssh2
2256AUTH 'sshd'[1853]: Received disconnect from 123.232.43.68: 11: Bye Bye
2257AUTH 'sshd'[1854]: Invalid user guest3 from 123.232.43.68
2258AUTH 'sshd'[1855]: input_userauth_request: invalid user guest3
2259AUTH 'sshd'[1854]: error: Could not get shadow information for NOUSER
2260AUTH 'sshd'[1854]: Failed password for invalid user guest3 from 123.232.43.68 port 42962 ssh2
2261AUTH 'sshd'[1855]: Received disconnect from 123.232.43.68: 11: Bye Bye
2262AUTH 'sshd'[1856]: Invalid user guest4 from 123.232.43.68
2263AUTH 'sshd'[1857]: input_userauth_request: invalid user guest4
2264AUTH 'sshd'[1856]: error: Could not get shadow information for NOUSER
2265AUTH 'sshd'[1856]: Failed password for invalid user guest4 from 123.232.43.68 port 43681 ssh2
2266AUTH 'sshd'[1857]: Received disconnect from 123.232.43.68: 11: Bye Bye
2267AUTH 'sshd'[1858]: Invalid user guest5 from 123.232.43.68
2268AUTH 'sshd'[1859]: input_userauth_request: invalid user guest5
2269AUTH 'sshd'[1858]: error: Could not get shadow information for NOUSER
2270AUTH 'sshd'[1858]: Failed password for invalid user guest5 from 123.232.43.68 port 44086 ssh2
2271AUTH 'sshd'[1859]: Received disconnect from 123.232.43.68: 11: Bye Bye
2272AUTH 'sshd'[1860]: Invalid user guest6 from 123.232.43.68
2273AUTH 'sshd'[1861]: input_userauth_request: invalid user guest6
2274AUTH 'sshd'[1860]: error: Could not get shadow information for NOUSER
2275AUTH 'sshd'[1860]: Failed password for invalid user guest6 from 123.232.43.68 port 44808 ssh2
2276AUTH 'sshd'[1861]: Received disconnect from 123.232.43.68: 11: Bye Bye
2277AUTH 'sshd'[1862]: Invalid user guest7 from 123.232.43.68
2278AUTH 'sshd'[1863]: input_userauth_request: invalid user guest7
2279AUTH 'sshd'[1862]: error: Could not get shadow information for NOUSER
2280AUTH 'sshd'[1862]: Failed password for invalid user guest7 from 123.232.43.68 port 45195 ssh2
2281AUTH 'sshd'[1863]: Received disconnect from 123.232.43.68: 11: Bye Bye
2282AUTH 'sshd'[1864]: Invalid user guest8 from 123.232.43.68
2283AUTH 'sshd'[1865]: input_userauth_request: invalid user guest8
2284AUTH 'sshd'[1864]: error: Could not get shadow information for NOUSER
2285AUTH 'sshd'[1864]: Failed password for invalid user guest8 from 123.232.43.68 port 45787 ssh2
2286AUTH 'sshd'[1865]: Received disconnect from 123.232.43.68: 11: Bye Bye
2287AUTH 'sshd'[1866]: Invalid user guest9 from 123.232.43.68
2288AUTH 'sshd'[1867]: input_userauth_request: invalid user guest9
2289AUTH 'sshd'[1866]: error: Could not get shadow information for NOUSER
2290AUTH 'sshd'[1866]: Failed password for invalid user guest9 from 123.232.43.68 port 46285 ssh2
2291AUTH 'sshd'[1867]: Received disconnect from 123.232.43.68: 11: Bye Bye
2292AUTH 'sshd'[1868]: Invalid user guest10 from 123.232.43.68
2293AUTH 'sshd'[1869]: input_userauth_request: invalid user guest10
2294AUTH 'sshd'[1868]: error: Could not get shadow information for NOUSER
2295AUTH 'sshd'[1868]: Failed password for invalid user guest10 from 123.232.43.68 port 46703 ssh2
2296AUTH 'sshd'[1869]: Received disconnect from 123.232.43.68: 11: Bye Bye
2297AUTH 'sshd'[1872]: Invalid user user from 123.232.43.68
2298AUTH 'sshd'[1873]: input_userauth_request: invalid user user
2299AUTH 'sshd'[1872]: error: Could not get shadow information for NOUSER
2300AUTH 'sshd'[1872]: Failed password for invalid user user from 123.232.43.68 port 47353 ssh2
2301AUTH 'sshd'[1873]: Received disconnect from 123.232.43.68: 11: Bye Bye
2302AUTH 'sshd'[1874]: Invalid user user1 from 123.232.43.68
2303AUTH 'sshd'[1875]: input_userauth_request: invalid user user1
2304AUTH 'sshd'[1874]: error: Could not get shadow information for NOUSER
2305AUTH 'sshd'[1874]: Failed password for invalid user user1 from 123.232.43.68 port 47780 ssh2
2306AUTH 'sshd'[1875]: Received disconnect from 123.232.43.68: 11: Bye Bye
2307AUTH 'sshd'[1878]: Invalid user user2 from 123.232.43.68
2308AUTH 'sshd'[1879]: input_userauth_request: invalid user user2
2309AUTH 'sshd'[1878]: error: Could not get shadow information for NOUSER
2310AUTH 'sshd'[1878]: Failed password for invalid user user2 from 123.232.43.68 port 48386 ssh2
2311AUTH 'sshd'[1879]: Received disconnect from 123.232.43.68: 11: Bye Bye
2312AUTH 'sshd'[1881]: Invalid user user3 from 123.232.43.68
2313AUTH 'sshd'[1884]: input_userauth_request: invalid user user3
2314AUTH 'sshd'[1881]: error: Could not get shadow information for NOUSER
2315AUTH 'sshd'[1881]: Failed password for invalid user user3 from 123.232.43.68 port 48850 ssh2
2316AUTH 'sshd'[1884]: Received disconnect from 123.232.43.68: 11: Bye Bye
2317AUTH 'sshd'[1885]: Invalid user user4 from 123.232.43.68
2318AUTH 'sshd'[1886]: input_userauth_request: invalid user user4
2319AUTH 'sshd'[1885]: error: Could not get shadow information for NOUSER
2320AUTH 'sshd'[1885]: Failed password for invalid user user4 from 123.232.43.68 port 49653 ssh2
2321AUTH 'sshd'[1886]: Received disconnect from 123.232.43.68: 11: Bye Bye
2322AUTH 'sshd'[1887]: Did not receive identification string from 123.232.43.68
2323KERN: /dev/net/3com/0: media change, media 0x22 quality 1000 speed 10000
2324KERN: /dev/net/3com/0: media change, media 0x900026 quality 1000 speed 10000
2325DAEMON 'DHCP': DHCP timeout shift: 4 secs (try 0)
2326DAEMON 'DHCP': DHCP timeout shift: 8 secs (try 0)
2327DAEMON 'DHCP': DHCP timeout shift: 2 secs (try 1)
2328DAEMON 'DHCP': DHCP timeout shift: 4 secs (try 1)
2329DAEMON 'DHCP': lease time of 172800 seconds
2330DAEMON 'DHCP': DNS: 192.168.11.1
2331DAEMON 'DHCP': DHCP timeout shift: 4 secs (try 0)
2332DAEMON 'DHCP': DHCP timeout shift: 8 secs (try 0)
2333DAEMON 'DHCP': DHCP timeout shift: 2 secs (try 1)
2334DAEMON 'DHCP': lease time of 172800 seconds
2335DAEMON 'DHCP': DNS: 192.168.11.1
2336DAEMON 'DHCP': DHCP for /dev/net/3com/0, status: No error
2337KERN: heap_add_area: area 55387 added to medium heap 0x819a2000 - usable range 0xed801000 - 0xedc00000
2338KERN: bfs: bfs_read_link:1476: Invalid Argument
2339Last message repeated 1 time
2340KERN: Last message repeated 2 times.
2341Last message repeated 3 times
2342KERN: libnetwork.so running in R5 compatibility mode.
2343KERN: Radeon - ALLOCATE_OVERLAY_BUFFER: success: mem_handle=4, offset=763400, CPU-address=88763400, phys-address=d8763400
2344KERN: Radeon - Radeon_InitOverlay:
2345KERN: Radeon - Radeon_SetTransform:
2346KERN: Radeon - Radeon_ShowOverlay:
2347KERN: Radeon - ALLOCATE_OVERLAY_BUFFER: success: mem_handle=5, offset=78c800, CPU-address=8878c800, phys-address=d878c800
2348KERN: Radeon - ALLOCATE_OVERLAY_BUFFER: success: mem_handle=6, offset=7b5c00, CPU-address=887b5c00, phys-address=d87b5c00
2349KERN: Radeon - Radeon_ShowOverlay:
2350KERN: Last message repeated 16 times.
2351KERN: Last message repeated 17 times.
2352KERN: libnetwork.so running in R5 compatibility mode.
2353KERN: Radeon - ALLOCATE_OVERLAY_BUFFER: success: mem_handle=4, offset=763400, CPU-address=88763400, phys-address=d8763400
2354KERN: Radeon - Radeon_InitOverlay:
2355KERN: Radeon - Radeon_SetTransform:
2356KERN: Radeon - Radeon_ShowOverlay:
2357KERN: Radeon - ALLOCATE_OVERLAY_BUFFER: success: mem_handle=5, offset=78c800, CPU-address=8878c800, phys-address=d878c800
2358KERN: Radeon - ALLOCATE_OVERLAY_BUFFER: success: mem_handle=7, offset=7b5c00, CPU-address=887b5c00, phys-address=d87b5c00
2359KERN: Radeon - Radeon_ShowOverlay:
2360KERN: Last message repeated 2 times.
2361KERN: Last message repeated 37 times.
2362KERN: libnetwork.so running in R5 compatibility mode.
2363KERN: Radeon - ALLOCATE_OVERLAY_BUFFER: success: mem_handle=4, offset=763400, CPU-address=88763400, phys-address=d8763400
2364KERN: Radeon - Radeon_InitOverlay:
2365KERN: Radeon - Radeon_SetTransform:
2366KERN: Radeon - Radeon_ShowOverlay:
2367KERN: Radeon - ALLOCATE_OVERLAY_BUFFER: success: mem_handle=6, offset=788c00, CPU-address=88788c00, phys-address=d8788c00
2368KERN: Radeon - ALLOCATE_OVERLAY_BUFFER: success: mem_handle=7, offset=7ae400, CPU-address=887ae400, phys-address=d87ae400
2369KERN: Radeon - Radeon_ShowOverlay:
2370KERN: Last message repeated 20 times.
2371KERN: libnetwork.so running in R5 compatibility mode.
2372KERN: Radeon - ALLOCATE_OVERLAY_BUFFER: success: mem_handle=4, offset=763400, CPU-address=88763400, phys-address=d8763400
2373KERN: Radeon - Radeon_InitOverlay:
2374KERN: Radeon - Radeon_SetTransform:
2375KERN: Radeon - Radeon_ShowOverlay:
2376KERN: Radeon - ALLOCATE_OVERLAY_BUFFER: success: mem_handle=6, offset=7b9800, CPU-address=887b9800, phys-address=d87b9800
2377KERN: Radeon - ALLOCATE_OVERLAY_BUFFER: success: mem_handle=5, offset=80fc00, CPU-address=8880fc00, phys-address=d880fc00
2378KERN: Radeon - Radeon_ShowOverlay:
2379KERN: Last message repeated 21 times.
2380KERN: libnetwork.so running in R5 compatibility mode.
2381KERN: Radeon - ALLOCATE_OVERLAY_BUFFER: success: mem_handle=4, offset=763400, CPU-address=88763400, phys-address=d8763400
2382KERN: Radeon - Radeon_InitOverlay:
2383KERN: Radeon - Radeon_SetTransform:
2384KERN: Radeon - Radeon_ShowOverlay:
2385KERN: Radeon - ALLOCATE_OVERLAY_BUFFER: success: mem_handle=7, offset=7b9800, CPU-address=887b9800, phys-address=d87b9800
2386KERN: Radeon - ALLOCATE_OVERLAY_BUFFER: success: mem_handle=5, offset=80fc00, CPU-address=8880fc00, phys-address=d880fc00
2387KERN: Radeon - Radeon_ShowOverlay:
2388KERN: Last message repeated 22 times.
2389KERN: libnetwork.so running in R5 compatibility mode.
2390KERN: Radeon - ALLOCATE_OVERLAY_BUFFER: success: mem_handle=4, offset=763400, CPU-address=88763400, phys-address=d8763400
2391KERN: Radeon - Radeon_InitOverlay:
2392KERN: Radeon - Radeon_SetTransform:
2393KERN: Radeon - Radeon_ShowOverlay:
2394KERN: Radeon - ALLOCATE_OVERLAY_BUFFER: success: mem_handle=5, offset=7b9800, CPU-address=887b9800, phys-address=d87b9800
2395KERN: Radeon - ALLOCATE_OVERLAY_BUFFER: success: mem_handle=7, offset=80fc00, CPU-address=8880fc00, phys-address=d880fc00
2396KERN: Radeon - Radeon_ShowOverlay:
2397KERN: Last message repeated 2 times.
2398KERN: Last message repeated 17 times.
2399KERN: libnetwork.so running in R5 compatibility mode.
2400KERN: Radeon - ALLOCATE_OVERLAY_BUFFER: success: mem_handle=4, offset=763400, CPU-address=88763400, phys-address=d8763400
2401KERN: Radeon - Radeon_InitOverlay:
2402KERN: Radeon - Radeon_SetTransform:
2403KERN: Radeon - Radeon_ShowOverlay:
2404KERN: Radeon - ALLOCATE_OVERLAY_BUFFER: success: mem_handle=5, offset=7b5c00, CPU-address=887b5c00, phys-address=d87b5c00
2405KERN: Radeon - ALLOCATE_OVERLAY_BUFFER: success: mem_handle=6, offset=808400, CPU-address=88808400, phys-address=d8808400
2406KERN: Radeon - Radeon_ShowOverlay:
2407KERN: Last message repeated 2 times.
2408KERN: Last message repeated 20 times.
2409AUTH 'sshd'[16957]: Did not receive identification string from 193.171.155.138
2410KERN: bfs: bfs_read_link:1476: Invalid Argument
2411Last message repeated 1 time
2412KERN: Last message repeated 2 times.
2413Last message repeated 1 time
2414AUTH 'sshd'[19484]: Invalid user root from 222.35.92.40
2415AUTH 'sshd'[19485]: input_userauth_request: invalid user root
2416AUTH 'sshd'[19484]: Failed none for invalid user root from 222.35.92.40 port 33259 ssh2
2417AUTH 'sshd'[19484]: error: Could not get shadow information for NOUSER
2418AUTH 'sshd'[19484]: Failed password for invalid user root from 222.35.92.40 port 33259 ssh2
2419AUTH 'sshd'[19485]: Connection closed by 222.35.92.40
2420AUTH 'sshd'[19486]: Invalid user root from 222.35.92.40
2421AUTH 'sshd'[19487]: input_userauth_request: invalid user root
2422AUTH 'sshd'[19486]: Failed none for invalid user root from 222.35.92.40 port 33323 ssh2
2423AUTH 'sshd'[19486]: error: Could not get shadow information for NOUSER
2424AUTH 'sshd'[19486]: Failed password for invalid user root from 222.35.92.40 port 33323 ssh2
2425AUTH 'sshd'[19487]: Connection closed by 222.35.92.40
2426AUTH 'sshd'[19488]: Invalid user root from 222.35.92.40
2427AUTH 'sshd'[19489]: input_userauth_request: invalid user root
2428AUTH 'sshd'[19488]: Failed none for invalid user root from 222.35.92.40 port 33394 ssh2
2429AUTH 'sshd'[19488]: error: Could not get shadow information for NOUSER
2430AUTH 'sshd'[19488]: Failed password for invalid user root from 222.35.92.40 port 33394 ssh2
2431AUTH 'sshd'[19489]: Connection closed by 222.35.92.40
2432AUTH 'sshd'[19490]: Invalid user root from 222.35.92.40
2433AUTH 'sshd'[19491]: input_userauth_request: invalid user root
2434AUTH 'sshd'[19490]: Failed none for invalid user root from 222.35.92.40 port 33457 ssh2
2435AUTH 'sshd'[19490]: error: Could not get shadow information for NOUSER
2436AUTH 'sshd'[19490]: Failed password for invalid user root from 222.35.92.40 port 33457 ssh2
2437AUTH 'sshd'[19491]: Connection closed by 222.35.92.40
2438AUTH 'sshd'[19492]: Invalid user root from 222.35.92.40
2439AUTH 'sshd'[19493]: input_userauth_request: invalid user root
2440AUTH 'sshd'[19492]: Failed none for invalid user root from 222.35.92.40 port 33523 ssh2
2441AUTH 'sshd'[19492]: error: Could not get shadow information for NOUSER
2442AUTH 'sshd'[19492]: Failed password for invalid user root from 222.35.92.40 port 33523 ssh2
2443AUTH 'sshd'[19493]: Connection closed by 222.35.92.40
2444AUTH 'sshd'[19494]: Invalid user root from 222.35.92.40
2445AUTH 'sshd'[19495]: input_userauth_request: invalid user root
2446AUTH 'sshd'[19494]: Failed none for invalid user root from 222.35.92.40 port 33589 ssh2
2447AUTH 'sshd'[19494]: error: Could not get shadow information for NOUSER
2448AUTH 'sshd'[19494]: Failed password for invalid user root from 222.35.92.40 port 33589 ssh2
2449AUTH 'sshd'[19495]: Connection closed by 222.35.92.40
2450AUTH 'sshd'[19496]: Invalid user root from 222.35.92.40
2451AUTH 'sshd'[19497]: input_userauth_request: invalid user root
2452AUTH 'sshd'[19496]: Failed none for invalid user root from 222.35.92.40 port 33656 ssh2
2453AUTH 'sshd'[19496]: error: Could not get shadow information for NOUSER
2454AUTH 'sshd'[19496]: Failed password for invalid user root from 222.35.92.40 port 33656 ssh2
2455AUTH 'sshd'[19497]: Connection closed by 222.35.92.40
2456AUTH 'sshd'[19498]: Invalid user root from 222.35.92.40
2457AUTH 'sshd'[19499]: input_userauth_request: invalid user root
2458AUTH 'sshd'[19498]: Failed none for invalid user root from 222.35.92.40 port 33722 ssh2
2459AUTH 'sshd'[19498]: error: Could not get shadow information for NOUSER
2460AUTH 'sshd'[19498]: Failed password for invalid user root from 222.35.92.40 port 33722 ssh2
2461AUTH 'sshd'[19499]: Connection closed by 222.35.92.40
2462AUTH 'sshd'[19500]: Invalid user root from 222.35.92.40
2463AUTH 'sshd'[19501]: input_userauth_request: invalid user root
2464AUTH 'sshd'[19500]: Failed none for invalid user root from 222.35.92.40 port 33790 ssh2
2465AUTH 'sshd'[19500]: error: Could not get shadow information for NOUSER
2466AUTH 'sshd'[19500]: Failed password for invalid user root from 222.35.92.40 port 33790 ssh2
2467AUTH 'sshd'[19501]: Connection closed by 222.35.92.40
2468AUTH 'sshd'[19502]: Invalid user root from 222.35.92.40
2469AUTH 'sshd'[19503]: input_userauth_request: invalid user root
2470AUTH 'sshd'[19502]: Failed none for invalid user root from 222.35.92.40 port 33854 ssh2
2471AUTH 'sshd'[19502]: error: Could not get shadow information for NOUSER
2472AUTH 'sshd'[19502]: Failed password for invalid user root from 222.35.92.40 port 33854 ssh2
2473AUTH 'sshd'[19503]: Connection closed by 222.35.92.40
2474AUTH 'sshd'[19504]: Invalid user root from 222.35.92.40
2475AUTH 'sshd'[19505]: input_userauth_request: invalid user root
2476AUTH 'sshd'[19504]: Failed none for invalid user root from 222.35.92.40 port 33920 ssh2
2477AUTH 'sshd'[19504]: error: Could not get shadow information for NOUSER
2478AUTH 'sshd'[19504]: Failed password for invalid user root from 222.35.92.40 port 33920 ssh2
2479AUTH 'sshd'[19505]: Connection closed by 222.35.92.40
2480AUTH 'sshd'[19506]: Invalid user root from 222.35.92.40
2481AUTH 'sshd'[19507]: input_userauth_request: invalid user root
2482AUTH 'sshd'[19506]: Failed none for invalid user root from 222.35.92.40 port 56268 ssh2
2483AUTH 'sshd'[19506]: error: Could not get shadow information for NOUSER
2484AUTH 'sshd'[19506]: Failed password for invalid user root from 222.35.92.40 port 56268 ssh2
2485AUTH 'sshd'[19507]: Connection closed by 222.35.92.40
2486AUTH 'sshd'[19508]: Invalid user root from 222.35.92.40
2487AUTH 'sshd'[19509]: input_userauth_request: invalid user root
2488AUTH 'sshd'[19508]: Failed none for invalid user root from 222.35.92.40 port 56332 ssh2
2489AUTH 'sshd'[19508]: error: Could not get shadow information for NOUSER
2490AUTH 'sshd'[19508]: Failed password for invalid user root from 222.35.92.40 port 56332 ssh2
2491AUTH 'sshd'[19509]: Connection closed by 222.35.92.40
2492AUTH 'sshd'[19510]: Invalid user root from 222.35.92.40
2493AUTH 'sshd'[19511]: input_userauth_request: invalid user root
2494AUTH 'sshd'[19510]: Failed none for invalid user root from 222.35.92.40 port 56398 ssh2
2495AUTH 'sshd'[19510]: error: Could not get shadow information for NOUSER
2496AUTH 'sshd'[19510]: Failed password for invalid user root from 222.35.92.40 port 56398 ssh2
2497AUTH 'sshd'[19511]: Connection closed by 222.35.92.40
2498AUTH 'sshd'[19512]: Invalid user root from 222.35.92.40
2499AUTH 'sshd'[19513]: input_userauth_request: invalid user root
2500AUTH 'sshd'[19512]: Failed none for invalid user root from 222.35.92.40 port 56458 ssh2
2501AUTH 'sshd'[19512]: error: Could not get shadow information for NOUSER
2502AUTH 'sshd'[19512]: Failed password for invalid user root from 222.35.92.40 port 56458 ssh2
2503AUTH 'sshd'[19513]: Connection closed by 222.35.92.40
2504AUTH 'sshd'[19514]: Invalid user root from 222.35.92.40
2505AUTH 'sshd'[19515]: input_userauth_request: invalid user root
2506AUTH 'sshd'[19514]: Failed none for invalid user root from 222.35.92.40 port 56521 ssh2
2507AUTH 'sshd'[19514]: error: Could not get shadow information for NOUSER
2508AUTH 'sshd'[19514]: Failed password for invalid user root from 222.35.92.40 port 56521 ssh2
2509AUTH 'sshd'[19515]: Connection closed by 222.35.92.40
2510AUTH 'sshd'[19516]: Invalid user root from 222.35.92.40
2511AUTH 'sshd'[19517]: input_userauth_request: invalid user root
2512AUTH 'sshd'[19516]: Failed none for invalid user root from 222.35.92.40 port 56582 ssh2
2513AUTH 'sshd'[19516]: error: Could not get shadow information for NOUSER
2514AUTH 'sshd'[19516]: Failed password for invalid user root from 222.35.92.40 port 56582 ssh2
2515AUTH 'sshd'[19517]: Connection closed by 222.35.92.40
2516AUTH 'sshd'[19518]: Invalid user root from 222.35.92.40
2517AUTH 'sshd'[19519]: input_userauth_request: invalid user root
2518AUTH 'sshd'[19518]: Failed none for invalid user root from 222.35.92.40 port 56645 ssh2
2519AUTH 'sshd'[19518]: error: Could not get shadow information for NOUSER
2520AUTH 'sshd'[19518]: Failed password for invalid user root from 222.35.92.40 port 56645 ssh2
2521AUTH 'sshd'[19519]: Connection closed by 222.35.92.40
2522AUTH 'sshd'[19520]: Invalid user root from 222.35.92.40
2523AUTH 'sshd'[19521]: input_userauth_request: invalid user root
2524AUTH 'sshd'[19520]: Failed none for invalid user root from 222.35.92.40 port 56778 ssh2
2525AUTH 'sshd'[19520]: error: Could not get shadow information for NOUSER
2526AUTH 'sshd'[19520]: Failed password for invalid user root from 222.35.92.40 port 56778 ssh2
2527AUTH 'sshd'[19521]: Connection closed by 222.35.92.40
2528AUTH 'sshd'[19522]: Invalid user root from 222.35.92.40
2529AUTH 'sshd'[19523]: input_userauth_request: invalid user root
2530AUTH 'sshd'[19522]: Failed none for invalid user root from 222.35.92.40 port 56832 ssh2
2531AUTH 'sshd'[19522]: error: Could not get shadow information for NOUSER
2532AUTH 'sshd'[19522]: Failed password for invalid user root from 222.35.92.40 port 56832 ssh2
2533AUTH 'sshd'[19523]: Connection closed by 222.35.92.40
2534AUTH 'sshd'[19524]: Invalid user root from 222.35.92.40
2535AUTH 'sshd'[19525]: input_userauth_request: invalid user root
2536AUTH 'sshd'[19524]: Failed none for invalid user root from 222.35.92.40 port 56892 ssh2
2537AUTH 'sshd'[19524]: error: Could not get shadow information for NOUSER
2538AUTH 'sshd'[19524]: Failed password for invalid user root from 222.35.92.40 port 56892 ssh2
2539AUTH 'sshd'[19525]: Connection closed by 222.35.92.40
2540AUTH 'sshd'[19526]: Invalid user root from 222.35.92.40
2541AUTH 'sshd'[19527]: input_userauth_request: invalid user root
2542AUTH 'sshd'[19526]: Failed none for invalid user root from 222.35.92.40 port 56955 ssh2
2543AUTH 'sshd'[19526]: error: Could not get shadow information for NOUSER
2544AUTH 'sshd'[19526]: Failed password for invalid user root from 222.35.92.40 port 56955 ssh2
2545AUTH 'sshd'[19527]: Connection closed by 222.35.92.40
2546AUTH 'sshd'[19528]: Invalid user root from 222.35.92.40
2547AUTH 'sshd'[19529]: input_userauth_request: invalid user root
2548AUTH 'sshd'[19528]: Failed none for invalid user root from 222.35.92.40 port 56974 ssh2
2549AUTH 'sshd'[19528]: error: Could not get shadow information for NOUSER
2550AUTH 'sshd'[19528]: Failed password for invalid user root from 222.35.92.40 port 56974 ssh2
2551AUTH 'sshd'[19529]: Connection closed by 222.35.92.40
2552AUTH 'sshd'[19530]: Invalid user root from 222.35.92.40
2553AUTH 'sshd'[19531]: input_userauth_request: invalid user root
2554AUTH 'sshd'[19530]: Failed none for invalid user root from 222.35.92.40 port 57017 ssh2
2555AUTH 'sshd'[19530]: error: Could not get shadow information for NOUSER
2556AUTH 'sshd'[19530]: Failed password for invalid user root from 222.35.92.40 port 57017 ssh2
2557AUTH 'sshd'[19531]: Connection closed by 222.35.92.40
2558AUTH 'sshd'[19532]: Invalid user root from 222.35.92.40
2559AUTH 'sshd'[19533]: input_userauth_request: invalid user root
2560AUTH 'sshd'[19532]: Failed none for invalid user root from 222.35.92.40 port 57081 ssh2
2561AUTH 'sshd'[19532]: error: Could not get shadow information for NOUSER
2562AUTH 'sshd'[19532]: Failed password for invalid user root from 222.35.92.40 port 57081 ssh2
2563AUTH 'sshd'[19533]: Connection closed by 222.35.92.40
2564AUTH 'sshd'[19534]: Invalid user root from 222.35.92.40
2565AUTH 'sshd'[19535]: input_userauth_request: invalid user root
2566AUTH 'sshd'[19534]: Failed none for invalid user root from 222.35.92.40 port 57142 ssh2
2567AUTH 'sshd'[19534]: error: Could not get shadow information for NOUSER
2568AUTH 'sshd'[19534]: Failed password for invalid user root from 222.35.92.40 port 57142 ssh2
2569AUTH 'sshd'[19535]: Connection closed by 222.35.92.40
2570AUTH 'sshd'[19537]: Invalid user root from 222.35.92.40
2571AUTH 'sshd'[19538]: input_userauth_request: invalid user root
2572AUTH 'sshd'[19537]: Failed none for invalid user root from 222.35.92.40 port 57210 ssh2
2573AUTH 'sshd'[19537]: error: Could not get shadow information for NOUSER
2574AUTH 'sshd'[19537]: Failed password for invalid user root from 222.35.92.40 port 57210 ssh2
2575AUTH 'sshd'[19538]: Connection closed by 222.35.92.40
2576AUTH 'sshd'[19539]: Invalid user root from 222.35.92.40
2577AUTH 'sshd'[19540]: input_userauth_request: invalid user root
2578AUTH 'sshd'[19539]: Failed none for invalid user root from 222.35.92.40 port 57267 ssh2
2579AUTH 'sshd'[19539]: error: Could not get shadow information for NOUSER
2580AUTH 'sshd'[19539]: Failed password for invalid user root from 222.35.92.40 port 57267 ssh2
2581AUTH 'sshd'[19540]: Connection closed by 222.35.92.40
2582AUTH 'sshd'[19541]: Invalid user root from 222.35.92.40
2583AUTH 'sshd'[19542]: input_userauth_request: invalid user root
2584AUTH 'sshd'[19541]: Failed none for invalid user root from 222.35.92.40 port 57351 ssh2
2585AUTH 'sshd'[19541]: error: Could not get shadow information for NOUSER
2586AUTH 'sshd'[19541]: Failed password for invalid user root from 222.35.92.40 port 57351 ssh2
2587AUTH 'sshd'[19542]: Connection closed by 222.35.92.40
2588AUTH 'sshd'[19543]: Invalid user root from 222.35.92.40
2589AUTH 'sshd'[19544]: input_userauth_request: invalid user root
2590AUTH 'sshd'[19543]: Failed none for invalid user root from 222.35.92.40 port 57392 ssh2
2591AUTH 'sshd'[19543]: error: Could not get shadow information for NOUSER
2592AUTH 'sshd'[19543]: Failed password for invalid user root from 222.35.92.40 port 57392 ssh2
2593AUTH 'sshd'[19544]: Connection closed by 222.35.92.40
2594AUTH 'sshd'[19545]: Invalid user root from 222.35.92.40
2595AUTH 'sshd'[19546]: input_userauth_request: invalid user root
2596AUTH 'sshd'[19545]: Failed none for invalid user root from 222.35.92.40 port 57477 ssh2
2597AUTH 'sshd'[19545]: error: Could not get shadow information for NOUSER
2598AUTH 'sshd'[19545]: Failed password for invalid user root from 222.35.92.40 port 57477 ssh2
2599AUTH 'sshd'[19546]: Connection closed by 222.35.92.40
2600AUTH 'sshd'[19547]: Invalid user root from 222.35.92.40
2601AUTH 'sshd'[19548]: input_userauth_request: invalid user root
2602AUTH 'sshd'[19547]: Failed none for invalid user root from 222.35.92.40 port 57513 ssh2
2603AUTH 'sshd'[19547]: error: Could not get shadow information for NOUSER
2604AUTH 'sshd'[19547]: Failed password for invalid user root from 222.35.92.40 port 57513 ssh2
2605AUTH 'sshd'[19548]: Connection closed by 222.35.92.40
2606AUTH 'sshd'[19549]: Invalid user root from 222.35.92.40
2607AUTH 'sshd'[19550]: input_userauth_request: invalid user root
2608AUTH 'sshd'[19549]: Failed none for invalid user root from 222.35.92.40 port 57544 ssh2
2609AUTH 'sshd'[19549]: error: Could not get shadow information for NOUSER
2610AUTH 'sshd'[19549]: Failed password for invalid user root from 222.35.92.40 port 57544 ssh2
2611AUTH 'sshd'[19550]: Connection closed by 222.35.92.40
2612AUTH 'sshd'[19551]: Invalid user root from 222.35.92.40
2613AUTH 'sshd'[19552]: input_userauth_request: invalid user root
2614AUTH 'sshd'[19551]: Failed none for invalid user root from 222.35.92.40 port 57606 ssh2
2615AUTH 'sshd'[19551]: error: Could not get shadow information for NOUSER
2616AUTH 'sshd'[19551]: Failed password for invalid user root from 222.35.92.40 port 57606 ssh2
2617AUTH 'sshd'[19552]: Connection closed by 222.35.92.40
2618AUTH 'sshd'[19553]: Invalid user root from 222.35.92.40
2619AUTH 'sshd'[19554]: input_userauth_request: invalid user root
2620AUTH 'sshd'[19553]: Failed none for invalid user root from 222.35.92.40 port 57668 ssh2
2621AUTH 'sshd'[19553]: error: Could not get shadow information for NOUSER
2622AUTH 'sshd'[19553]: Failed password for invalid user root from 222.35.92.40 port 57668 ssh2
2623AUTH 'sshd'[19554]: Connection closed by 222.35.92.40
2624KERN: Last message repeated 2 times.
2625USER: Throwing: "Extension `OptionalPackageDescription' is too long" at Sources/CLanguageInterface.cpp:79
2626KERN: Last message repeated 2 times.
2627Last message repeated 1 time
2628KERN: heap_add_area: area 337851 added to medium heap 0x819a2000 - usable range 0xf0c01000 - 0xf1000000
2629USER: Throwing: "Extension `OptionalPackageDescription' is too long" at Sources/CLanguageInterface.cpp:79
2630KERN: bfs: bfs_read_link:1476: Invalid Argument
2631Last message repeated 1 time
2632KERN: Last message repeated 2 times.
2633Last message repeated 1 time
2634KERN: 217: DEBUGGER: Could not create BWindow's receive port, used for interacting with the app_server!
2635KERN: _user_debugger(): Failed to install debugger. Message is: `Could not create BWindow's receive port, used for interacting with the app_server!'
2636KERN: thread_hit_debug_event(): Failed to create debug port: No more ports available
2637KERN: 28515: DEBUGGER: Could not create BWindow's receive port, used for interacting with the app_server!
2638KERN: _user_debugger(): Failed to install debugger. Message is: `Could not create BWindow's receive port, used for interacting with the app_server!'
2639KERN: thread_hit_debug_event(): Failed to create debug port: No more ports available
2640KERN: 28627: DEBUGGER: Could not create BWindow's receive port, used for interacting with the app_server!
2641KERN: _user_debugger(): Failed to install debugger. Message is: `Could not create BWindow's receive port, used for interacting with the app_server!'
2642KERN: thread_hit_debug_event(): Failed to create debug port: No more ports available
2643KERN: 28628: DEBUGGER: Could not create BWindow's receive port, used for interacting with the app_server!
2644KERN: _user_debugger(): Failed to install debugger. Message is: `Could not create BWindow's receive port, used for interacting with the app_server!'
2645KERN: thread_hit_debug_event(): Failed to create debug port: No more ports available
2646