Opened 4 months ago

#15286 new bug

POSIX testsuite time_h interface failures

Reported by: cocobean Owned by: nobody
Priority: normal Milestone: Unscheduled
Component: System/POSIX Version: R1/Development
Keywords: posix Cc:
Blocked By: Blocking:
Has a Patch: no Platform: All

Description

Ref: ​​​https://github.com/haiku/open_posix_testsuite

Open POSIX Testsuite 1.5.2 on Haiku hrev53379

Issue: time_h interface test failures

conformance/definitions/time_h/10-1: build: FAILED 
conformance/definitions/time_h/11-1: build: FAILED 
conformance/definitions/time_h/12-1: build: FAILED 
conformance/definitions/time_h/13-1: build: FAILED 
conformance/definitions/time_h/14-1: build: FAILED 
conformance/definitions/time_h/15-1: build: FAILED 
conformance/definitions/time_h/16-1: build: FAILED 
conformance/definitions/time_h/17-1: build: FAILED 
conformance/definitions/time_h/18-1: build: FAILED 
conformance/definitions/time_h/19-1: build: FAILED 
conformance/definitions/time_h/2-1: build: FAILED 
conformance/definitions/time_h/20-1: build: FAILED 
conformance/definitions/time_h/21-1: build: FAILED 
conformance/definitions/time_h/22-1: build: FAILED 
conformance/definitions/time_h/23-1: build: FAILED 
conformance/definitions/time_h/24-1: build: FAILED 
conformance/definitions/time_h/25-1: build: FAILED 
conformance/definitions/time_h/26-1: build: FAILED 
conformance/definitions/time_h/27-1: build: FAILED 
conformance/definitions/time_h/28-1: build: FAILED 
conformance/definitions/time_h/29-1: build: FAILED 
conformance/definitions/time_h/30-1: build: FAILED 
conformance/definitions/time_h/31-1: build: FAILED 
conformance/definitions/time_h/32-1: build: FAILED 
conformance/definitions/time_h/33-1: build: FAILED 
conformance/definitions/time_h/34-1: build: FAILED 
conformance/definitions/time_h/35-1: build: FAILED 
conformance/definitions/time_h/35-2: build: FAILED 
conformance/definitions/time_h/4-1: build: FAILED 
conformance/definitions/time_h/5-1: build: FAILED 
conformance/definitions/time_h/8-1: build: FAILED 
conformance/definitions/time_h/9-1: build: FAILED

Change History (0)

Note: See TracTickets for help on using tickets.