Opened 4 months ago

Last modified 4 months ago

#15272 new bug

POSIX sem test failures

Reported by: cocobean Owned by: nobody
Priority: normal Milestone: Unscheduled
Component: System/POSIX Version: R1/Development
Keywords: Cc:
Blocked By: Blocking: #15273, #15274, #15275, #15276, #15277, #15278, #15279
Has a Patch: no Platform: All

Description (last modified by waddlesplash)

Various POSIX semaphore API tests from the Open POSIX Testsuite fail, including some for sem_init, sem_open, sem_unlink, sem_post, and sem_timedwait.

Change History (9)

comment:1 by waddlesplash, 4 months ago

Description: modified (diff)
Summary: sem_unlink 3-1 posix tests failsPOSIX sem test failures

comment:2 by waddlesplash, 4 months ago

Blocking: 15273 added

comment:3 by waddlesplash, 4 months ago

Blocking: 15274 added

comment:4 by waddlesplash, 4 months ago

Blocking: 15275 added

comment:5 by waddlesplash, 4 months ago

Blocking: 15276 added

comment:6 by waddlesplash, 4 months ago

Blocking: 15277 added

comment:7 by waddlesplash, 4 months ago

Blocking: 15278 added

comment:8 by waddlesplash, 4 months ago

Blocking: 15279 added

comment:9 by cocobean, 4 months ago

conformance/interfaces/sem_init/7-1: execution: FAILED 
conformance/interfaces/sem_timedwait/6-1: execution: FAILED 
conformance/interfaces/sem_timedwait/6-2: execution: FAILED 
conformance/interfaces/sem_unlink/3-1: execution: FAILED 
conformance/interfaces/sem_unlink/5-1: execution: FAILED 
Last edited 4 months ago by cocobean (previous) (diff)
Note: See TracTickets for help on using tickets.