Opened 4 months ago

#15280 new enhancement

POSIX mem test failures and hangs

Reported by: cocobean Owned by: nobody
Priority: normal Milestone: Unscheduled
Component: System/POSIX Version: R1/Development
Keywords: posix Cc:
Blocked By: Blocking:
Has a Patch: no Platform: All

Description

open_posix_testsuite 1.5.2 MEM conformance interfaces test. List here for completion and Haiku POSIX enhancements.

Ref: https://github.com/haiku/open_posix_testsuite/tree/from_haiku_trunk/conformance/interfaces

conformance/interfaces/mlock/10-1: build: FAILED 
conformance/interfaces/mlock/5-1: build: FAILED 
conformance/interfaces/mlock/8-1: build: FAILED 
conformance/interfaces/mlock/speculative/12-1: build: FAILED 
conformance/interfaces/mlock/10-1: build: FAILED 
conformance/interfaces/mlock/5-1: build: FAILED 
conformance/interfaces/mlock/8-1: build: FAILED 
conformance/interfaces/mlock/speculative/12-1: build: FAILED 
conformance/interfaces/mlockall/13-1: build: FAILED 
conformance/interfaces/mlockall/13-2: build: FAILED 
conformance/interfaces/mlockall/3-6: build: FAILED 
conformance/interfaces/mlockall/3-7: build: FAILED 
conformance/interfaces/mlockall/8-1: build: FAILED 
conformance/interfaces/mlockall/speculative/15-1: build: FAILED 
conformance/interfaces/mlockall/13-1: build: FAILED 
conformance/interfaces/mlockall/13-2: build: FAILED 
conformance/interfaces/mlockall/3-6: build: FAILED 
conformance/interfaces/mlockall/3-7: build: FAILED 
conformance/interfaces/mlockall/8-1: build: FAILED 
conformance/interfaces/mlockall/speculative/15-1: build: FAILED 
conformance/interfaces/munlock/10-1: build: FAILED 
conformance/interfaces/munlock/11-1: build: FAILED 
conformance/interfaces/munlock/7-1: build: FAILED 
conformance/interfaces/munlock/10-1: build: FAILED 
conformance/interfaces/munlock/11-1: build: FAILED 
conformance/interfaces/munlock/7-1: build: FAILED 
conformance/interfaces/mmap/18-1: build: FAILED 
conformance/interfaces/mmap/27-1: build: FAILED 
conformance/interfaces/mmap/11-4: execution: FAILED 
conformance/interfaces/mmap/11-5: execution: FAILED 
conformance/interfaces/mmap/14-1: execution: FAILED 
conformance/interfaces/mmap/18-1: build: FAILED 
conformance/interfaces/mmap/23-1: execution: FAILED 
conformance/interfaces/mmap/24-2: execution: FAILED 
conformance/interfaces/mmap/27-1: build: FAILED 
conformance/interfaces/mmap/28-1: execution: FAILED 
conformance/interfaces/mmap/31-1: execution: FAILED 
conformance/interfaces/shm_open/11-1: execution: FAILED 
conformance/interfaces/shm_open/13-1: execution: FAILED 
conformance/interfaces/shm_open/20-1: execution: FAILED 
conformance/interfaces/shm_open/32-1: execution: FAILED 
conformance/interfaces/shm_open/34-1: execution: FAILED 
conformance/interfaces/shm_open/37-1: execution: FAILED 

conformance/interfaces/mmap/24-1: execution: HUNG 

Change History (0)

Note: See TracTickets for help on using tickets.