Opened 22 months ago

Closed 9 months ago

#15281 closed bug (fixed)

POSIX sig test failures

Reported by: cocobean Owned by: nobody
Priority: normal Milestone: Unscheduled
Component: System/POSIX Version: R1/Development
Keywords: posix Cc:
Blocked By: Blocking:
Platform: All

Description

open_posix_testsuite 1.5.2 SIG test failures and hangs

Ref: https://github.com/haiku/open_posix_testsuite

NOTE: issues with pthread and sigwait

conformance/interfaces/sigprocmask/17-core-buildonly: build: FAILED 
conformance/interfaces/sigprocmask/17-1: execution: FAILED 
conformance/interfaces/sigprocmask/17-2: execution: FAILED 
conformance/interfaces/sigprocmask/17-3: execution: FAILED 
conformance/interfaces/sigprocmask/17-4: execution: FAILED
 
conformance/interfaces/pthread_kill/6-1: execution: FAILED 

conformance/interfaces/sigwait/6-1: execution: HUNG 

Change History (3)

comment:1 by cocobean, 22 months ago

Last edited 22 months ago by cocobean (previous) (diff)

comment:2 by cocobean, 9 months ago

UPDATE: Tested on hrev54605. PASSED all POSIX SIG tests!! Please close ticket.

comment:3 by pulkomandy, 9 months ago

Resolution: fixed
Status: newclosed
Note: See TracTickets for help on using tickets.